Discussion:
103 messages from Google Code
(too old to reply)
c***@googlecode.com
2010-12-03 17:25:21 UTC
Permalink
Your project notifications generated too many emails to send
individually. Here are the subject lines of the emails you would have
received:

Issue 65277 in chromium: "browse for file" dialog box appears twice instead
of once when trying to upload a file to any site
Re: Issue 62940 in chromium: InstantTest.OnSubmitEvent flakily exceeds test
timeout
Issue 65279 in chromium: Layout Test fast/css/visited-link-hang.html is
flaky
Issue 65278 in chromium: Possible data race on X-ErrorHandler
Re: Issue 65279 in chromium: Layout Test fast/css/visited-link-hang.html is
flaky
Re: Issue 64809 in chromium: Trying to add a file through windows native
dialog box pops up the dialog again
Re: Issue 65277 in chromium: "browse for file" dialog box appears twice
instead of once when trying to upload a file to any site
Re: Issue 64535 in chromium: html5 videos was not play
Re: Issue 65154 in chromium: Google Chrome crashes on open, no error or
crash report.
Re: Issue 2105 in chromium: really, really slow screen redraws
Re: Issue 65154 in chromium: Google Chrome crashes on open, no error or
crash report.
Re: Issue 65154 in chromium: Google Chrome crashes on open, no error or
crash report.
Re: Issue 65060 in chromium: crash on Linux startup due to optional missing
shared library libGLESv2.so
Issue 65280 in chromium: NO SOUND
Issue 65281 in chromium: Double-click on a link in chrome developer
tools/network doesn't open the link in a new tab
Re: Issue 65281 in chromium: Double-click on a link in chrome developer
tools/network doesn't open the link in a new tab
Re: Issue 37028 in chromium: Attach sRGB to untagged images instead of
monitor profile (wide gamut monitor problems with Mac OSX)
Issue 65282 in chromium: Pages with dynamically rendered contents do not
work
Issue 65284 in chromium: Pages with dynamically rendered contents do not
work
Re: Issue 64498 in chromium: Aw, Snap window appears on the certain page on
the Internet
Re: Issue 65284 in chromium: Pages with dynamically rendered contents do
not work
Re: Issue 65282 in chromium: Pages with dynamically rendered contents do
not work
Issue 65285 in chromium: Open all bookmarks in new+incognito window broken
Re: Issue 48946 in chromium: Chrome ignores CR entity (&#013;) within <PRE>
block
Re: Issue 65282 in chromium: Pages with dynamically rendered contents do
not work
Issue 65286 in chromium: Keyboard controls not working in internal PDF
viever in Chrome 8
Re: Issue 48946 in chromium: Chrome ignores CR entity (&#013;) within <PRE>
block
Re: Issue 59315 in chromium: Hangs, then crashes in Wikimedia Commons
(displaying an images gallery in the multilingual "Nature" category)
Re: Issue 20976 in chromium: Error 101 (net::ERR_CONNECTION_RESET): Error
desconocido
Re: Issue 62937 in chromium: FindInPageTest.PrepopulateRespectBlank flakily
exceeds test timeout
Re: Issue 60038 in chromium: Citibank website, loads then goes completely
blank
Re: Issue 64202 in chromium: Presubmit check for ceee/smoke_test.bat having
been run seems to be broken.
Re: Issue 59315 in chromium: Hangs, then crashes in Wikimedia Commons
(displaying an images gallery in the multilingual "Nature" category)
Re: Issue 7328 in chromium: add "release notes" button in "about google
chrome"
Re: Issue 39947 in chromium: Quick/ChangJie IME doesn't work well in
omnibox (Windows 7 Only)
Re: Issue 62960 in chromium: Possible cross-site vulnerability using
Hotmail with SSL (?)
Re: Issue 8022 in chromium: Add address bar and other controls to full
screen mode
Re: Issue 63802 in chromium: Chrome crashes immediately on Ubuntu 10.10
Issue 65287 in chromium: Chromium does not render devanagari (Hindi)
unicode text correctly.
Re: Issue 61841 in chromium: CitiBank account site renders blank.
Re: Issue 65044 in chromium: Page not displaying while blocking all 3rd
cookies
Re: Issue 62076 in chromium: Java Applets using an <object> with a classid
paramater don't load
Issue 65288 in chromium: Unknown symbols in popup menu
Re: Issue 62369 in chromium: Page info bubble animation is ugly
Re: Issue 64932 in chromium: Put NTP app shortcut menu option in its own
section
Re: Issue 65051 in chromium: 9.0.597.0 crash!
Re: Issue 64841 in chromium: Disable WebGL for extension background pages
Re: Issue 1373 in chromium: Navigating dark background websites results in
blinding white flashes between pages.
Issue 65289 in chromium: Email list about options object issues
Re: Issue 65289 in chromium: Email list about options object issues
Re: Issue 65060 in chromium: crash on Linux startup due to optional missing
shared library libGLESv2.so
Re: Issue 65060 in chromium: crash on Linux startup due to optional missing
shared library libGLESv2.so
Issue 65290 in chromium: Need a policy to lock down the default browser
Re: Issue 65227 in chromium: "Attach a File" file upload boxes do not work.
Issue 65291 in chromium: WebGL fails for ATI Radeon X600 (XID collision)
Issue 65292 in chromium: Chrome unable to release messages from Micorsoft
Forefront Online
Re: Issue 65282 in chromium: Pages with dynamically rendered contents do
not work
Issue 65293 in chromium: Canary printing doesn't print and needs ability to
set defaults (which destination, (color yes/no), ...) 9.0.597.4
Re: Issue 65283 in chromium: Pages with dynamically rendered contents do
not work
Re: Issue 65288 in chromium: Unknown symbols in popup menu
Issue 65294 in chromium: DCHECK that we are starting metrics service in the
wrong thread...
Issue 65295 in chromium: DCHECK in Chrome Frame URLmon only when CEEE is
enabled
Re: Issue 65268 in chromium: Page does not load when clicking on a link
(reload necessary to open the referenced page)
Re: Issue 44731 in chromium: Bookmark manager keeps disorganizing my
bookmarks
Issue 65296 in chromium: Chrome always crash everytime i type word "wrong"
Re: Issue 65285 in chromium: Open all bookmarks in new+incognito window
broken
Issue 65297 in chromium: Problem with file uploads to MoinMoin 1.9.3
Issue 65298 in chromium: Move Singleton<T> pattern usage from the caller to
the singleton class.
Re: Issue 65294 in chromium: DCHECK that we are starting metrics service in
the wrong thread...
Re: Issue 65295 in chromium: DCHECK in Chrome Frame URLmon only when CEEE
is enabled
Re: Issue 64250 in chromium: Active highlight disappears when word contains
repeated search term
Re: Issue 63016 in chromium: Live wallpaper themes
Issue 65300 in chromium: urls inconsistently go to https or http
Re: Issue 65137 in chromium: Disable extensions is partially broken on
Trunk.
Re: Issue 64760 in chromium: Chrome blocking third party assets delivered
through SSL
Re: Issue 64841 in chromium: Disable WebGL for extension background pages
Issue 65301 in chromium: Website content gone
Issue 65302 in chromium: developer tools - css uneditable
Issue 65303 in chromium: Failed to create a tab in current window when a
new window is being initialized.
Issue 65304 in chromium: Minor wording change "Show in incognito"
-> "Enable in incognito"
Issue 65305 in chromium: Cannot Save PDF with Internal Viewer
Issue 65306 in chromium: IndexedDB returns the wrong exception codes
Re: Issue 65303 in chromium: Failed to create a tab in current window when
a new window is being initialized.
Re: Issue 64362 in chromium: CEEE default window ID for chrome.tabs APIs
should be the current window.
Issue 65307 in chromium: ViewProp should take a template-ized view type
Re: Issue 48409 in chromium: Inline autocompletion not always selected
Re: Issue 60922 in chromium: Chrome + Adblock causes high RAM usage and
crash when playing Mafia Wars
Re: Issue 65305 in chromium: Cannot Save PDF with Internal Viewer
Issue 65308 in chromium: Suggestions overlap google results when Instant is
enabled
Issue 65309 in chromium: chrome://favicon/* fails URLPattern validation in
GetGrantedPermissions
Issue 65310 in chromium: Not a Bug, improvement instead, enlarge download
buffer
Re: Issue 65309 in chromium: chrome://favicon/* fails URLPattern validation
in GetGrantedPermissions
Re: Issue 4190 in chromium: Can't upload images for Yahoo blogs Taiwan
Issue 65311 in chromium: Scrolling (horizontal and vertical) not working in
Google Spreadsheets
Re: Issue 36424 in chromium: Security: URL Phishing with unicode
U2028,U2029 chars
Re: Issue 42141 in chromium: Flash Audio playing 3x faster than normal
Re: Issue 43821 in chromium: Website video not playing on Internal Adobe
flash player (Shockwave Flash 10.1 r53) on OpenSuse 11.2 linux
Re: Issue 4191 in chromium: Rich text editor on http://www.wretch.cc
doesn't work
Re: Issue 45051 in chromium: can't type filenames with backslash (\) in
them in the omnibox
Re: Issue 4660 in chromium: Chrome does not always open properly when
starting it from a link clicked
Re: Issue 65297 in chromium: Problem with file uploads to MoinMoin 1.9.3
Re: Issue 5098 in chromium: Opening text files in Chrome wraps text rather
than scrolling horizontally
Re: Issue 10571 in chromium: Windows layout test regressions form webkit
merge 42244:42287
--
Automated mail from issue updates at http://crbug.com/
Subscription options: http://groups.google.com/a/chromium.org/group/chromium-bugs
c***@googlecode.com
2010-12-03 23:30:29 UTC
Permalink
Your project notifications generated too many emails to send
individually. Here are the subject lines of the emails you would have
received:

Issue 65354 in chromium: Missing version info in chrome frame executables
Issue 65355 in chromium: Receiving SSL connection error.107, after updating
from Chrome 7.0x to 8.0.552.215
Issue 65356 in chromium: PDF plugin does not honor selection
Re: Issue 64901 in chromium: The refresh of the form doesn't work well
Re: Issue 64841 in chromium: Re-enable WebGL for extension background pages
Re: Issue 61370 in chromium: REGRESSION: extension dropdowns have wrong
width / too narrow
Re: Issue 65099 in chromium: GPU Accelerated Canvas 2D enabled crashes
twitter.com
Issue 65357 in chromium: PDF plugin doesn't support double-click + drag
selection
Re: Issue 65217 in chromium: DCHECK in PassiveLogCollector
Re: Issue 33074 in chromium: Remove "open frame in new xxx" context menu
options
Issue 65358 in chromium: SSL: Timeout connecting to vibe.novell.com
Issue 65359 in chromium: Build dependency flakiness on Windows for RC files
that #include stuff that changes
Issue 65361 in chromium: .. ist implemented in both ...chrome
helper.app...google framework and google chrome.app...google framework
Issue 65360 in chromium: bad rendering of a page
Re: Issue 25741 in chromium: scrolling jank in gmail
Re: Issue 65339 in chromium: Detect when internal PDF viewer is unable to
display the PDF, and offer to use Reader
Re: Issue 65083 in chromium: Extension crash
Re: Issue 64849 in chromium: Chrome: Crash Report - Stack Signature:
RenderWidgetHost::OnMsgDidActivateAcceleratedCompositing(bool)-B2D4E3
Re: Issue 64849 in chromium: Chrome: Crash Report - Stack Signature:
RenderWidgetHost::OnMsgDidActivateAcceleratedCompositing(bool)-B2D4E3
Re: Issue 65164 in chromium: Extension causing crash
Re: Issue 65137 in chromium: Disable extensions still loads all the
extensions.
Issue 65362 in chromium: Crash in ExternalPopupMenu::DidSelectItem
Re: Issue 38546 in chromium: data: URLs not handled correctly
Re: Issue 61997 in chromium: Renderer crashes in ExternalPopupMenu on Mac.
Re: Issue 65342 in chromium: Can't recover download link if link address is
long
Re: Issue 65137 in chromium: Disable extensions still loads all the
extensions.
Issue 65363 in chromium: Segmentation Fault - x64 Ubuntu 10.10 :-(
Re: Issue 63904 in chromium: Regression: Uninstall survey does not include
uninstall metrics
Re: Issue 61383 in chromium: Ensure version lock between all loaded Chrome
Frame instances in a logon session.
Re: Issue 61873 in chromium: Fetch configuration policy from a centralized
server
Issue 65364 in chromium: Attempting to inspect
Re: Issue 65364 in chromium: Attempting to inspect
Re: Issue 62451 in chromium: Regression - Style issues (margin definition
issues, I think)
Re: Issue 64655 in chromium: Chrome: Crash Report - Stack Signature:
GpuWatchdogThread::OnExit()-bc995220_98772dfb_ac0ce082_1b1a43e9_8949e7e7
Re: Issue 64004 in chromium: Internal Flash player v10.1.103.20 unable to
load Restaurant City on Facebook
Re: Issue 65082 in chromium: Extensions cause Chrome to Crash After Upgrade
to 9.0.597.0 dev (Windows)
Re: Issue 64849 in chromium: Chrome: Crash Report - Stack Signature:
RenderWidgetHost::OnMsgDidActivateAcceleratedCompositing(bool)-B2D4E3
Re: Issue 64483 in chromium: crash when inspecting element on a page with
content script injected CSS
Issue 65365 in chromium: PDF file fails to enlarge more than 6 times
Re: Issue 64849 in chromium: Chrome: Crash Report - Stack Signature:
RenderWidgetHost::OnMsgDidActivateAcceleratedCompositing(bool)-B2D4E3
Re: Issue 65051 in chromium: 9.0.597.0 crash!
Re: Issue 65364 in chromium: Attempting to inspect
Re: Issue 65364 in chromium: Attempting to inspect
Re: Issue 62451 in chromium: Regression - Style issues (margin definition
issues, I think)
Re: Issue 65021 in chromium: Chrome Dev 9.0.597.0 Gmail Problem~
Re: Issue 64849 in chromium: Chrome: Crash Report - Stack Signature:
RenderWidgetHost::OnMsgDidActivateAcceleratedCompositing(bool)-B2D4E3
Re: Issue 65364 in chromium: Attempting to inspect
Re: Issue 53508 in chromium: New popup blocked UI for Mac
Re: Issue 62755 in chromium: ChromeFrame: Crash in browser process
Re: Issue 65137 in chromium: Disable extensions still loads all the
extensions.
Re: Issue 64444 in chromium: Random crashes of tab when opening developer
tools
Re: Issue 63986 in chromium: Renderer crash when opening inspector @
WebCore::CSSStyleSheet::CSSStyleSheet(WebCore::Node *,WTF::String const
&,WebCore::KURL const &,WTF::String const &)
Re: Issue 53508 in chromium: New popup blocked UI for Mac
Issue 65366 in chromium: Google MyMap loads much more slowly in Chrome
(1.8m) than Firefox (< 5s)
Re: Issue 64834 in chromium: Check Failure in ScopedProp()
Re: Issue 63731 in chromium: Some greyscale images are stretched in x
direction.
Issue 65367 in chromium: Default search engine is set to google.nl and
cannot be changed
Re: Issue 65151 in chromium: Use _GLIBCXX_DEBUG in Debug builds for better
checking
Re: Issue 62859 in chromium: IsDefaultSearchProvider and
SetDefaultSearchProvider methods
Re: Issue 57000 in chromium: Images failing to upload on www.imageshack.us
Re: Issue 62755 in chromium: ChromeFrame: Crash in browser process
Issue 65368 in chromium: Chrome: Crash Report - Stack Signature:
Browser::ConvertContentsToApplication(TabContents
*)-4b12c4dc_61c504ed_2ae5c38c_c3b453c9_5961400d
Re: Issue 64246 in chromium: Support speculative preconnect requests for
more than one connection
Re: Issue 64268 in chromium: Click a bookmark very fast for ~10 times will
result in a "Aw, Snap!" page.
Re: Issue 65342 in chromium: Can't recover download link if link address is
long
Re: Issue 61281 in chromium: Add redundancy to detect in-memory corruption
of histograms
Re: Issue 29067 in chromium: Provide a way to remove crashing extensions
Re: Issue 65362 in chromium: Crash in ExternalPopupMenu::DidSelectItem
Re: Issue 62755 in chromium: ChromeFrame: Crash in browser process
Re: Issue 65184 in chromium: browser crashes when typing extension keyword
in incognito mode if extension is disabled
Re: Issue 63684 in chromium: webkit/glue/plugins should not depend on
ppapi_proxy
Re: Issue 65262 in chromium: broken handling of percent character in
RFC5987-encoded parameters
Issue 65369 in chromium: getting experimental-webgl context freezes tab
Re: Issue 46306 in chromium: gpu/pgl/command_buffer_pepper.cc out of sync
with npapi/binding/npapi_extentions.h
Re: Issue 62755 in chromium: ChromeFrame: Crash in browser process
Re: Issue 65305 in chromium: Cannot Save PDF with Internal Viewer
Re: Issue 50285 in chromium: PDF in frame issue - no save or print option
in right-click context menu
Issue 65370 in chromium: Sync: about:sync crashes the browser when
credentials expire or change
Issue 65371 in chromium: chrome.windows.update(windowId, {'focused': true})
on a maximized window on Windows causes it to unmaximize
Re: Issue 55698 in chromium: Fedora 13: GPU rendering is not working
Issue 65372 in chromium: svg elements are broken if created using
createElementNS
Re: Issue 62755 in chromium: ChromeFrame: Crash in browser process
Re: Issue 62546 in chromium: Sync - logging in with blank passphrases
crashes Chrome
Re: Issue 65372 in chromium: svg elements are broken if created using
createElementNS
Re: Issue 62755 in chromium: ChromeFrame: Crash in browser process
Re: Issue 65371 in chromium: chrome.windows.update(windowId, {'focused':
true}) on a maximized window on Windows causes it to unmaximize
Re: Issue 65372 in chromium: svg elements are broken if created using
createElementNS
Re: Issue 61713 in chromium: Sync Issues
Issue 65373 in chromium: Headers are duplicated in the devtools
Issue 65374 in chromium: QuickTime plugin does not work under certain
conditions while 8.0.552.5 dev works fine
Re: Issue 56087 in chromium: Harware rendering in linux doesnt work
Re: Issue 62755 in chromium: ChromeFrame: Crash in browser process
Re: Issue 65373 in chromium: Headers are duplicated in the devtools
Issue 65375 in chromium: Omnibox hogs the focus when creating a new tab and
switching back to the previous one quickly.
Re: Issue 56087 in chromium: Harware rendering in linux doesnt work
Issue 65376 in chromium: pages don't render first time on
http://www.apple.com/
Re: Issue 62755 in chromium: ChromeFrame: Crash in browser process
Re: Issue 62755 in chromium: ChromeFrame: Crash in browser process
Re: Issue 63071 in chromium: Built-in PDF reader zoom feature zooms all
frames if PDF is in i-frame
Re: Issue 64170 in chromium: Dispaying a PDF inside an iframe causes
automatic zoom out
Re: Issue 64944 in chromium: PDF Rendering in iframe - zoom out bug
Re: Issue 65373 in chromium: Headers are duplicated in the devtools
Re: Issue 65373 in chromium: Headers are duplicated in the devtools
--
Automated mail from issue updates at http://crbug.com/
Subscription options: http://groups.google.com/a/chromium.org/group/chromium-bugs
c***@googlecode.com
2010-12-06 20:13:14 UTC
Permalink
Your project notifications generated too many emails to send
individually. Here are the subject lines of the emails you would have
received:

Re: Issue 31526 in chromium: extensions option page isn't listed in the
chrome task manager
Re: Issue 65446 in chromium: Please implement form submit in internal PDF
viewer.
Re: Issue 35928 in chromium: JSON.parse and eval cause full screen paint
Re: Issue 36733 in chromium: Textarea overflow-y:hidden causes word-wrap
issues
Re: Issue 36428 in chromium: Scroll position is lost after hide/show element
Re: Issue 65395 in chromium: Chrome PDF Viewer plugin shrinks PDF and
entire surrounding page
Re: Issue 65524 in chromium: Web page shrinking
Re: Issue 65395 in chromium: Chrome PDF Viewer plugin shrinks PDF and
entire surrounding page
Re: Issue 65327 in chromium: Layered PDFs with transparency render on
screen, but do not print with transparency.
Re: Issue 65286 in chromium: Keyboard controls not working in internal PDF
viever in Chrome 8
Re: Issue 26723 in chromium: Mouse cursor doesn't change when mouse-idling
Re: Issue 65471 in chromium: Have to click twice on click-to-play
placeholders
Re: Issue 65576 in chromium: Flash plugin crash starting from version
9.0.587.0
Re: Issue 64809 in chromium: Trying to add a file through windows native
dialog box pops up the dialog again
Re: Issue 65634 in chromium: Upload requires user to select file twice
Re: Issue 40378 in chromium: Soft hyphens should be ignored when copying
text
Re: Issue 65429 in chromium: SSL 2.0 is not enabled
Re: Issue 65553 in chromium: pdf plugin: problem with umlaut's on input
fields
Re: Issue 42377 in chromium: Text input causes intermittent freezing.
Re: Issue 65356 in chromium: PDF plugin does not honor selection
Re: Issue 65035 in chromium: Flash plugin gcswf32.dll will not load on pages
Re: Issue 65357 in chromium: PDF plugin doesn't support double-click + drag
selection
Re: Issue 60253 in chromium: Regression: Mac Chrome 7 extension page action
icon dimensions are wrong => blurry icon
Issue 65639 in chromium: Printing AA Boarding Pass crashes browser
Issue 65640 in chromium: Object #<an HTMLObjectElement> has no
method 'create'
Re: Issue 65325 in chromium: Google Chrome helper crashing
Re: Issue 46931 in chromium: CSS small-caps doesn't work with @font-face
Re: Issue 48063 in chromium: Memory leak on page with refresh
Re: Issue 48368 in chromium: readAsDataURL outputs malformed data URL when
file type isn't known
Re: Issue 65375 in chromium: Omnibox hogs the focus when creating a new tab
and switching back to the previous one quickly.
Re: Issue 65482 in chromium: Inbuilt support for djvu files
Re: Issue 65390 in chromium: PDF viewer in 8.0 does not recognize some
clicks properly
Re: Issue 48693 in chromium: V8 assert -
ASSERT(reinterpret_cast<Address>(*location_) != kHandleZapValue);
Re: Issue 49468 in chromium: Implement The Capture API
Re: Issue 65398 in chromium: Decide if we want to disable webgl on mac10.5
Re: Issue 51006 in chromium:
[http://www.permanente.net/homepage/kaiser/doctor/judithkeddington/]:
Website Display issue
Re: Issue 65464 in chromium: Right-arrow doesn't move cursor to end of
omnibox Instant suggestion (differs from google.com behavior)
Re: Issue 65537 in chromium: "Look Up in Dictionary" context menu item
doesn't honor Dictionary.app's "Contextual Menu:" setting
Re: Issue 65475 in chromium: status-bubble extremely annoying
Re: Issue 60253 in chromium: Regression: Mac Chrome 7 extension page action
icon dimensions are wrong => blurry icon
Re: Issue 65315 in chromium: Can't see video from the CA DOT site
Re: Issue 51166 in chromium: checkbox doesn't activates from keyboard
Re: Issue 65244 in chromium: Scroll position of PDF page is not remembered
Re: Issue 51270 in chromium: No favicon when viewing local pages
Re: Issue 65621 in chromium: The NewTabPage does not load the previews of
the most visited sites
Re: Issue 65457 in chromium: flash audio is choppy on linux 64 bit
Re: Issue 65511 in chromium: segfault when scrolling
Re: Issue 59215 in chromium: Renderer crash on pan and zoom of an image
sometimes @ skia::`anonymous namespace'::ConvolveVertically<0>(short const
*,int,unsigned char * const *,int,unsigned char *)
Re: Issue 64897 in chromium: Problems with Nagios Checker extensio window
visualization.
Re: Issue 52053 in chromium: Uncaught Error: HIERARCHY_REQUEST_ERR: DOM
Exception 3 on TinyMCE spellcheck load
Re: Issue 65364 in chromium: Attempting to inspect
Issue 65641 in chromium: The mouse scroll wheel doesn't work in Chrome PDF
viewer
Re: Issue 64172 in chromium: PDF plugin not showing spaces
Re: Issue 63991 in chromium: Chrome crashes when Printing .docx documents
as a PDF in Google Documents
Re: Issue 65363 in chromium: Segmentation Fault - x64 Ubuntu 10.10 :-(
Re: Issue 65402 in chromium: Flash content not allowed
Re: Issue 64931 in chromium: Flash plugin broken for non-video applications
Re: Issue 65236 in chromium: Sandboxed Flash accessing/resetting hard-drive
Issue 65642 in chromium: Memory leak in ExtensionPrefsTest
Re: Issue 65395 in chromium: Chrome PDF Viewer plugin shrinks PDF and
entire surrounding page
Re: Issue 64170 in chromium: Dispaying a PDF inside an iframe causes
automatic zoom out
Re: Issue 65395 in chromium: Chrome PDF Viewer plugin shrinks PDF and
entire surrounding page
Re: Issue 52253 in chromium: Browser can't render pages in Hindi properly
Re: Issue 60527 in chromium: MasteringPhysics assignments not accepting
submissions
Re: Issue 50447 in chromium: BrowserKeyEventsTest.ReservedAccelerators
failed on Mac10.6 Tests (dbg)(1) bot.
Re: Issue 62024 in chromium: New PDF-viewer does not work with iframes
Re: Issue 65590 in chromium: Disable Google Instant search functionality
for unsupported languages
Re: Issue 65395 in chromium: Chrome PDF Viewer plugin shrinks PDF and
entire surrounding page
Re: Issue 65352 in chromium: Presence of inspector causes webstore API to
go missing during navigation from outside webstore
Issue 65643 in chromium: Chrome PDF plugin crashes at
https://bug-18829-attachments.webkit.org/attachment.cgi?id=20913
Re: Issue 59215 in chromium: Renderer crash on pan and zoom of an image
sometimes @ skia::`anonymous namespace'::ConvolveVertically<0>(short const
*,int,unsigned char * const *,int,unsigned char *)
Issue 65644 in chromium: Performance difference in case of direct video
playback and HTML wrapper
Re: Issue 65259 in chromium: Flash wont resize on browser maximise
Re: Issue 28174 in chromium: Remove urls from locale_settings.grd
Re: Issue 59215 in chromium: Renderer crash on pan and zoom of an image
sometimes @ skia::`anonymous namespace'::ConvolveVertically<0>(short const
*,int,unsigned char * const *,int,unsigned char *)
Re: Issue 65464 in chromium: Right-arrow doesn't move cursor to end of
omnibox Instant suggestion (differs from google.com behavior)
Re: Issue 65643 in chromium: Chrome PDF plugin crashes at
https://bug-18829-attachments.webkit.org/attachment.cgi?id=20913
Re: Issue 65254 in chromium: Tabs aren't displayed
Re: Issue 65643 in chromium: Chrome PDF plugin crashes at
https://bug-18829-attachments.webkit.org/attachment.cgi?id=20913
Re: Issue 65643 in chromium: Chrome PDF plugin crashes at
https://bug-18829-attachments.webkit.org/attachment.cgi?id=20913
Re: Issue 65643 in chromium: Chrome PDF plugin crashes at
https://bug-18829-attachments.webkit.org/attachment.cgi?id=20913
Re: Issue 65402 in chromium: Flash content not allowed
Issue 65645 in chromium: Crash when packaging extensions from command-line
Re: Issue 60527 in chromium: MasteringPhysics assignments not accepting
submissions
Issue 65646 in chromium: Continue blocking images/javascript doesn't create
an exception
Issue 65647 in chromium: Autofill addresses should merge synonyms (1 Main
St. == 1 Main Street) when form is submitted
Re: Issue 65464 in chromium: Right-arrow doesn't move cursor to end of
omnibox Instant suggestion (differs from google.com behavior)
Re: Issue 65464 in chromium: Right-arrow doesn't move cursor to end of
omnibox Instant suggestion (differs from google.com behavior)
Issue 65648 in chromium: Two separators visible in the status icon menu for
a background app.
Issue 65649 in chromium: Close buttons on wrong side of tabs
Re: Issue 65259 in chromium: Flash wont resize on browser maximise
Issue 65650 in chromium: Asking twice to select file in <input type=file>
under <form> tag.
Re: Issue 65590 in chromium: Disable Google Instant search functionality
for unsupported languages
Re: Issue 65645 in chromium: Crash when packaging extensions from
command-line
Re: Issue 65363 in chromium: Segmentation Fault - x64 Ubuntu 10.10 :-(
Re: Issue 2054 in chromium: Chrome does not open a folder if you
click "Show in folder" for a downloaded file
Re: Issue 65624 in chromium: Images load but don't cache
Re: Issue 65151 in chromium: Use _GLIBCXX_DEBUG in Debug builds for better
checking
Re: Issue 60840 in chromium: Chrome App processes mislabeled or missing
from Chrome Task Manager
Re: Issue 62755 in chromium: ChromeFrame: Crash in browser process
Re: Issue 64566 in chromium: Squares on the URL Bar
Re: Issue 65590 in chromium: Disable Google Instant search functionality
for unsupported languages
Issue 65651 in chromium: Pages don't render on Apple.com
--
Automated mail from issue updates at http://crbug.com/
Subscription options: http://groups.google.com/a/chromium.org/group/chromium-bugs
c***@googlecode.com
2010-12-08 23:57:23 UTC
Permalink
Your project notifications generated too many emails to send
individually. Here are the subject lines of the emails you would have
received:

Re: Issue 65943 in chromium: Background tabs and extensions gc too often
Re: Issue 65937 in chromium: Redirect Loop on google Docs
Re: Issue 65883 in chromium: Constant random renderer crash
Re: Issue 65655 in chromium: Crash in a Windows Hook called after static
uninitialization.
Issue 65944 in chromium: Application windows don't remember position (Linux
/ Ubuntu; dual monitor)
Re: Issue 65084 in chromium: second rundll32.exe started by Chrome
interrupts other computer processes
Issue 65945 in chromium: Browser crash in
invalidation::InvalidationClientImpl::HandleSeqnoWritebackResult
Re: Issue 46929 in chromium: pdf plugin probably built wrong on mac
Re: Issue 65386 in chromium: Instant preference checkbox doesn't behave
like a checkbox when clicked
Re: Issue 65933 in chromium: Web Pages reload unexpectedly
Issue 65946 in chromium: Multiple users cannot install the same app, yet
aren't granted same permissions
Re: Issue 65939 in chromium: Stuck Facebook Chatboxes.
Re: Issue 32925 in chromium: regression: Don't block UI thread on IO thread
during shutdown for saving DNS prefetcher data
Re: Issue 65767 in chromium: Keyboard text entry on amazon window shop does
not work on mac
Re: Issue 50100 in chromium: Windows Dev version 6.0.472.0 - Win7 - ignores
high dpi settings
Re: Issue 65929 in chromium: Error 324 - False Start
Re: Issue 24647 in chromium: Opened application shortcut window should
remember old position
Re: Issue 65944 in chromium: Application windows don't remember position
(Linux / Ubuntu; dual monitor)
Re: Issue 65945 in chromium: Browser crash in
invalidation::InvalidationClientImpl::HandleSeqnoWritebackResult
Issue 65947 in chromium: PDF renderer crashes while loading this pdf
Re: Issue 65694 in chromium: SSL connection fails with a 324 error on some
domains
Re: Issue 65945 in chromium: Browser crash in
invalidation::InvalidationClientImpl::HandleSeqnoWritebackResult
Re: Issue 65655 in chromium: Crash in a Windows Hook called after static
uninitialization.
Issue 65948 in chromium: Memory corruption from network stack?
Re: Issue 65655 in chromium: Crash in a Windows Hook called after static
uninitialization.
Re: Issue 65938 in chromium: Feature Request: Be able to group or organise
apps on the new tab page
Issue 65949 in chromium: Mac times out on three tests
Re: Issue 58052 in chromium: Memory corruption when destroying the
SSLClientSocketPool
Re: Issue 65937 in chromium: Redirect Loop on google Docs
Re: Issue 65945 in chromium: Browser crash in
invalidation::InvalidationClientImpl::HandleSeqnoWritebackResult
Re: Issue 65940 in chromium: Leak in IPC::SyncChannel on Mac Valgrind
Re: Issue 57898 in chromium: Chrome: Crash Report - Stack Signature:
sync_notifier::ChromeInvalidationClient::RegisterTypes()-3b2a7e4f_aa587224_e5f2691a_3e5a96da_a7c68659
Issue 65950 in chromium: Element inspector displays wrong element size when
zoomed in
Re: Issue 65386 in chromium: Instant preference checkbox doesn't behave
like a checkbox when clicked
Issue 65951 in chromium: Flash partially displayed
Re: Issue 65945 in chromium: Browser crash in
invalidation::InvalidationClientImpl::HandleSeqnoWritebackResult
Re: Issue 65893 in chromium: blank pop up confirmation box appears on
nearly every site
Re: Issue 65918 in chromium: total count of rating drops after webstore is
launched
Re: Issue 24647 in chromium: Opened application shortcut window should
remember old position
Issue 65952 in chromium: webRequest/webNavigation stuff in IE CEEE may be
causing/aggravating deadlocks
Issue 65953 in chromium: window.opener not restored after cross-site
navigations
Re: Issue 65939 in chromium: Stuck Facebook Chatboxes.
Issue 65954 in chromium: PDF crashes in 9.0.597.10
Re: Issue 31387 in chromium: Run chrome as different user BUT from his
installation directory
Re: Issue 65767 in chromium: Keyboard text entry on amazon window shop does
not work on mac
Re: Issue 65866 in chromium: Page redirect issues
Issue 65955 in chromium: Facebook video doesn't play
Re: Issue 65955 in chromium: Facebook video doesn't play
Re: Issue 65831 in chromium: Web Store Upload Completely Broken
Re: Issue 64648 in chromium: Chrome: Crash Report - Stack Signature:
ObserverListBase<ExtensionToolbarModel::Observer>::RemoveObserver(ExtensionToolbarModel::Observer
*)-4951d496_7f3b26e1_eb0e8461_3541aeeb_2281ef0f
Issue 65956 in chromium: igoogle : Cannot display Gmail gadets fully until
reload the page
Re: Issue 65883 in chromium: Constant random renderer crash
Re: Issue 65807 in chromium: CRASH:
v8::internal::LCodeGen::DoDeferredTaggedToI(v8::internal::LTaggedToI
*)-DC9ECA
Re: Issue 65807 in chromium: CRASH:
v8::internal::LCodeGen::DoDeferredTaggedToI(v8::internal::LTaggedToI
*)-DC9ECA
Re: Issue 65706 in chromium: linux instant: tab doesn't work first time
Re: Issue 65947 in chromium: PDF renderer crashes while loading this pdf
Re: Issue 49492 in chromium: Bookmark Manager: Item height in listview is
calculated incorrectly, causing incorrect item to be highlighted on click
Re: Issue 65129 in chromium: Trying to clear last hour autofill data clears
everything
Re: Issue 65345 in chromium: Crash in ResourceDispatcher
OnReceivedRedirect()
Re: Issue 63854 in chromium: REGRESSION: Enabling Some Flags in Chromium
Crashes it (Crash when using --enable-aero-peek-tabs)
Issue 65957 in chromium: https://repository.sonatype.org/ is broken in
canary build 10.0.605.0
Re: Issue 65919 in chromium: PDF Viewer does not display page number
Re: Issue 65819 in chromium: Images from facebook.com are not displayed on
other domains.
Issue 65958 in chromium: Image manipulation by chrome
Re: Issue 64694 in chromium: Instant doesn't fire unload handlers
Re: Issue 5493 in chromium: PHPBB forum bug (selective quote)
Re: Issue 64350 in chromium: Chrome_Mac: Crash Report - Stack Signature:
JavaScriptAppModalDialog::Cleanup-102FF1B
Re: Issue 65206 in chromium: JS alerts/unload messages cancel instant
Issue 65959 in chromium: hyphenation errors
Issue 65961 in chromium: Always open files of this type - Disabled
Issue 65960 in chromium: Browser can close while instant unload handlers
are still running
Re: Issue 62451 in chromium: Regression - Style issues (margin definition
issues, I think)
Re: Issue 62451 in chromium: Regression - Style issues (margin definition
issues, I think)
Issue 65962 in chromium:
http://salesmalwares.com/Thread-Comodo-Internet-Security?pid=21533#pid21533
Issue 65963 in chromium: GTK: Create shortcuts dialog: text wrapping issue
Re: Issue 65962 in chromium:
http://salesmalwares.com/Thread-Comodo-Internet-Security?pid=21533#pid21533
Re: Issue 53299 in chromium: Webpage's appearance wrong
Issue 65964 in chromium: Figure out best way to deal with before unload
messages with instant
Re: Issue 65962 in chromium:
http://salesmalwares.com/Thread-Comodo-Internet-Security?pid=21533#pid21533
Re: Issue 16482 in chromium: <video preload> not respected (was autobuffer)
Re: Issue 65810 in chromium: Corrupted Download of iTunes 64bit
Re: Issue 65787 in chromium: Large File Download Truncated without any
Error Messaging
Re: Issue 65955 in chromium: Facebook video doesn't play
Re: Issue 57898 in chromium: Chrome: Crash Report - Stack Signature:
sync_notifier::ChromeInvalidationClient::RegisterTypes()-3b2a7e4f_aa587224_e5f2691a_3e5a96da_a7c68659
Issue 65965 in chromium: Text automatically disappearing
Re: Issue 16482 in chromium: <video preload> not respected (was autobuffer)
Re: Issue 65831 in chromium: Web Store Upload Completely Broken
Re: Issue 16482 in chromium: <video preload> not respected (was autobuffer)
Re: Issue 6232 in chromium: Media Player events are not being raised
Issue 65966 in chromium: Each new tab in IE CEEE creates new renderer
process
Re: Issue 60350 in chromium: getfirebug.com hangs and web inspector can't
be made to show up to see what is going on
Re: Issue 64970 in chromium: Killing BackgroundContents in the task manager
isn't working
Re: Issue 64969 in chromium: Killing BackgroundContents in the task manager
isn't working
Re: Issue 64682 in chromium: No API tests for background contents
Re: Issue 65780 in chromium: Can't select file on mac with Accept parameter
of <input type=file />
Re: Issue 57898 in chromium: Chrome: Crash Report - Stack Signature:
sync_notifier::ChromeInvalidationClient::RegisterTypes()-3b2a7e4f_aa587224_e5f2691a_3e5a96da_a7c68659
Re: Issue 65480 in chromium: Chrome redirecting problem
Re: Issue 65735 in chromium: Honor KDE's proxy exceptions.
Re: Issue 15548 in chromium: Search Engines should be synced
Re: Issue 65671 in chromium: Blindly TCP window size tuning in Windows XP
Re: Issue 65955 in chromium: Facebook video doesn't play
Re: Issue 30519 in chromium: Implement tab sync
Re: Issue 53977 in chromium: NTP: It should be possible to reorder apps via
drag+drop
--
Automated mail from issue updates at http://crbug.com/
Subscription options: http://groups.google.com/a/chromium.org/group/chromium-bugs
c***@googlecode.com
2010-12-13 19:41:13 UTC
Permalink
Your project notifications generated too many emails to send
individually. Here are the subject lines of the emails you would have
received:

Re: Issue 66506 in chromium: Problems with thumbnails for bookmarks
Re: Issue 65774 in chromium: links in chrome://extensions/ should link to
the new web store
Re: Issue 11321 in chromium: Allow user to set global default page zoom
level
Re: Issue 64735 in chromium: @font-face for Indic unicode font does not
work in Chrome
Re: Issue 57370 in chromium: Some Chrome extensions fail to install
Re: Issue 66697 in chromium: Feature: Remove menu item for downloads on
download bar/arrow to show visibility of other downloads
Re: Issue 66672 in chromium: Bookmarks manager : impossible selecting a line
Re: Issue 65385 in chromium: change webstore link
Issue 66712 in chromium: Status icon menu should use AlwaysShowIconForCmd()
for app menu items
Re: Issue 23078 in chromium: Remove "Remove Item" from download item
context menu
Re: Issue 66709 in chromium: RTL: Select with size element is always left
aligned even when dir=rtl
Re: Issue 65592 in chromium: Tweaks to omnibox dropdown size shifting when
Instant is enabled
Re: Issue 66562 in chromium: BBC 6 Music Listen Live does not work
Re: Issue 59576 in chromium: Chrome 6 displays wrong web page in iframe
Re: Issue 66485 in chromium: Flash video stopped working in most recent
version on certain sites.
Re: Issue 65345 in chromium: Crash in ResourceDispatcher
OnReceivedRedirect()
Issue 66713 in chromium: Moving the incognito tab to the end of tab strip
will show a black square
Re: Issue 66697 in chromium: Feature: Remove menu item for downloads on
download bar/arrow to show visibility of other downloads
Re: Issue 66697 in chromium: Feature: Remove menu item for downloads on
download bar/arrow to show visibility of other downloads
Re: Issue 64128 in chromium: Flash: Unable to enable third party data
storage
Re: Issue 64356 in chromium: Flash Webcam regression in Chrome9 on Windows7
Re: Issue 66695 in chromium: Incredibuild fails on the TSan/Win bot since
r68981
Re: Issue 61075 in chromium: Auto-loading confirmations/continuations don't
work
Re: Issue 66672 in chromium: Bookmarks manager : impossible selecting a line
Re: Issue 66672 in chromium: Bookmarks manager : impossible selecting a line
Re: Issue 64128 in chromium: Flash: Unable to enable third party data
storage
Re: Issue 61707 in chromium: Crash Google Chrome
Re: Issue 64761 in chromium: Crash in Google Talk plugin at startup
Re: Issue 46110 in chromium: Download bar should have auto-hide after
you've interacted with all items (like windows)
Re: Issue 55413 in chromium: Download bar hiding
Re: Issue 66059 in chromium: Installing an extension that is disabled
should enable it.
Re: Issue 62595 in chromium: ResourceDispatcherTest.SyncXMLHttpRequest
ui_test is flaky
Re: Issue 62460 in chromium: PDF viewer saves corrupted PDF files
Re: Issue 66101 in chromium: Bookmark Manager selects wrong entry after
clicking on it
Re: Issue 66672 in chromium: Bookmarks manager : impossible selecting a line
Re: Issue 66101 in chromium: Bookmark Manager selects wrong entry after
clicking on it
Re: Issue 23078 in chromium: Remove "Remove Item" from download item
context menu
Re: Issue 66697 in chromium: Feature: Remove menu item for downloads on
download bar/arrow to show visibility of other downloads
Re: Issue 64652 in chromium: Chrome: Crash Report - Stack Signature:
CallbackRunner<Tuple1<invalidation::NetworkEndpoint * const &>
::Run<invalidation::NetworkEndpoint *>(invalidation::NetworkEndpoint *
const &)-57c5da0a_c22e85fa_ecc64fac_c756b4a4_e3761d77
Re: Issue 62613 in chromium: Sync: Supress the Encryption tab from the
Customize UI
Issue 66714 in chromium:
databases.DatabasesTest.testIncognitoDBPersistentAcrossTabs is flaky
Re: Issue 62847 in chromium: New network issues introduced ??!!
Re: Issue 57370 in chromium: Some Chrome extensions fail to install
Re: Issue 57370 in chromium: Some Chrome extensions fail to install
Re: Issue 66695 in chromium: Incredibuild fails on the TSan/Win bot since
r68981
Re: Issue 61707 in chromium: Crash Google Chrome
Re: Issue 62622 in chromium: re-POST confirmation dialog continues to
appear even after subsequent GETs when initial POST doesn't redirect
Re: Issue 62905 in chromium: Hung Chrome Process(es)
Re: Issue 62460 in chromium: PDF viewer saves corrupted PDF files
Re: Issue 66415 in chromium: Flash broker and Flash player are disconnected
Re: Issue 64810 in chromium: Chrome loads a page twice without user knowing
Re: Issue 64256 in chromium: Clicking on accelerated plugins dismisses
instant results
Re: Issue 65345 in chromium: Crash in ResourceDispatcher
OnReceivedRedirect()
Issue 66715 in chromium: Chrome doesn't prompt user to restart for update
in system level
Re: Issue 65755 in chromium: After Flash crashes, some plugins leave a hole
on pages
Re: Issue 65204 in chromium: Download window often when clicked on link
Re: Issue 19587 in chromium: Acrobat plugin blacklisted due to it depending
on libXt
Re: Issue 38144 in chromium: Empty-string URLs cause page to re-download
for <img>, <script>, <link>
Re: Issue 64810 in chromium: Chrome loads a page twice without user knowing
Re: Issue 65671 in chromium: Blindly TCP window size tuning in Windows XP
Re: Issue 48104 in chromium: If reopening last open pages, closing the last
tab closes the browser and reopens it later
Re: Issue 65810 in chromium: Corrupted Download of iTunes 64bit
Issue 66716 in chromium: Remove page title from being sent with feedback.
Re: Issue 66584 in chromium: Developer tools shows inconsistent body tag
for page
Re: Issue 65948 in chromium: Memory corruption from network stack?
Re: Issue 65985 in chromium: Autofill suggested dropdown list should be
closed with unmatched names.
Re: Issue 66034 in chromium: Cannot connect to mail.google.com with SPDY
Issue 66717 in chromium: Migrate profile-related data from local state to
user preferences.
Re: Issue 65074 in chromium: Chrome Errors when loading for FS without 8.3
filename
Re: Issue 66075 in chromium: Redirect loop connecting to picnik.com
Re: Issue 61012 in chromium: Media runtime failures are not handled
gracefully
Re: Issue 66424 in chromium: Connecting to SSL server which requires client
Re: Issue 66519 in chromium: SSL Client certificate detection on Windows
does not consider if the user has a valid private key
Re: Issue 66702 in chromium: Move GSSAPI loading off of IO thread
Re: Issue 66101 in chromium: Bookmark Manager selects wrong entry after
clicking on it
Issue 66718 in chromium: webgl page causes X server crash
Re: Issue 66505 in chromium: about:plugins issue
Re: Issue 66683 in chromium: Layout Test
fast/canvas/canvas-draw-canvas-on-canvas-shadow.html = TEXT
Re: Issue 66686 in chromium: Layout Test
fast/loader/user-stylesheet-fast-path.html is failing
Re: Issue 61521 in chromium: Crash in Flash Plugin
Re: Issue 59131 in chromium: Prototype browser/ui test for WebGL
Issue 66719 in chromium: Expose table related attributes.
Re: Issue 65211 in chromium: Flash in sandbox requires administrator rights
Re: Issue 62608 in chromium: Renderer crash in
WebCore::TypingCommand::makeEditableRootEmpty
Re: Issue 66683 in chromium: Layout Test
fast/canvas/canvas-draw-canvas-on-canvas-shadow.html = TEXT
Re: Issue 66694 in chromium: remove RFC2047 support from
Content-Disposition header handling
Issue 66720 in chromium: If instant is enabled and search provider doesn't
support instant api page fades out on every key stroke
Re: Issue 62747 in chromium: when you hide/minimize the apps section in the
NTP, scrollbar isn't reset
Re: Issue 65774 in chromium: links in chrome://extensions/ should link to
the new web store
Re: Issue 66609 in chromium: Syncable fails check if folder has a
UNIQUE_CLIENT_TAG
Re: Issue 66172 in chromium: Editing Gmail replies is fubar (Scrolling does
not update the screen in Gmail's reply window)
Re: Issue 65875 in chromium: Not clear that Google Talk App requires Chrome
OS until you install it
Re: Issue 23106 in chromium: <select> drop-down is always left-aligned even
the dir of <select> is RTL.
Re: Issue 66390 in chromium: Java Applet in VNC does not work
Re: Issue 65737 in chromium: Sound for currently focused window/tab
Re: Issue 66680 in chromium: ThreadSanitizer reports lock violations while
deallocating NSBitmapGraphicsContext in base_unittests on Mac OS 10.6
Re: Issue 63870 in chromium: Aw snap error on Mac
Re: Issue 64761 in chromium: Crash in Google Talk plugin at startup
Re: Issue 23106 in chromium: <select> drop-down is always left-aligned even
the dir of <select> is RTL.
Re: Issue 66615 in chromium: chromium virtual machine
Re: Issue 65993 in chromium: Heapcheck leak in PrerenderInterceptorTest
Re: Issue 66010 in chromium: Embedd pdf object error
Re: Issue 66666 in chromium: EventSource doesn't works
--
Automated mail from issue updates at http://crbug.com/
Subscription options: http://groups.google.com/a/chromium.org/group/chromium-bugs
c***@googlecode.com
2010-12-14 00:31:51 UTC
Permalink
Your project notifications generated too many emails to send
individually. Here are the subject lines of the emails you would have
received:

Re: Issue 29610 in chromium: Tabs (in tab bar) don't resize properly with
windows display set to large
Issue 66751 in chromium: Layout test failures:
http/tests/local/link-stylesheet-load-order-preload.htm and
http/tests/local/link-stylesheet-load-order.html
Re: Issue 66741 in chromium: Reliability crash
Re: Issue 66736 in chromium: MSI rolls out fine, but next patch release
requires UAC from users(!)
Re: Issue 44235 in chromium: Update server not available (error: 12)
Re: Issue 44235 in chromium: Update server not available (error: 12)
Re: Issue 66730 in chromium: ExtensionInstallUI needs to be split up
Issue 66752 in chromium: chrome-xp-single-core works fine after a reboot
then begins failing repeatedly
Re: Issue 66728 in chromium: ERR_NETWORK_IO_SUSPENDED issue introduced
Issue 66753 in chromium: Apps link from apple store problem .
Re: Issue 66728 in chromium: ERR_NETWORK_IO_SUSPENDED issue introduced
Re: Issue 17702 in chromium: Mac PlatformContext for video causes extra copy
Re: Issue 65755 in chromium: After Flash crashes, some plugins leave a hole
on pages
Re: Issue 57173 in chromium: Poster image shown when setting video
currentTime
Re: Issue 66172 in chromium: Editing Gmail replies is fubar (Scrolling does
not update the screen in Gmail's reply window)
Re: Issue 66736 in chromium: MSI rolls out fine, but next patch release
requires UAC from users(!)
Re: Issue 60240 in chromium: Developer Tools: Uncaught exceptions' stack
trace missing when exception rethrown
Re: Issue 18182 in chromium: poster flickers briefly
Re: Issue 62848 in chromium: PyAuto:
downloads.DownloadsTest.testFileRenaming test seems to be flaky
Re: Issue 49523 in chromium: Phantom Tabs always and forever.
Re: Issue 66586 in chromium: Browser constantly refreshing PDF document
Re: Issue 52331 in chromium: Should scroll whole pages of PDF with Page
Up/Down or arrow left/right
Re: Issue 51829 in chromium: Configure Sync never finishes setting up
Re: Issue 66533 in chromium: Chrome crashes when installing a specific user
script
Re: Issue 66658 in chromium: Crash occurs when "clear all browsing data"
via History -> Edit Items -> Clear all browsing data
Re: Issue 66570 in chromium: enabling cloud print has hosed printing on
Vista system
Re: Issue 66650 in chromium: Chrome is crashing
Re: Issue 36114 in chromium: Checking for the default browser screws up and
causes "your profile cannot be opened correctly" (?)
Issue 66754 in chromium: reopen pages that were last open fails if an
incognito window is open
Re: Issue 66081 in chromium: Fix unsafe downloads pyauto tests
Re: Issue 66705 in chromium: scroll screen make some pages crashed
Re: Issue 36114 in chromium: Checking for the default browser screws up and
causes "your profile cannot be opened correctly" (?)
Re: Issue 66612 in chromium: GPU canvas acceleration on notification canvas
causes extension hang
Re: Issue 63115 in chromium: Popup of some extensions doesn't appear
if "GPU Accelerated Canvas" is enabled
Re: Issue 66573 in chromium: Assert error when using Chrome mjutil.cpp
Re: Issue 25334 in chromium: inset -webkit-box-shadow not adhering to
-webkit-border-radius
Re: Issue 66542 in chromium: Flash crashes chrome
Re: Issue 65948 in chromium: Memory corruption from network stack?
Re: Issue 66625 in chromium: bootpage.dll
Re: Issue 66594 in chromium: Chrome crashes when opens url from skype or msn
Re: Issue 44341 in chromium: WebKit Linux UMR failures related to NSS SSL
Re: Issue 66674 in chromium: search crashes: app/x11_util.cc(56)] X Error
detected: serial 7234 error_code 8 request_code 56 minor_code 0
Re: Issue 65948 in chromium: Memory corruption from network stack?
Re: Issue 63787 in chromium: Sometimes Apps are selected when selecting
processes under Browser Tabs and Plugins
Re: Issue 65455 in chromium: Can't set up sync
Re: Issue 66748 in chromium: Crash when handling mouse events in SVG
Issue 66755 in chromium: Extension page extension links go to /extensions/
not /webstore/
Re: Issue 66668 in chromium: VideoStopLoad- crash
Issue 66756 in chromium: Disabling Javascript through enterprise policy
doesn't grey out the option in UI
Re: Issue 45478 in chromium: IME dysfunctional after BACKSPACE
Re: Issue 65780 in chromium: Can't select file on mac with Accept parameter
of <input type=file />
Issue 66757 in chromium: Mac: Incognito man needs separator from toolbar
and should cast a shadow
Re: Issue 66539 in chromium:
InstantTest.NonSearchToSearchDoesntSupportInstant is flaky
Re: Issue 46852 in chromium: Remove phantom tabs
Re: Issue 65755 in chromium: After Flash crashes, some plugins leave a hole
on pages
Re: Issue 63280 in chromium: User able to modify Javascript features, even
when the policy is enabled/disabled
Re: Issue 66756 in chromium: Disabling Javascript through enterprise policy
doesn't grey out the option in UI
Re: Issue 64867 in chromium: PDF is distorted while scrolling
Re: Issue 65868 in chromium: Inbuilt PDF viewer clips content
Re: Issue 65314 in chromium: Trying to open any PDF url in Chrome does
nothing
Re: Issue 65611 in chromium: PDF not redrawn correctly after horizontal zoom
Re: Issue 66221 in chromium: PDF display shifted after selecting some words
Re: Issue 66605 in chromium: Chrome 9 and 10 can't change to Japanese or
Chinese input, just can type in English words.
Re: Issue 66136 in chromium: Chrome PDF Viewer should be disabled by default
Re: Issue 66258 in chromium: Embedded PDFs don't work when src is from a
different domain
Re: Issue 66741 in chromium: Reliability crash
Re: Issue 66650 in chromium: Chrome is crashing
Re: Issue 66390 in chromium: Java Applet in VNC does not work
Re: Issue 66075 in chromium: Redirect loop connecting to picnik.com
Re: Issue 61409 in chromium: Rename ExtensionsService to ExtensionService
Re: Issue 66747 in chromium: Bookmark Manager doesn't work
Re: Issue 43448 in chromium: Clicking Bookmark Manager results in problem
tab (shows blank / empty)
Re: Issue 32268 in chromium: Tab text clipping code is broken
Re: Issue 65314 in chromium: Trying to open any PDF url in Chrome does
nothing
Issue 66758 in chromium: Report A Bug in-between multiple tab cause browser
crash @BugReportHandler::~BugReportHandler
Re: Issue 66634 in chromium: QTVR doesn't work on Apple product page
Re: Issue 66740 in chromium: backspacing through search terms makes instant
disappear on linux
Re: Issue 66758 in chromium: Report A Bug in-between multiple tab cause
browser crash @BugReportHandler::~BugReportHandler
Re: Issue 66650 in chromium: Chrome is crashing
Issue 66759 in chromium: accelerated canvas 2d enabled, even though it said
it wasn't
Re: Issue 66736 in chromium: MSI rolls out fine, but next patch release
requires UAC from users(!)
Re: Issue 66741 in chromium: Reliability crash
Re: Issue 65719 in chromium: Submit a form in a second window doesn't work
well
Re: Issue 32268 in chromium: Tab text clipping code is broken
Re: Issue 66424 in chromium: Connecting to SSL server which requires client
Re: Issue 27073 in chromium: Bookmark hover effect persists
Re: Issue 66758 in chromium: Report A Bug in-between multiple tab cause
browser crash @BugReportHandler::~BugReportHandler
Issue 66767 in chromium: Bring up Report A Bug crash @GURL::spec
Re: Issue 57875 in chromium: NavigateToURL does not trigger a successful
download for dangerous filetypes
Re: Issue 66752 in chromium: chrome-xp-single-core works fine after a
reboot then begins failing repeatedly
Re: Issue 35705 in chromium: Extend XmlHttpRequest with getAsBinary() and
sendAsBinary() methods, like in FF3
Re: Issue 66150 in chromium: Problem with enabled GPU Accelerated Canvas 2D
Re: Issue 65453 in chromium: GPU canvas 2D -> IE speed reading test is
broken (weird page painting) (regression)
Re: Issue 66424 in chromium: Connecting to SSL server which requires client
Re: Issue 63453 in chromium: Mac: opening a file from Finder, e.g. via
Cmd-O, doesn't work
Re: Issue 66736 in chromium: MSI rolls out fine, but next patch release
requires UAC from users(!)
Re: Issue 66658 in chromium: Crash occurs when "clear all browsing data"
via History -> Edit Items -> Clear all browsing data
Re: Issue 39254 in chromium: Form auto-complete menus open upward in some
multi-monitor setups
Re: Issue 35705 in chromium: Extend XmlHttpRequest with getAsBinary() and
sendAsBinary() methods, like in FF3
Re: Issue 65593 in chromium: Tab key behavior of blue autocomplete text
Re: Issue 56379 in chromium: remembered form fields' drop down boxes cannot
be selected with focus-follows-mouse
Re: Issue 58831 in chromium: Allow individual SSL/TLS ciphersuites to be
enabled/disabled
Re: Issue 66683 in chromium: Layout Test
fast/canvas/canvas-draw-canvas-on-canvas-shadow.html = TEXT
--
Automated mail from issue updates at http://crbug.com/
Subscription options: http://groups.google.com/a/chromium.org/group/chromium-bugs
c***@googlecode.com
2010-12-14 20:14:58 UTC
Permalink
Your project notifications generated too many emails to send
individually. Here are the subject lines of the emails you would have
received:

Re: Issue 63870 in chromium: Aw snap error on Mac
Re: Issue 55568 in chromium: reduce need for */* (<all_urls>) permission
for extensions
Re: Issue 66856 in chromium: Request - have a dynamic option for requesting
cross-origin permissions in extensions
Re: Issue 49279 in chromium: New leak in ChromeCookieMonsterDelegate found
on Chromium Mac UI (valgrind)(1)
Re: Issue 66855 in chromium: "Download cricitcal security update" on
about:plugins even after updating the plugins
Issue 66857 in chromium: Youtube Videos are not buffering well, lots of
breaks during playback. - happens since last update to 597.19
Issue 66858 in chromium: ZALGO text broken
Re: Issue 65755 in chromium: After Flash crashes, some plugins leave a hole
on pages
Re: Issue 65987 in chromium: Embedded Flash videos and other Adobe flash
objects are either blank or have their bottoms cut off.
Re: Issue 25404 in chromium: Linux should encrypt passwords on disk by
default
Re: Issue 63870 in chromium: Aw snap error on Mac
Re: Issue 64964 in chromium: Ctrl+Shift+Click to select multiple files in
bookmark manager doesn't work
Re: Issue 65455 in chromium: Can't set up sync
Re: Issue 66858 in chromium: ZALGO text broken
Issue 66859 in chromium: Authorization window is displayed when no
corresponding
Issue 66860 in chromium: mime-type "application/x-java-jnlp-file" not
recognized
Re: Issue 66858 in chromium: ZALGO text broken
Re: Issue 66859 in chromium: Authorization window is displayed when no
corresponding
Re: Issue 66858 in chromium: ZALGO text broken
Re: Issue 66851 in chromium: App badges
Re: Issue 66783 in chromium: Page info bubble expands in size poorly
Re: Issue 64823 in chromium: Revised Animations for Expanding Site Info
Bubbles
Re: Issue 65198 in chromium: Unable to consistently open javascript trigger
new window using background app
Re: Issue 63870 in chromium: Aw snap error on Mac
Re: Issue 66848 in chromium: Misunderstood style rule: #sideBar > .ad_box +
DIV[style] {display:none !important; visibility:hidden !important}
Re: Issue 63453 in chromium: Mac: opening a file from Finder, e.g. via
Cmd-O, doesn't work
Re: Issue 66728 in chromium: ERR_NETWORK_IO_SUSPENDED issue introduced
Re: Issue 64644 in chromium: chrome won't restore from win7 taskbar
Re: Issue 66851 in chromium: App badges
Re: Issue 65755 in chromium: After Flash crashes, some plugins leave a hole
on pages
Re: Issue 66843 in chromium: No Auto Update since Chrome 7
Re: Issue 65645 in chromium: Crash when packaging extensions from
command-line
Re: Issue 64644 in chromium: chrome won't restore from win7 taskbar
Re: Issue 45549 in chromium: Pressing ENTER/RETURN doesn't submit a form
when submit button is styled with "display: none;"
Re: Issue 66823 in chromium: Downloaded file keeps going
Re: Issue 66848 in chromium: Misunderstood style rule: #sideBar > .ad_box +
DIV[style] {display:none !important; visibility:hidden !important}
Re: Issue 66821 in chromium: Right Cotrol key not work
Re: Issue 14477 in chromium: Main request fails when certificate revocation
check gets empty string / times out
Issue 66861 in chromium: About:plugins lists shockwave plugin even it is
not installed
Re: Issue 66736 in chromium: MSI rolls out fine, but next patch release
requires UAC from users(!)
Re: Issue 66859 in chromium: Authorization window is displayed when no
corresponding
Re: Issue 66728 in chromium: ERR_NETWORK_IO_SUSPENDED issue introduced
Re: Issue 59686 in chromium: Sometimes the Resorce Inspector shows large
Receiving values like 16.4hrs
Re: Issue 65506 in chromium: Developer Tools: Network requests are timed
with 1.6 days.
Issue 66862 in chromium: [Flash] www.bbs.co.uk: Flash become unresponsive
sometimes when loading
Re: Issue 66728 in chromium: ERR_NETWORK_IO_SUSPENDED issue introduced
Re: Issue 56415 in chromium: DOMUI: Missing prefer language and spell
checker in Under the Hood settings
Re: Issue 65455 in chromium: Can't set up sync
Re: Issue 66791 in chromium: right-click menu presists after clicking (see
screenshot)
Re: Issue 66861 in chromium: About:plugins lists shockwave plugin even it
is not installed
Re: Issue 66505 in chromium: about:plugins issue
Re: Issue 45467 in chromium: Bookmarks drop-down erroneously remains
floating on top
Re: Issue 66424 in chromium: Connecting to SSL server which requires client
Re: Issue 66505 in chromium: about:plugins issue
Re: Issue 66855 in chromium: "Download cricitcal security update" on
about:plugins even after updating the plugins
Re: Issue 65755 in chromium: After Flash crashes, some plugins leave a hole
on pages
Re: Issue 56415 in chromium: DOMUI: Missing prefer language and spell
checker in Under the Hood settings
Re: Issue 66787 in chromium: Starting with 8.0.552.224, Chrome freezes if
it tries to load the EyeTV QuickTime component.
Issue 66863 in chromium: DCHECK fires off from
BrowserHelperObject::InsertCode during IE startup when CEEE present
Re: Issue 52447 in chromium: Move chrome://extensions to new HTML settings
Re: Issue 66424 in chromium: Re-Connecting to SSL server which requires a
client cert does not prompt if no cert was sent in the first visit
Re: Issue 41767 in chromium: dom-ui settings: rename download
path 'Browse...' button to 'Change...'
Re: Issue 66785 in chromium: I have no sound on google chrome
Re: Issue 56415 in chromium: DOMUI: Missing prefer language and spell
checker in Under the Hood settings
Re: Issue 66863 in chromium: DCHECK fires off from
BrowserHelperObject::InsertCode during IE startup when CEEE present
Re: Issue 66736 in chromium: MSI rolls out fine, but next patch release
requires UAC from users(!)
Re: Issue 63874 in chromium: Error 401(net::ERR_CACHE_READ_FAILURE):
unknown error
Issue 66864 in chromium: DCHECK in the CEEE broker in tab_api_module.cc
Re: Issue 66787 in chromium: Starting with 8.0.552.224, Chrome freezes if
it tries to load the EyeTV QuickTime component.
Re: Issue 66787 in chromium: Starting with 8.0.552.224, Chrome freezes if
it tries to load the EyeTV QuickTime component.
Re: Issue 65955 in chromium: Flash video paints partially
Re: Issue 66728 in chromium: ERR_NETWORK_IO_SUSPENDED issue introduced
Issue 66865 in chromium: add 'regex' to 'Find...'
Issue 66866 in chromium: Ctrl+C doesn't work properly in Chromium bug
repository
Issue 66867 in chromium: http://disney.go.com/tron/ : fail to select an
item from the drop down list
Re: Issue 63874 in chromium: Error 401(net::ERR_CACHE_READ_FAILURE):
unknown error
Issue 66868 in chromium: Chrome: Crash Report - Stack Signature:
WebCore::TypingCommand::makeEditableRootEmpty()-30ed63d6_a1149a60_f3aea8fa_3f0a6101_482a2e38
Re: Issue 66866 in chromium: Ctrl+C doesn't work properly in Chromium bug
repository
Re: Issue 66726 in chromium: On a tab that has not loaded a url, it is no
longer possible to display nothing. This used to be possible.
Re: Issue 66670 in chromium: Apps that only run in ChromeOS show up in
Chrome
Re: Issue 66670 in chromium: Apps that only run in ChromeOS show up in
Chrome
Re: Issue 66670 in chromium: Apps that only run in ChromeOS show up in
Chrome
Re: Issue 66654 in chromium: Page Actions used unnecessary Background page
Issue 66869 in chromium: Help description is wrong for 'Disable CNAME
lookup when negotiating Kerboros lookup '
Re: Issue 66869 in chromium: Help description is wrong for 'Disable CNAME
lookup when negotiating Kerboros lookup '
Re: Issue 66730 in chromium: ExtensionInstallUI needs to be split up
Re: Issue 56415 in chromium: DOMUI: Missing prefer language and spell
checker in Under the Hood settings
Re: Issue 66869 in chromium: Help description is wrong for 'Disable CNAME
lookup when negotiating Kerberos lookup '
Issue 66870 in chromium: WebCore::PathTraversalState::cubicBezierTo (crash
- out of memory)
Re: Issue 65883 in chromium: Constant random renderer crash
Re: Issue 59539 in chromium: Repeated errors
Issue 66871 in chromium: Incorrect Usage of Windows User Profiles
Re: Issue 66622 in chromium: about a period of browsing, Chrome stops
sending HTTP requests
Re: Issue 63874 in chromium: Error 401(net::ERR_CACHE_READ_FAILURE):
unknown error
Re: Issue 66062 in chromium: ERR_TEMPORARILY_THROTTLED makes web
development difficult
Re: Issue 59539 in chromium: Repeated errors
Re: Issue 66787 in chromium: Starting with 8.0.552.224, Chrome freezes if
it tries to load the EyeTV QuickTime component.
Re: Issue 66589 in chromium: 'Web Store' link goes to Chrome extensions not
the Web Store
Re: Issue 66251 in chromium: invalid parse tree of tags
Re: Issue 59539 in chromium: Repeated errors
Re: Issue 66791 in chromium: right-click menu presists after clicking (see
screenshot)
Re: Issue 61325 in chromium: java not working aftet update
Re: Issue 66787 in chromium: Starting with 8.0.552.224, Chrome freezes if
it tries to load the EyeTV QuickTime component.
--
Automated mail from issue updates at http://crbug.com/
Subscription options: http://groups.google.com/a/chromium.org/group/chromium-bugs
c***@googlecode.com
2010-12-14 21:48:31 UTC
Permalink
Your project notifications generated too many emails to send
individually. Here are the subject lines of the emails you would have
received:

Re: Issue 66868 in chromium: Chrome: Crash Report - Stack Signature:
WebCore::TypingCommand::makeEditableRootEmpty()-30ed63d6_a1149a60_f3aea8fa_3f0a6101_482a2e38
Re: Issue 62608 in chromium: Renderer crash in
WebCore::TypingCommand::makeEditableRootEmpty
Issue 66874 in chromium: Implement IAccessible2 Table related methods.
Issue 66875 in chromium: Error 12 on update to latest dev build
Re: Issue 66534 in chromium: Flash movies display only upper part
Re: Issue 66867 in chromium: http://disney.go.com/tron/ : fail to select
an item from the drop down list
Re: Issue 59587 in chromium: Chrome: Crash Report - Stack Signature: -341D98
Re: Issue 150 in chromium: Type-ahead-find
Re: Issue 59285 in chromium: Facebook connect login popup does not close by
itself
Re: Issue 66791 in chromium: right-click menu presists after clicking (see
screenshot)
Re: Issue 40826 in chromium: Going from no network to having network should
reload tabs
Re: Issue 59285 in chromium: Facebook connect login popup does not close by
itself
Re: Issue 61137 in chromium: Sync: Client gets stuck after sync starts
setting up and causes the OS to freeze
Issue 66876 in chromium: Security: maybe throw away one click when window
brought from back to front
Re: Issue 66622 in chromium: about a period of browsing, Chrome stops
sending HTTP requests
Re: Issue 64736 in chromium: Desktop Chrome apps promo does not display if
NTP is open when autoupdate occurs
Re: Issue 33074 in chromium: Remove "open frame in new xxx" context menu
options
21 issues changed in chromium
Re: Issue 66834 in chromium: Manifest is not localized for component
extensions
Re: Issue 66788 in chromium: Mac: disable Command+J in omnibox and Find box
Re: Issue 66099 in chromium: JSC change to array sort for toString()
methods that mutate the array
Re: Issue 66779 in chromium: Ability to navigate Forward/Back while using
Instant is confusing
Issue 66877 in chromium: Not Support DivX Format
Re: Issue 66767 in chromium: Bring up Report A Bug crash @GURL::spec
Re: Issue 60223 in chromium: [LTTF][Flakiness] Failure investigation of
media/controls-styling.html
Re: Issue 66722 in chromium: FRUI dlg rendering problem.
Re: Issue 66622 in chromium: about a period of browsing, Chrome stops
sending HTTP requests
Re: Issue 66715 in chromium: Chrome doesn't prompt user to restart for
update in system level
Re: Issue 66767 in chromium: Bring up Report A Bug crash @GURL::spec
Issue 66878 in chromium: ppapi_egl does not compile on Mac
Re: Issue 66713 in chromium: Moving the incognito tab to the end of tab
strip will show a black square
Re: Issue 61260 in chromium: media/media-can-play-wav-audio.html fails in
Chromium
Re: Issue 66676 in chromium: REGRESSION: Crash on exit after clearing all
downloads
Re: Issue 66649 in chromium: Reopening non-rightmost pinned tab should
repin the tab
Re: Issue 66634 in chromium: QTVR doesn't work on Apple product page
Re: Issue 66722 in chromium: FRUI dlg rendering problem.
Re: Issue 61260 in chromium: media/media-can-play-wav-audio.html fails in
Chromium
Re: Issue 66062 in chromium: ERR_TEMPORARILY_THROTTLED makes web
development difficult
Re: Issue 42895 in chromium: Layout Test
media/audio-only-video-intrinsic-size.html is failing
Re: Issue 61260 in chromium: media/media-can-play-wav-audio.html fails in
Chromium
Issue 66879 in chromium: End and Home Button in URL Bar Doesn't work
Re: Issue 66582 in chromium: Search function ignores a part of the web page
Re: Issue 42895 in chromium: Layout Test
media/audio-only-video-intrinsic-size.html is failing
Re: Issue 66512 in chromium: The form autocomplete function fails to
capitalize letters if a remembered entry was not capitalized.
Re: Issue 66183 in chromium: Certain CSS rules block the 'print' prompt and
disable the feature
Issue 66880 in chromium: Flash Video Cut in half (or not visible)
Re: Issue 66872 in chromium: Bookmark manager
Re: Issue 43448 in chromium: Clicking Bookmark Manager results in problem
tab (shows blank / empty)
Re: Issue 35835 in chromium: Chrome has a memory leak when you modify the
book marks
Re: Issue 66879 in chromium: End and Home Button in URL Bar Doesn't work
Issue 66881 in chromium: Light background themes new tab page is not clear
Re: Issue 66114 in chromium: ' Page zoom ' combo box does not appear
properly aligned on the Web Content settings.
Re: Issue 66084 in chromium: DOMUI: Context menu/Edit Search engines fails,
if options page is opened.
Re: Issue 59665 in chromium: media/video layout test flakiness on Mac DRT
Issue 66882 in chromium: Chromium does not support DDE (Dunamic Data
Exchange)
Re: Issue 65461 in chromium: REGRESSION: middle click in bookmark manager
open links twice (in 2 separate tabs)
Re: Issue 18941 in chromium: <video> doesn't respect aspect ratio of content
Re: Issue 66875 in chromium: Error 12 on update to latest dev build
Re: Issue 65219 in chromium: About:Flags Vs Chrome Updates.
Re: Issue 59412 in chromium: [LTTF][Flakiness] Failure investigation of
media/video-display-aspect-ratio.html
Re: Issue 59635 in chromium: media/video-display-aspect-ratio.html TIMEOUT
due to aspect ratio issue
Re: Issue 59412 in chromium: [LTTF][Flakiness] Failure investigation of
media/video-display-aspect-ratio.html
Re: Issue 44235 in chromium: Update server not available (error: 12)
Re: Issue 59412 in chromium: [LTTF][Flakiness] Failure investigation of
media/video-display-aspect-ratio.html
Re: Issue 65215 in chromium: Need learn more link for Cloud Print
Re: Issue 18941 in chromium: <video> doesn't respect aspect ratio of content
Re: Issue 66875 in chromium: Error 12 on update to latest dev build
Re: Issue 65218 in chromium: Need link for Cloud Print Test page.
Re: Issue 44235 in chromium: Update server not available (error: 12)
Re: Issue 66114 in chromium: ' Page zoom ' combo box does not appear
properly aligned on the Web Content settings.
Re: Issue 47150 in chromium: fails to update with error 12
Re: Issue 65193 in chromium: about:flags doesn't tell you the default and
doesn't give you an easy way to revert
Re: Issue 65193 in chromium: about:flags doesn't tell you the default and
doesn't give you an easy way to revert
Re: Issue 65187 in chromium: Tabbed settings blocks Cloud Printing on
Stable channel.
Re: Issue 59285 in chromium: Facebook connect login popup does not close by
itself
Re: Issue 65008 in chromium: Should we be handling the 'stop additional
dialogs' checkmark when you hit the close button?
Re: Issue 66843 in chromium: No Auto Update since Chrome 7
Re: Issue 65026 in chromium: Options/Basics tab truncation with Enterprise
policy setting.
Re: Issue 65149 in chromium: Browser crash @
browser::Navigate(browser::NavigateParams *)
Re: Issue 65215 in chromium: Need learn more link for Cloud Print
Re: Issue 64966 in chromium: GTK: Task Manager activates wrong tab if
multiple tabs in process
Re: Issue 64957 in chromium: Translate info bar is failed for middle click.
Re: Issue 64881 in chromium: Tab title and BMB doesn't update if you are
dragging the tab while the page loads
Re: Issue 64833 in chromium: Bookmark manager context menu doesn't
disappear when focus shifts to Tab strip or bookmark bar
Re: Issue 64719 in chromium: Once password is filled, cannot tab away from
username field
Re: Issue 64567 in chromium: Better large image zooming, navigation
Re: Issue 66084 in chromium: DOMUI: Context menu/Edit Search engines fails,
if options page is opened.
Re: Issue 64461 in chromium: Options dialog hidden or off screen in a
multi-monitor scenario
Re: Issue 59226 in chromium: [LTTF][Flakiness] TIMEOUT in LayoutTest
(media/video-source-error.html)
Re: Issue 64374 in chromium: pattern for local files is blank for popup
blockers
Re: Issue 64343 in chromium: Apps: Installing apps spawns a new tab every
time. it should reuse an existing, neigboring new tab if possible.
Re: Issue 64254 in chromium: New tab page message is confusing
Re: Issue 64250 in chromium: Active highlight disappears when word contains
repeated search term
Re: Issue 65218 in chromium: Need link for Cloud Print Test page.
Re: Issue 64163 in chromium: Feature request: size of update and progress
bar
Re: Issue 63659 in chromium: Reliability Crash
Issue 66883 in chromium: 'x' button gets highlighted during tab creation.
Re: Issue 65187 in chromium: Tabbed settings blocks Cloud Printing on
Stable channel.
Re: Issue 62722 in chromium: Add context-menu option to instantiate a
blocked plugin
Re: Issue 47150 in chromium: fails to update with error 12
Re: Issue 59704 in chromium: Timebar is not scaled when video is zoomed
Re: Issue 57370 in chromium: Some Chrome extensions fail to install
Re: Issue 62582 in chromium: CRASH @ TabContents GetNativeView
--
Automated mail from issue updates at http://crbug.com/
Subscription options: http://groups.google.com/a/chromium.org/group/chromium-bugs
c***@googlecode.com
2010-12-15 03:35:11 UTC
Permalink
Your project notifications generated too many emails to send
individually. Here are the subject lines of the emails you would have
received:

Re: Issue 66424 in chromium: Re-Connecting to SSL server which requires a
client cert does not prompt if no cert was sent in the first visit
Re: Issue 66901 in chromium: Browser crash @
TemplateURLTableModel::MakeDefaultTemplateURL
Re: Issue 66776 in chromium: Allow Autofill data to to be managed online in
Chrome Sync section of google.com/dashboard/
Re: Issue 66891 in chromium: DisableSpdy=true downloads page in Ubuntu
10.10
Issue 66908 in chromium: Autofill preview filling with type-ahead
Issue 66907 in chromium: It's not obvious what extensions in the task
manager have background apps
Re: Issue 51746 in chromium: Context menu's not appearing for the correct
renderer elements.
Re: Issue 66818 in chromium: Layout Test
fast/forms/ValidityState-typeMismatch-url.html is failing
Issue 66909 in chromium: Flash video is not showning
Issue 66910 in chromium: PDF in iFrame scales to 10% size
Re: Issue 66905 in chromium: Flash will not switch to full screen mode on
some pages
Re: Issue 64109 in chromium: Several sync integration tests fail during
setup due to unexpected value of observed_passphrase_required()
Re: Issue 58007 in chromium: allow content scripts to be dynamically
enabled/disabled
Re: Issue 32967 in chromium: Some feeds not properly detected by the RSS
extensions
Issue 66911 in chromium: Pinned Tabs Do Not Respect Ctrl+W Keyboard Command
Re: Issue 66818 in chromium: Layout Test
fast/forms/ValidityState-typeMismatch-url.html is failing
Re: Issue 66653 in chromium: iGoogle side tabs
Re: Issue 66901 in chromium: Browser crash @
TemplateURLTableModel::MakeDefaultTemplateURL
Re: Issue 27131 in chromium: Layout tables in remote fonts (@font-face) are
not supported
Issue 66912 in chromium: spell check does not work in facebook status
update.
Re: Issue 150 in chromium: Type-ahead-find
Re: Issue 66038 in chromium: Sometimes Chrome crashes on opening
live-content Flash -enabled pages
Re: Issue 66912 in chromium: spell check does not work in facebook status
update.
Re: Issue 66908 in chromium: Autofill preview filling with type-ahead
Re: Issue 63429 in chromium: Flash hangs browser window
Issue 66913 in chromium: Changing the opacity of a checkbox via CSS results
in the top border of the checkbox getting visibly clipped
Re: Issue 60479 in chromium: The problem of preserving file
Re: Issue 66424 in chromium: Re-Connecting to SSL server which requires a
client cert does not prompt if no cert was sent in the first visit
Re: Issue 7508 in chromium: We don't anti-alias <canvas> drawImage
Re: Issue 66908 in chromium: Autofill preview filling with type-ahead
Re: Issue 66908 in chromium: Autofill preview filling with type-ahead
Re: Issue 24910 in chromium: Too many steps to add a new histogram to the
dashboard
Re: Issue 57255 in chromium: Error 118 (net::ERR_CONNECTION_TIMED_OUT)
after HTTPS URL navigation
Re: Issue 54068 in chromium: Software drawing from a canvas' backing
ImageBuffer can produce stale results
Issue 66914 in chromium: Chrome crashes when editing an exception under
DOMUI : 0x03528917 [Google Chrome Framework -
content_settings_handler.cc:683]
ContentSettingsHandler::CheckExceptionPatternValidity
Re: Issue 66911 in chromium: Pinned Tabs Do Not Respect Ctrl+W Keyboard
Command
Re: Issue 66736 in chromium: MSI rolls out fine, but next patch release
requires UAC from users(!)
Issue 66915 in chromium: website not loading
Re: Issue 60151 in chromium: Create testcases for PDF Viewer
Re: Issue 66914 in chromium: Chrome crashes when editing an exception under
DOMUI : 0x03528917 [Google Chrome Framework -
content_settings_handler.cc:683]
ContentSettingsHandler::CheckExceptionPatternValidity
Re: Issue 66914 in chromium: Chrome crashes when editing an exception under
DOMUI : 0x03528917 [Google Chrome Framework -
content_settings_handler.cc:683]
ContentSettingsHandler::CheckExceptionPatternValidity
Issue 66916 in chromium: n/w error issue: Error 401
Re: Issue 66496 in chromium: Flash displaying incorrectly, not drawing full
area
Re: Issue 66908 in chromium: Autofill preview filling with type-ahead
Re: Issue 66916 in chromium: n/w error issue: Error 401
Re: Issue 56730 in chromium: No renderer crash dumps on Maverick
Re: Issue 56013 in chromium: Chorme Locksup/Unresponsive When Opening With
a Tab Requesting User/Pass in OS "Chrome"
Issue 66917 in chromium: 0x9259c903 [AppKit + 0x002ac903]
CopyAppKitUIElementAttributeValueNoCatch
Re: Issue 63874 in chromium: Error 401(net::ERR_CACHE_READ_FAILURE):
unknown error
Re: Issue 66916 in chromium: n/w error issue: Error 401
Re: Issue 59374 in chromium: Images display incorrectly in Chrome
Re: Issue 66622 in chromium: about a period of browsing, Chrome stops
sending HTTP requests
Issue 66918 in chromium: Page looks way off (Craigslist)
Re: Issue 66424 in chromium: Re-Connecting to SSL server which requires a
client cert does not prompt if no cert was sent in the first visit
Re: Issue 59282 in chromium: DOMUI: Implement the new 'Saved Passwords'
sub-page
Issue 66919 in chromium: Enabling the seccomp sandbox weakens the SUID
sandbox
Issue 66920 in chromium: Shift+Enter for .net & Ctrl+Shift+Enter for .org
Re: Issue 28359 in chromium: Corrupted history after submit in iframe
Issue 66921 in chromium: URL preview covers the rendered page
Issue 66922 in chromium: Highlighting an image doesn't show up (no blue
highlight) on a single image's page
Re: Issue 66921 in chromium: URL preview covers the rendered page
Issue 66923 in chromium: Layout test failures:
fast/css/focus-ring-detached.html and fast/css/focus-ring-multiline.html
Issue 66924 in chromium: Downloads page should show times not just dates
Issue 66925 in chromium: A couple of extensions sync integration tests
failing on the chromium builders
Re: Issue 66925 in chromium: A couple of extensions sync integration tests
failing on the chromium builders
Re: Issue 53977 in chromium: NTP: It should be possible to reorder apps via
drag+drop
Re: Issue 62875 in chromium: DOMUI: Section labels shouldn't have : at the
end
Re: Issue 66914 in chromium: Chrome crashes when editing an exception under
DOMUI : 0x03528917 [Google Chrome Framework -
content_settings_handler.cc:683]
ContentSettingsHandler::CheckExceptionPatternValidity
Re: Issue 66081 in chromium: Fix unsafe downloads pyauto tests
Re: Issue 57875 in chromium: NavigateToURL does not trigger a successful
download for dangerous filetypes
Re: Issue 66925 in chromium: A couple of extensions sync integration tests
failing on the chromium builders
Issue 66926 in chromium: Clicking Buttons
Re: Issue 46852 in chromium: Remove phantom tabs
Issue 66927 in chromium: PDFs on Linux are asking printer for wrong size
paper
Issue 66928 in chromium: Tab key does not work as expected for 'Basic Auth'
popup
Re: Issue 66920 in chromium: Shift+Enter for .net & Ctrl+Shift+Enter
for .org
Re: Issue 791 in chromium: Omnibox does not support [ctrl-]shift-enter
Re: Issue 65948 in chromium: Memory corruption from network stack?
Re: Issue 60038 in chromium: Citibank website, loads then goes completely
blank
Issue 66929 in chromium: Tab should convert instant suggest into inline
autocomplete suggest.
Re: Issue 66888 in chromium: instant: when cookies are blocked, instant
seems broken
Re: Issue 66740 in chromium: backspacing through search terms makes instant
disappear on linux
Re: Issue 66038 in chromium: Sometimes Chrome crashes on opening
live-content Flash -enabled pages
Re: Issue 65987 in chromium: Embedded Flash videos and other Adobe flash
objects are either blank or have their bottoms cut off.
Re: Issue 65987 in chromium: Embedded Flash videos and other Adobe flash
objects are either blank or have their bottoms cut off.
Re: Issue 65987 in chromium: Embedded Flash videos and other Adobe flash
objects are either blank or have their bottoms cut off.
Issue 66930 in chromium: FirstRunSearchEngineView appearing at unusual times
Re: Issue 66929 in chromium: Tab should convert instant suggest into inline
autocomplete suggest.
Re: Issue 60038 in chromium: Citibank website, loads then goes completely
blank
Re: Issue 66930 in chromium: FirstRunSearchEngineView appearing at unusual
times
Issue 66931 in chromium: Google Chrome crashes at
https://webmail.afmc.af.mil/Exchange
Re: Issue 27131 in chromium: Layout tables in remote fonts (@font-face) are
not supported
Re: Issue 66736 in chromium: MSI rolls out fine, but next patch release
requires UAC from users(!)
Re: Issue 65987 in chromium: Embedded Flash videos and other Adobe flash
objects are either blank or have their bottoms cut off.
Re: Issue 65955 in chromium: Flash video paints partially
Re: Issue 35000 in chromium: Bad parsing of multiple selectors in style
element
Re: Issue 61101 in chromium: Alignment of theme_frame_overlay for themes
Re: Issue 65955 in chromium: Flash video paints partially
Re: Issue 66880 in chromium: Flash Video Cut in half (or not visible)
Re: Issue 65955 in chromium: Flash video paints partially
Re: Issue 66601 in chromium: Video cut (black strip overlays bottom 1/3),
wmp plugin
Re: Issue 64388 in chromium: Crash while trying to run code while quiting...
Re: Issue 66534 in chromium: Flash movies display only upper part
--
Automated mail from issue updates at http://crbug.com/
Subscription options: http://groups.google.com/a/chromium.org/group/chromium-bugs
c***@googlecode.com
2010-12-15 18:11:50 UTC
Permalink
Your project notifications generated too many emails to send
individually. Here are the subject lines of the emails you would have
received:

Re: Issue 34509 in chromium: Vertical Tabs
Re: Issue 66987 in chromium: form.action changes when node imported into
iframe
Re: Issue 44798 in chromium: Wheel mouse scrolls down the page but not back
up.
Re: Issue 66991 in chromium: "This is probably not the site you are looking
for!" error is still shown despite disabling phishing protection in options
Issue 66999 in chromium: Missing Plugin, Flash
Re: Issue 24704 in chromium: Application Failed to initialize properly
(0xc0000022)
Re: Issue 28174 in chromium: Remove urls from locale_settings.grd
Issue 67000 in chromium: Missing Plugin, Flash
Re: Issue 2678 in chromium: Downloads often not starting (when switching
proxy configuration often)
Re: Issue 66987 in chromium: form.action changes when node imported into
iframe
Re: Issue 66736 in chromium: MSI rolls out fine, but next patch release
requires UAC from users(!)
Re: Issue 42031 in chromium: Web Inspector Console should have
scroll-locking and support for search
Issue 67001 in chromium: gfx:GetNamedGLImplementation() declaration
incompatible with implementation
Re: Issue 66515 in chromium: Some regular expressions throw SyntaxError:
Invalid character range
Re: Issue 67000 in chromium: Missing Plugin, Flash
Re: Issue 66999 in chromium: Missing Plugin, Flash
Re: Issue 65596 in chromium: Reduce delay between search results page
vertical shift and omnibox dropdown size change
Re: Issue 42031 in chromium: Web Inspector Console should support search
Re: Issue 65617 in chromium: Chrome and ChromeFrame hang up on Dojo Grids
Re: Issue 2606 in chromium: Chrome doesn't work with "keypress" event and
arrow keys.
Re: Issue 58235 in chromium: Integrate with API for deleting Flash Player
LSOs
Re: Issue 51570 in chromium: proxy username and password are requested
several times
Re: Issue 64943 in chromium: Create application shortcut crashes the browser
Issue 67003 in chromium: Opacity does not work with <object> and jquery
colorbox
Issue 67004 in chromium: Chromium breaks an extension
Re: Issue 66736 in chromium: MSI rolls out fine, but next patch release
requires UAC from users(!)
Issue 67005 in chromium: q=json in querystring breaks the chrome browser |
shame
Re: Issue 66736 in chromium: MSI rolls out fine, but next patch release
requires UAC from users(!)
Re: Issue 66958 in chromium: When removing items from Autofill list next
item should highlight
Re: Issue 66956 in chromium: Cannot multi-select in Autofill manager
Re: Issue 66958 in chromium: When removing items from Autofill list next
item should highlight
Re: Issue 15548 in chromium: Search Engines should be synced
Issue 67006 in chromium: IndexedDB: Exception codes get garbled across IPC?
Re: Issue 66958 in chromium: When removing items from Autofill list next
item should highlight
Re: Issue 67000 in chromium: Missing Plugin, Flash
Re: Issue 66742 in chromium: Problem when printing a PDF
Re: Issue 66000 in chromium: No google images!
Re: Issue 65084 in chromium: second rundll32.exe started by Chrome
interrupts other computer processes
Issue 67007 in chromium: Print Setup
Re: Issue 66900 in chromium: PDF files
Re: Issue 65953 in chromium: window.opener not restored after cross-site
navigations
Re: Issue 65395 in chromium: Chrome PDF Viewer plugin shrinks PDF and
entire surrounding page
Re: Issue 66355 in chromium: Implement Wrench Menu / Screenshot in "Report
a Bug" feature
Re: Issue 66877 in chromium: Not Support DivX Format
Re: Issue 65395 in chromium: Chrome PDF Viewer plugin shrinks PDF and
entire surrounding page
Re: Issue 66083 in chromium: Pages are loading at 14% - not 100% And
<control> <+> <0> won't fix it
Re: Issue 65395 in chromium: Chrome PDF Viewer plugin shrinks PDF and
entire surrounding page
Re: Issue 66910 in chromium: PDF in iFrame scales to 10% size
Re: Issue 66958 in chromium: When removing items from Autofill list next
item should highlight
Re: Issue 13233 in chromium: Typing into Flash with wmode = opaque|
transparent and non-latin language active outputs as if US keyboard layout
active
Re: Issue 66983 in chromium: flash+input+wmode+´ ^ ~=error
Re: Issue 66736 in chromium: MSI rolls out fine, but next patch release
requires UAC from users(!)
Re: Issue 66626 in chromium: Flash not displaying!
Re: Issue 66785 in chromium: I have no sound on google chrome
Re: Issue 65876 in chromium: Can't search Web Store by developer
Re: Issue 947 in chromium: Printer Setup missing
Re: Issue 67007 in chromium: Print Setup
Re: Issue 65547 in chromium: "Network is no available" message when
accessing HTML5 AppCache App for the first time
Re: Issue 65959 in chromium: hyphenation errors
Re: Issue 66573 in chromium: Assert error when using Chrome mjutil.cpp
Re: Issue 61679 in chromium: Unresponsive plug-in leads to complete
computer crash
Re: Issue 67005 in chromium: q=json in querystring breaks the chrome
browser | shame
Re: Issue 66812 in chromium: Flash sites stall entire tab after gcswf32.dll
crash.
Issue 67008 in chromium: Dragging file while gmail has chat window open
causes page to truncate
Re: Issue 66501 in chromium: cant enable 3rd party flash support
Issue 67009 in chromium: Can't Specify All Icon Sizes for Extension
Re: Issue 66552 in chromium: Sometimes renderer unfocuses browser window
when clicked
Re: Issue 65832 in chromium: Official Google-made Web Apps lacking 16x16
icons.
Re: Issue 66109 in chromium: constant flash player down
Re: Issue 65084 in chromium: second rundll32.exe started by Chrome
interrupts other computer processes
Re: Issue 66877 in chromium: Not Support DivX Format
Re: Issue 66495 in chromium: Flash Videos on sites such as Vureel using JW
Player don't play
Re: Issue 66668 in chromium: VideoStopLoad- crash
Re: Issue 67004 in chromium: REGRESSION: Elements with webkit-transform
applied don't respond to hover/click events
Re: Issue 66742 in chromium: Problem when printing a PDF
Re: Issue 66951 in chromium: font-variant CSS property is not working
Re: Issue 66771 in chromium: Google Reader Note plugin/bookmarklet does not
work on Youtube when using the XSS auditor
Re: Issue 66091 in chromium: Facebook flash sometimes not loading therefore
no notifications, posting not working etc.
Re: Issue 64167 in chromium: A blank line appears
Re: Issue 66569 in chromium: Flash menu disappears
Re: Issue 61004 in chromium: ppapi/c uses enums which aren't guaranteed to
have consistent size
Re: Issue 65259 in chromium: Flash wont resize on browser maximise
Re: Issue 65908 in chromium: flash crash
Re: Issue 67006 in chromium: IndexedDB: Exception codes get garbled across
IPC?
Re: Issue 38967 in chromium: Accelerated plugins (GPU, Core Animation) need
to support layering
Re: Issue 65722 in chromium: Wrong site layout with embedded flash
Re: Issue 65882 in chromium: Flash visuals are not rendered on second
screen of zaphod-style dual-screen display
Re: Issue 65208 in chromium: Chrome won't play flash videos
Re: Issue 65177 in chromium: Flash Error
Re: Issue 65166 in chromium: Flash in new Sandbox mode not showing all of a
users folders, files and libraries on their PC?
Re: Issue 63706 in chromium: All my flash player is miss plug-in in this
version
Re: Issue 65114 in chromium: Flash problem
Re: Issue 63706 in chromium: All my flash player is miss plug-in in this
version
Re: Issue 65632 in chromium: Chrome app shortcut icons should not have
their icon updated like URL shortcuts.
Re: Issue 58007 in chromium: allow content scripts to be dynamically
enabled/disabled
Re: Issue 65632 in chromium: Chrome app shortcut icons should not have
their icon updated like URL shortcuts.
Re: Issue 64932 in chromium: Put NTP app shortcut menu option in its own
section
Re: Issue 66736 in chromium: MSI rolls out fine, but next patch release
requires UAC from users(!)
Re: Issue 66006 in chromium: REGRESSION: cannot play Java applets
Re: Issue 66905 in chromium: Flash switches to full screen behind current
window on some pages
Re: Issue 66736 in chromium: MSI rolls out fine, but next patch release
requires UAC from users(!)
Re: Issue 65955 in chromium: Flash video paints partially
Re: Issue 65026 in chromium: Options/Basics tab truncation with Enterprise
policy setting.
--
Automated mail from issue updates at http://crbug.com/
Subscription options: http://groups.google.com/a/chromium.org/group/chromium-bugs
c***@googlecode.com
2010-12-17 20:06:39 UTC
Permalink
Your project notifications generated too many emails to send
individually. Here are the subject lines of the emails you would have
received:

Re: Issue 67334 in chromium: Right click inside a frame not show the "open
frame in new tab"
Re: Issue 66129 in chromium: "Open frame in..." context menu entries
disappear from context menu
Issue 67340 in chromium: Hulu player is see-thru and doesn't display video
in chrome. SS attached.
Re: Issue 67162 in chromium: Open Frame in new XXX
Issue 67341 in chromium: Printing directly without confirmation dialog
Re: Issue 67333 in chromium: Browser will not open after daily update
Re: Issue 67335 in chromium: Browser will not open after daily update
Re: Issue 58985 in chromium: Unlimited Storage permission should apply to
Local Storage
Re: Issue 66480 in chromium: Renderer crash @
WebCore::CachedResource::errorOccurred()
Issue 67342 in chromium: Zimbra shows a blank editor on reply to html
messages
Re: Issue 9044 in chromium: Modify "dangerous downloads" prompt algorithm
Re: Issue 67329 in chromium: Cannot move the window using context menu from
title bar.
Re: Issue 66130 in chromium: Crash when using Page Up/Down multiple times
in PDF file
Re: Issue 58985 in chromium: Unlimited Storage permission should apply to
Local Storage
Issue 67343 in chromium: Autofill should be smart about "Address line 2"
and "Company name" if the form has only one "Address" field
Re: Issue 58985 in chromium: Unlimited Storage permission should apply to
Local Storage
Re: Issue 59665 in chromium: media/video layout test flakiness on Mac DRT
Re: Issue 62964 in chromium: [LTTF][Flakiness] failure investigation of
media/remove-while-loading.html,
http/tests/media/video-play-stall-seek.html,
http/tests/media/video-play-stall.html,
http/tests/media/video-seekable-stall.html
Re: Issue 67299 in chromium: chrome incorrectly opens pdf file so that
normal pdf toolbar is lost (e.g. no print icon)
Re: Issue 56449 in chromium: Crash in Pickle::ReadInt in
net::HttpResponseInfo::InitFromPickle
Re: Issue 60761 in chromium:
chrome_1c30000!TabContents::RemoveInfoBar(class InfoBarDelegate * delegate
= 0x05dfe700)+0x1dfull tab crash
Re: Issue 63529 in chromium: Security: Segfault when dealing with Web
Workers and MessageChannels
Re: Issue 63302 in chromium: WebCore::ScriptElementData::execute (crash -
null ptr deref?)
Re: Issue 66480 in chromium: Renderer crash @
WebCore::CachedResource::errorOccurred()
Re: Issue 65039 in chromium: Crash in AsyncScriptRunner class
Re: Issue 63302 in chromium: WebCore::ScriptElementData::execute (crash -
null ptr deref?)
Re: Issue 58985 in chromium: Unlimited Storage permission should apply to
Local Storage
Re: Issue 67179 in chromium: Error opening pdf with Adobe Reader after
saving pdf using Chrome PDF Viewer
Issue 67344 in chromium: Memory leak in chrome.extension.sendRequest()
Re: Issue 67328 in chromium: https://secure.solve360.com/ does not load on
Chromium
Re: Issue 67215 in chromium: Sandbox performs some case-sensitive name
comparisons.
Re: Issue 67304 in chromium: Case sensitive comparison in the file
win_utils.cc
Re: Issue 67166 in chromium: Opening web page with a PDF file will shrink
the zoom level to 10% if Chrome PDF Viewer is enabled
Issue 67345 in chromium: Google Body Browser either hangs or logs out
(Ubuntu)
Issue 67346 in chromium: javascript function parsing fails
Re: Issue 58985 in chromium: Unlimited Storage permission should apply to
Local Storage
Issue 67347 in chromium: Section separators are wrong if the last section
is hidden
Re: Issue 67185 in chromium: Sandboxed Flash broken
Re: Issue 64388 in chromium: Crash while trying to run code while quiting...
Issue 67348 in chromium: MSI DisplayVersion to match Chrome version
Re: Issue 64883 in chromium: Quicktime streaming video is flickering like
mad until browser window is resized
Re: Issue 64972 in chromium: When dropping a tab in a window, the tab is
animated from the wrong location
Re: Issue 66887 in chromium: When instant is enabled don't show suggestions
that looks like urls.
Re: Issue 67163 in chromium: Pen pressure events are absent
Re: Issue 66532 in chromium: Can't close tabs while non-modal "Please
restart google chrome" dialog is open
Re: Issue 66931 in chromium: Google Chrome crashes at
https://webmail.afmc.af.mil/Exchange
Re: Issue 66590 in chromium: Chrome renders characters "fi" as "Æ" in pdf
Re: Issue 67092 in chromium: Flash internal player FULL of bugs
Re: Issue 67181 in chromium: Crash in
NotificationOptionsMenuModel::ExecuteCommand
Re: Issue 67091 in chromium: PDF Print Scaling Off
Re: Issue 9044 in chromium: Modify "dangerous downloads" prompt algorithm
Re: Issue 67182 in chromium: Mac Dashboard causes fullscreen mode to stop
working properly
Re: Issue 67261 in chromium: A SQL leak in
appcache::AppCacheDatabase::PrepareCachedStatement()
Re: Issue 67182 in chromium: Mac Dashboard causes fullscreen mode to stop
working properly
Re: Issue 67102 in chromium: extension syncing is not working
Re: Issue 67134 in chromium: Choosing "Print..." and immediately closing
the tab causes a crash.
Issue 67349 in chromium: Chrome experiences only half the video embed
showing up, other embeds have total missing videos.
Re: Issue 65780 in chromium: Can't select file on mac with Accept parameter
of <input type=file />
Issue 67350 in chromium: Most recent beta (switch to 9.x) breaks GTK theme
Re: Issue 60022 in chromium: Autofill i18n: Develop a system for validating
Autofill heuristics from HTML input
Re: Issue 67328 in chromium: https://secure.solve360.com/ does not load on
Chromium
Re: Issue 63470 in chromium: Short "freeze" when refreshing
Re: Issue 67270 in chromium: video don't work
Issue 67351 in chromium: Can't sync the browser with my Google account
because it crash when Sign in
Re: Issue 62859 in chromium: IsDefaultSearchProvider and
SetDefaultSearchProvider methods
Re: Issue 65151 in chromium: Use _GLIBCXX_DEBUG in Debug builds for better
checking
Re: Issue 67311 in chromium: Chrome does crash if geolocation experimental
feature is enabled
Re: Issue 20809 in chromium: DownloadTest is flaky on Windows
Re: Issue 9044 in chromium: Modify "dangerous downloads" prompt algorithm
Re: Issue 35275 in chromium: Download tests are so flaky, because they
don't wait properly
Issue 67352 in chromium: google image search return black pictures
Issue 67353 in chromium: google image search return black pictures
Re: Issue 66605 in chromium: Chrome 9 and 10 can't change to Japanese or
Chinese input, just can type in English words.
2 issues changed in chromium
Re: Issue 65803 in chromium: Chrome windows do not close properly.
Re: Issue 66887 in chromium: When instant is enabled don't show suggestions
that looks like urls.
Re: Issue 43066 in chromium: DownloadTest.[Dont]CloseNewTab* tests are flaky
Re: Issue 35275 in chromium: Download tests are so flaky, because they
don't wait properly
Re: Issue 67067 in chromium: CSS ignored
Re: Issue 66605 in chromium: Chrome 9 and 10 flash game: can't change to
Japanese or Chinese input, just can type in English words.
Re: Issue 41861 in chromium: Downloading any and all files/extensions
causes Chrome to crash
Re: Issue 67252 in chromium: <audio> continues to play after navigating
away from page
Issue 67354 in chromium: about:gpu on version 9 in ubuntu shows all 0's
Issue 67355 in chromium: Can't make Firefox or IE default when uninstalling
Chrome on XP
Issue 67356 in chromium: Chrome 10 dev crashing upon exit
Re: Issue 67109 in chromium: command-shift-r does still produces 304s.
Re: Issue 67355 in chromium: Can't make Firefox or IE default when
uninstalling Chrome on XP
Re: Issue 67177 in chromium: Google Body Browser crashes my X server
Re: Issue 63493 in chromium: Download system refactor to eliminate
flakiness and raciness
Re: Issue 61715 in chromium: Total crash of browser
Re: Issue 67071 in chromium: Allow higher quotas for sqlite3 local databases
Re: Issue 66781 in chromium: Extensions chevron should display while
dragging splitter, not wait until release
Issue 67357 in chromium: The blue route of google map is missing when
printing with chrome
Re: Issue 66852 in chromium: Allow notifications to be sent to growl on OS X
Issue 67358 in chromium: ft.com sites no longer accept posts
Re: Issue 67155 in chromium: Chrome's self-update doesn't work with others
than the Darwin coreutils on OSX
Re: Issue 67348 in chromium: MSI DisplayVersion to match Chrome version
Re: Issue 9044 in chromium: Modify "dangerous downloads" prompt algorithm
Re: Issue 67353 in chromium: google image search return black pictures
Re: Issue 67352 in chromium: google image search return black pictures
Re: Issue 47800 in chromium: Chrome: Crash Report - Stack Signature:
download_util::UpdateAppIconDownloadProgress(int,bool,float)-f2db225e_95e576a3_035453dd_304b0407_9b784cbd
Re: Issue 65755 in chromium: After Flash crashes, some plugins leave a hole
on pages
Re: Issue 67340 in chromium: Hulu player is see-thru and doesn't display
video in chrome. SS attached.
--
Automated mail from issue updates at http://crbug.com/
Subscription options: http://groups.google.com/a/chromium.org/group/chromium-bugs
c***@googlecode.com
2010-12-21 00:02:11 UTC
Permalink
Your project notifications generated too many emails to send
individually. Here are the subject lines of the emails you would have
received:

Issue 67623 in chromium: Browser crash on shutdown inside
DispatchSimpleBrowserEvent
Re: Issue 67516 in chromium: Closure and Global variable details
automatically collapsing on each step through javascript code
Re: Issue 67463 in chromium: caret-mode-paragraph-keys-navigation.html
fails on mac
Re: Issue 65949 in chromium: Mac times out on three tests
Re: Issue 66073 in chromium: Bad text rendering when highlighting with
specific CSS
Re: Issue 54274 in chromium: After traveling from UK to US, url bar keeps
searching from google.co.uk
Re: Issue 67526 in chromium: slides.html5rocks.com no work properly
Re: Issue 67378 in chromium: Memory leaks in V8 3.0.3 update
Re: Issue 67063 in chromium: DevTools: Allow overriding User Agent from
within Developer Tools.
Re: Issue 67621 in chromium: file_util_win.cc Delete can fail silently
Re: Issue 67070 in chromium: DevTools: Styles ending with two semicolons
confuse styles inspector
Re: Issue 61226 in chromium: Surround downmix losses channels on Windows
Re: Issue 65932 in chromium: UninitValue memcheck errors in
WebCore::InlineFlowBox::placeBoxesInBlockDirection
Re: Issue 66498 in chromium: Sprite resizing should be based on lines
visible in unresized sprite only
Re: Issue 66709 in chromium: RTL: Select with size element is always left
aligned even when dir=rtl
Re: Issue 66751 in chromium: Layout test failures:
http/tests/local/link-stylesheet-load-order-preload.htm and
http/tests/local/link-stylesheet-load-order.html
Re: Issue 66854 in chromium: Perf timeout in typing-at-end-of-line.html
Re: Issue 60223 in chromium: [LTTF][Flakiness] Failure investigation of
media/controls-styling.html
Re: Issue 66922 in chromium: Highlighting an image doesn't show up (no blue
highlight) on a single image's page
Re: Issue 67116 in chromium: BestBuy account creation page fails to load
Re: Issue 67457 in chromium: TestShell links in both libwebkit_support.a
and libtest_shell_common.a, which define the same symbols
Re: Issue 63842 in chromium: Implement new 'Fonts and Encoding' subpage
Re: Issue 67522 in chromium: Implement load event for <link> element
Re: Issue 64928 in chromium: Devtools search very slow in gmail message
Re: Issue 64511 in chromium: css style="max-width:none" works wrong
Re: Issue 67619 in chromium: Black box problem
Re: Issue 57004 in chromium: Inline scripts and Java loaded through applet
tags do not fire beforeLoad events
Re: Issue 64952 in chromium: fast/ruby/nested-ruby.html occasionally crashes
Re: Issue 64846 in chromium: document.hasFocus() always returns true
Re: Issue 65803 in chromium: Chrome windows do not close properly.
Re: Issue 2010 in chromium: Feature: An option to disable the 'Expired
Certificate" warning for a specific site
Issue 67624 in chromium: Pepper: FileRef Rename should probably abort the
callback when either (original or new) FileRef resource is destroyed
Re: Issue 65011 in chromium: Image zoom affects parent page zoom, and
vice-versa
Re: Issue 62319 in chromium: Middle Click with named Target opening in
foreground
Re: Issue 67620 in chromium: BrowserAccessibilityManager needs to reuse the
BrowserAccessibility instances instead of recreating them when possible.
Re: Issue 67619 in chromium: Black box problem
Re: Issue 65101 in chromium: Broken looking page http://www.euroeyes.com
Re: Issue 67612 in chromium: Window resizing shows blue borders at right
and top (!) edge
Re: Issue 67619 in chromium: Black box problem
Re: Issue 66846 in chromium: Chrome 8.0.552.224 crashes like crazy
Re: Issue 67428 in chromium: Crash during startup after update
Re: Issue 67523 in chromium: Editing post in Tumblr crashing Chrome
Re: Issue 67428 in chromium: Crash during startup after update
Re: Issue 65348 in chromium: Implement something similar to mozPaintCount
Re: Issue 65288 in chromium: Unknown symbols in popup menu
Re: Issue 67239 in chromium: REGRESSION: Chromium crashes on attempt to
sync.
Re: Issue 65424 in chromium: range insertNode function does not update
content in the inspector
Re: Issue 63808 in chromium: Search box should have a 24px right margin
Issue 67625 in chromium: Change colors with rules ... fails in the
following situation
Re: Issue 67425 in chromium: canary startup crash
Re: Issue 67239 in chromium: REGRESSION: Chromium crashes on attempt to
sync.
Re: Issue 64997 in chromium: Hide the "Other Bookmarks" folder when it's
empty
Re: Issue 67356 in chromium: Chrome 10 dev crashing upon exit
Re: Issue 63983 in chromium: Few divs not displayed
Re: Issue 63825 in chromium: Implement 'Search Engines' subpage
Re: Issue 65495 in chromium: Royal mail website doesn't display properly
Re: Issue 62161 in chromium: Safe-browsing bloom-filter reader fails when
size is at max.
Re: Issue 61784 in chromium: Paste into textarea broken in certain
circumstances
Re: Issue 61784 in chromium: Paste into textarea broken in certain
circumstances
Re: Issue 65676 in chromium: Audit DownloadRequestLimiter behavior
Re: Issue 65686 in chromium: https site doesn't load on Snow Leopard
Re: Issue 65710 in chromium: Developer console unresponsive for background
page
Re: Issue 67293 in chromium: Black image in Google Image Search
Re: Issue 62988 in chromium: Copy broken on about pages on win7
Re: Issue 65731 in chromium: CSS3 multi column layout doesn't work as
expected with min-height
Re: Issue 65751 in chromium: [Google Chrome Framework -
FrameView.cpp:2180]
WebCore::FrameView::updateLayoutAndStyleIfNeededRecursive
Re: Issue 62079 in chromium: Default plugin should be re-implemented using
WebViewPlugin (HTML)
Re: Issue 62438 in chromium: www.yciusa.com is not viewing correctly in
google chrome, but the page does view correctly in firefox and also in
safari.
Re: Issue 64719 in chromium: Once password is filled, cannot tab away from
username field
Re: Issue 67353 in chromium: google image search return black pictures
Re: Issue 37402 in chromium: submit disabled="disabled" doesn't stop form
from being posted with ENTER key
Re: Issue 65714 in chromium: Cannot delete ApplicationCache via Developer
Tools
Re: Issue 65950 in chromium: Element inspector displays wrong element size
when zoomed in
Re: Issue 66458 in chromium: Developer Tools pop up the unresponsive dialog
when at a javascript breakpoint
Re: Issue 66666 in chromium: EventSource doesn't works
Re: Issue 65695 in chromium: HTML5 - Number field will not increment when
another field has autofocus
Re: Issue 66628 in chromium: Checkboxes in CSS Debugger should be to the
left side !
Re: Issue 66583 in chromium: Scrolling is extremely slow for pages with
data: url on Windows
Re: Issue 57310 in chromium: Chrome: Crash Report - Stack Signature:
NPAPI::PluginInstance::NPP_GetValue(NPPVariable,void
*)-32054749_ba1f96c4_3a70775b_bae1a079_bb1db2f0
Re: Issue 67093 in chromium: Tabbed options let you edit urls of
prepopulated search engines
Re: Issue 43926 in chromium: .live() and other jquery functions break
Re: Issue 56845 in chromium: EXIF orientation is ignored
Re: Issue 66098 in chromium: NULL deref in
WebCore::HTMLEntitySearch::advance
Re: Issue 16650 in chromium: Tab title has a title even though the title
has changed
Re: Issue 57990 in chromium: Console log objects truncates long strings
without indication
Re: Issue 19026 in chromium: Summary of double-clicking selection bugs
Issue 67626 in chromium: Tab to search is broken
Re: Issue 66066 in chromium: webkitNotification onclick handler sometimes
silently fails
Re: Issue 60223 in chromium: [LTTF][Flakiness] Failure investigation of
media/controls-styling.html
Re: Issue 67581 in chromium: Version-checking of Adobe Reader when opening
PDF from download shelf
Re: Issue 65339 in chromium: Detect when internal PDF viewer is unable to
display the PDF, and offer to use Reader
Re: Issue 67598 in chromium: Fullscreen - Tab specific
Re: Issue 65676 in chromium: Audit DownloadRequestLimiter behavior
Re: Issue 67626 in chromium: Tab to search is broken
Re: Issue 65939 in chromium: Stuck Facebook Chatboxes.
Re: Issue 65909 in chromium: Wrong page layout
Issue 67627 in chromium: Browser process CHECK failure in
CrxInstaller::InstallCrx
Re: Issue 44017 in chromium: strokeText() produces no output when canvas
dimensions are set dynamically
Re: Issue 67069 in chromium: Use current removes the added pages to startup
Issue 67628 in chromium: search_engines.SearchEnginesTest.testTabToSearch
is flaky
Re: Issue 67627 in chromium: Browser process CHECK failure in
CrxInstaller::InstallCrx
Re: Issue 65758 in chromium: V-Scrollbar rendering issue with Zoom in & out
Re: Issue 67598 in chromium: Fullscreen - Tab specific
--
Automated mail from issue updates at http://crbug.com/
Subscription options: http://groups.google.com/a/chromium.org/group/chromium-bugs
c***@googlecode.com
2010-12-21 03:45:53 UTC
Permalink
Your project notifications generated too many emails to send
individually. Here are the subject lines of the emails you would have
received:

Re: Issue 65712 in chromium: User cannot enter any keys after an item is
chosen from autofill popup.
Re: Issue 66275 in chromium: autofill doesn't work for many sites where it
used to
Re: Issue 53126 in chromium: canvas.toDataURL('image/jpeg') produces an
image/png on Win/Linux
Re: Issue 66960 in chromium: To aid localization action buttons on autofill
preferences should be arrange horizontally below table
Re: Issue 1503 in chromium: Chrome adds extra duplicate extension
Issue 67634 in chromium: chrome stops responding when opening passworded
page in new tab
Re: Issue 66965 in chromium: Additional non-user-entered autofill values
are displayed
Re: Issue 67371 in chromium: can't connect to sync server from gLucid
desktop
Re: Issue 62565 in chromium: Flash plugin crash in
WebPluginAcceleratedSurfaceProxy::context
Re: Issue 61521 in chromium: Crash in Flash Plugin
Re: Issue 33679 in chromium: Chromium doesnt save user and password details
for login form
Re: Issue 67371 in chromium: can't connect to sync server from gLucid
desktop
Re: Issue 33679 in chromium: Chromium doesnt save user and password details
for login form
Re: Issue 34214 in chromium: Chrome won't save passwords for
www.bankaustria.at
Issue 67635 in chromium: --use-spdy=off is broken
Re: Issue 38730 in chromium: password is saved, but not autofilled
Re: Issue 45397 in chromium: No password-saving option on BoerseBZ
Re: Issue 45851 in chromium: no show of a password-saving option on "GW AH"
Re: Issue 46122 in chromium: User/pass Autocomplete fails.
Issue 67636 in chromium: User email displayed in the New Tab page on
setting up the sync
Re: Issue 48953 in chromium: Chrome doesn't save many login informations
Re: Issue 57678 in chromium: no password autocomplete for forms without an
action
Re: Issue 57678 in chromium: no password autocomplete for forms without an
action
Re: Issue 33679 in chromium: Chromium doesnt save user and password details
for login form
Re: Issue 34214 in chromium: Chrome won't save passwords for
www.bankaustria.at
Re: Issue 57678 in chromium: no password autocomplete for forms without an
action
Re: Issue 63739 in chromium: Username disappears after i selected it from
autocomplete dropdown
Re: Issue 64093 in chromium: Sometimes chrome.tabs.executeScript can't
inject scripts into gmail pages
Issue 67637 in chromium: Update not available error 3 cause identified
Re: Issue 48278 in chromium: Border with a color with alpha != 1 breaks
webkit gradient on skia
Re: Issue 66992 in chromium: Form field autocomplete function should
respect user's choice
Re: Issue 67630 in chromium: Signing in to sync on Linux with a user data
directory on NFS can cause Chrome to freeze indefinitely
Re: Issue 66994 in chromium: Data race on bool in HistoryURLProvider::Stop()
Re: Issue 66994 in chromium: Data race on bool in HistoryURLProvider::Stop()
Re: Issue 66994 in chromium: Data race on bool in HistoryURLProvider::Stop()
Issue 67638 in chromium: Wordpress TinyMCE ISSUE!!
Re: Issue 67630 in chromium: Signing in to sync on Linux with a user data
directory on NFS can cause Chrome to freeze indefinitely
Re: Issue 25908 in chromium: Asks to confirm form submission even if page
was loaded using HTTP GET method!
Re: Issue 35257 in chromium: chromium saves wrong password for web.qq.com
Re: Issue 40427 in chromium: Back button deleting form submission
Re: Issue 59281 in chromium: Implement the new Autofill editor sub-page
Issue 67639 in chromium: Flash plugin crash
Re: Issue 62218 in chromium: "Save password" saves value sent in the POST
request instead of the value typed by the user.
Re: Issue 64042 in chromium: Password manager doesn't handle some sites
Re: Issue 67514 in chromium: Margin header and footer missing when printing
(URL, date, page x of y)
Re: Issue 66847 in chromium: Problems Entering Information in saved forms
Re: Issue 62116 in chromium: option to save the password is not
available/offered
Re: Issue 65133 in chromium: Autofill popup should not show functionally
identical suggestions
Re: Issue 67317 in chromium: Facebook buttons/links missing
Re: Issue 66151 in chromium: Instant suggest in omnibox doesn't work very
well when UI and input text have different direction.
Re: Issue 66606 in chromium: Feature Request/Idea
Re: Issue 64093 in chromium: Sometimes chrome.tabs.executeScript can't
inject scripts into gmail pages
Issue 67640 in chromium: flaky compile failure due to unstated dependencies
Re: Issue 67639 in chromium: [Snow Leopard] Flash plugin crash
Issue 67641 in chromium: Assigning to global removes ability to interact
with text in SVG
Re: Issue 65939 in chromium: Stuck Facebook Chatboxes.
Re: Issue 67497 in chromium: Webgl : Body Browser demo crashes renderer
Re: Issue 57236 in chromium: Autofill runs in incognito
Re: Issue 49769 in chromium: Incognito mode still auto-fills saved username
and password
Issue 67642 in chromium: Flash support issue
Re: Issue 67627 in chromium: Browser process CHECK failure in
CrxInstaller::InstallCrx
Re: Issue 9148 in chromium: Feature Request: Remove button next to
downloads in the download page
Issue 67643 in chromium: Add open-in-browser option for downloaded files
Re: Issue 65940 in chromium: Leak in IPC::SyncChannel on Mac Valgrind
Re: Issue 18087 in chromium: Update server not available (error: 3)
Re: Issue 43987 in chromium: Update server not available (error:3)
Re: Issue 58289 in chromium: Update server not available (error: 3)
Re: Issue 67239 in chromium: REGRESSION: Chromium crashes on attempt to
sync.
Re: Issue 67563 in chromium: Ext.js no longer loads as of 10.0.612.1
Issue 67644 in chromium: Problems saving PDF file viewed in Chrome
Re: Issue 67056 in chromium: Clicking on 'Disable individual plugins..'
scroll the page top.
Re: Issue 66976 in chromium: Bugs in how Chrome handles UI scripting like
system events typing
Re: Issue 67640 in chromium: flaky compile failure due to unstated
dependencies
Issue 67645 in chromium: Breast changes are saved and other problems
Re: Issue 66917 in chromium: 0x9259c903 [AppKit + 0x002ac903]
CopyAppKitUIElementAttributeValueNoCatch
Re: Issue 60223 in chromium: [LTTF][Flakiness] Failure investigation of
media/controls-styling.html
Re: Issue 57173 in chromium: Poster image shown when setting video
currentTime
Re: Issue 38204 in chromium: Status Bubble partially obstructs bottom left
of website. The status bar can be turned off in other browsers. Is this
currently possible / when will this be possible in Chrome?
Re: Issue 66965 in chromium: Additional non-user-entered autofill values
are displayed
Re: Issue 66846 in chromium: Chrome 8.0.552.224 crashes like crazy
Re: Issue 67640 in chromium: flaky compile failure due to unstated
dependencies
Re: Issue 67640 in chromium: flaky compile failure in chrome_frame gyp
targets on breakpad
Re: Issue 19360 in chromium: Can't copy table from Excel to Google Docs
Re: Issue 65618 in chromium: Audio element cuts of sounds if played
multiple times on Chrome for Mac
Re: Issue 67526 in chromium: slides.html5rocks.com no work properly
Re: Issue 67645 in chromium: Breast changes are saved and other problems
Re: Issue 67395 in chromium: Autofill saves duplicate profiles and credit
card info in preferences
Re: Issue 32094 in chromium: menu_button and delayedmenu_button should be
merged
Re: Issue 67610 in chromium: Download bug with mp3 songs
Re: Issue 67609 in chromium: Download bug
Issue 67646 in chromium: Snapfish.com page results in an error.
Re: Issue 67646 in chromium: Snapfish.com page results in an error.
Re: Issue 6606 in chromium: Missing MathML implementation
Re: Issue 66846 in chromium: Chrome 8.0.552.224 crashes like crazy
Re: Issue 54274 in chromium: After traveling from UK to US, url bar keeps
searching from google.co.uk
Re: Issue 66846 in chromium: Chrome 8.0.552.224 crashes like crazy
Issue 67647 in chromium: Replace DISABLE_RUNNABLE_METHOD_REFCOUNT with
something less annoying
Re: Issue 67643 in chromium: Add open-in-browser option for downloaded files
Re: Issue 63825 in chromium: Implement 'Search Engines' subpage
Re: Issue 67482 in chromium: Won't load any tabs or pages
Re: Issue 32094 in chromium: menu_button and delayedmenu_button should be
merged
Re: Issue 66151 in chromium: Instant suggest in omnibox doesn't work very
well when UI and input text have different direction.
Re: Issue 67643 in chromium: Add open-in-browser option for downloaded files
--
Automated mail from issue updates at http://crbug.com/
Subscription options: http://groups.google.com/a/chromium.org/group/chromium-bugs
Continue reading on narkive:
Loading...