Discussion:
101 messages from Google Code
(too old to reply)
c***@googlecode.com
2012-08-07 22:52:08 UTC
Permalink
Your project notifications generated too many emails to send
individually. Here are the subject lines of the emails you would have
received:

Re: Issue 112919 in chromium: Unable to exit full screen mode using ESC
when Chrome tab is killed from task manager
Re: Issue 122640 in chromium: [CRASH] Crash happening in
KiFastSystemCallRet-6D74A
Re: Issue 137674 in chromium: Add RegisterProcessUtils() to the appropriate
registrar once it is available upstream.
Re: Issue 128608 in chromium: Video gets stuck in Full Screen mode or in
Normal Mode when using ESC/Full Screen multiple times
Re: Issue 124661 in chromium: [CRASH] Stack Signature:
GetCacheElement(_CONTEXT_ELEMENT *)-7085D
Re: Issue 132572 in chromium: 7.1 MP4 surround is broken
Re: Issue 133084 in chromium: Long seek (sec) is much higher in M21 than in
M19
Re: Issue 137083 in chromium: No update check notification for a while on
about page
Re: Issue 123685 in chromium: IndexedDB worker layout tests flakily time
out when run as browser tests
Re: Issue 133987 in chromium: 192kHz audio not supported via HTML5 on Linux.
Re: Issue 126568 in chromium: Fast speed buttons do not work on Mac/Linux
Re: Issue 141243 in chromium: Consider different account to run cloud print
connector.
Re: Issue 140103 in chromium: Chomoting host loses video if the network
connection is lost briefly
Re: Issue 119631 in chromium: [HTML5] Seek bar keeps shaking/jumping when
on high speed
Re: Issue 141242 in chromium: Copy images fails from browser to clipboard
Re: Issue 140386 in chromium: The webapp should show a helpful error if the
host domain policy is violated in IT2Me.
Re: Issue 123685 in chromium: IndexedDB worker layout tests flakily time
out when run as browser tests
Re: Issue 139659 in chromium: IPCSyncChannelTest.RestrictedDispatchDeadlock
is flaky on CrOS Valgrind
Issue 141245 in chromium: Sync history delete directives
Re: Issue 127646 in chromium: Segmentation fault on start
Issue 141246 in chromium: Pepper flash breaks Adobe Air app
Re: Issue 109794 in chromium: Unable to close the Settings dialog in the
Flash player
Re: Issue 141182 in chromium: NBC tab starts using infinite memory
Re: Issue 109794 in chromium: Unable to close the Settings dialog in the
Flash player
Re: Issue 132561 in chromium: "Last updated" date incorrect After AU in
chrome://chrome page
Re: Issue 141246 in chromium: Pepper flash breaks Adobe Air app
Re: Issue 140944 in chromium: Web intents: invoking an explicit intent fails
Re: Issue 140895 in chromium: GetVersionCallback object is not deleted from
the correct thread.
Re: Issue 6944 in chromium: sandbox tests should not fail when running from
the D:\ drive.
Re: Issue 138116 in chromium: Creating new user does not let me create a
new user
Re: Issue 140051 in chromium: Chromebox key remapping is confusing for
users with a Windows keyboard
Re: Issue 141108 in chromium: Unresponsiveness on the first time i write on
omnibox
Re: Issue 127891 in chromium: Titles are covered with white strips
Re: Issue 140834 in chromium: Fixes for the Window Control Menu
Re: Issue 139738 in chromium: Crash while rendering developer tools.
Re: Issue 141130 in chromium: Back swipe gesture causes scroll bug on Mac
10.8
Re: Issue 140984 in chromium: Cannot remote into a Mac on the login screen
Re: Issue 133003 in chromium: Chromoting: Cleanup usage of string16 in
Windows-only code and fix the presubmit warning about std::wstring.
Re: Issue 140984 in chromium: Cannot remote into a Mac on the login screen
Re: Issue 127891 in chromium: Titles are covered with white strips
Re: Issue 137837 in chromium: getUserMedia infobar UI can get distorted
because of the long "Always allow microphone and camera" string in the
options drop down
Re: Issue 132681 in chromium: Support alternate DNS name for Chromoting
Re: Issue 133003 in chromium: Chromoting: Cleanup usage of string16 in
Windows-only code and fix the presubmit warning about std::wstring.
Re: Issue 134903 in chromium: Can't have global variable called 'toolbar'
in a packaged app
Re: Issue 137941 in chromium: Wifi network's showing up as VPN's
Re: Issue 140779 in chromium: Chrome canary not loading
Re: Issue 141160 in chromium: Win8, Metro mode - clicking the getUserMedia
taskbar notification icon doesn't show a list of pages using camera/mic
Re: Issue 140347 in chromium: Unable to disable Metro interface on windows
8 RP
Re: Issue 140982 in chromium: Chrome 21.0.1180.64 completely broken
Re: Issue 111274 in chromium: Sync: Change of account password triggers
unnecessary re-auth error that never clears; instead we need to message
appropriately the re-encryption
Re: Issue 6944 in chromium: sandbox tests should not fail when running from
the D:\ drive.
Re: Issue 134903 in chromium: Can't have global variable called 'toolbar'
in a packaged app
Re: Issue 111274 in chromium: Sync: Change of account password triggers
unnecessary re-auth error that never clears; instead we need to message
appropriately the re-encryption
Re: Issue 6944 in chromium: sandbox tests should not fail when running from
the D:\ drive.
Re: Issue 111274 in chromium: Sync: Change of account password triggers
unnecessary re-auth error that never clears; instead we need to message
appropriately the re-encryption
Re: Issue 141108 in chromium: Unresponsiveness on the first time i write on
omnibox
Re: Issue 56845 in chromium: EXIF orientation is ignored
Re: Issue 135306 in chromium: gdata_params.h seems unnecessary
Issue 141248 in chromium: Downloaded file info are deleted in
chrome://downloads after crashing the browser with issue 140840
Re: Issue 129458 in chromium: Security: SSL Error with Microsoft issued
certificate
Re: Issue 141248 in chromium: Downloaded file info are deleted in
chrome://downloads after crashing the browser with issue 140840
Re: Issue 122866 in chromium: Remove ParsePinsHeader and ParseSTSHeader
from TransportSecurityState::DomainState
Re: Issue 140982 in chromium: Chrome 21.0.1180.64 completely broken
Re: Issue 111465 in chromium: `build.py` warns when static documentation
files are touched, regardless of regeneration.
Re: Issue 140323 in chromium: Crash in
WebsiteSettingsPopupView::OnWidgetClosing
Re: Issue 116317 in chromium: Switch NaCl's PPAPI Proxy to use Chrome IPC
and its IPC-based Proxy.
Re: Issue 13794 in chromium: Bookmarks menu loads extremely slow
Re: Issue 135520 in chromium: The wifi symbol does not change when we
disconnect from VPN.
Re: Issue 141121 in chromium: H264 over HTTP not supported by Chrome
Issue 141249 in chromium: The login UI freezes and doesn't let us use any
of its fields.
Re: Issue 114570 in chromium: Memory usage grows infinitely when changing
img.src
Issue 141250 in chromium: OpenLink in Platform Apps improperly clones the
SessionStorageNamespace.
Issue 141251 in chromium: Incorrect layering of scrollbars on
overflow:scroll divs in Gmail in OS X
Re: Issue 47246 in chromium: Flash audio plays, video doesn't
Re: Issue 141184 in chromium: Uber tray Volume controller selection not
visible with TAB key traverse
Re: Issue 132794 in chromium: Refactor PyAuto to use only the JSON
automation interface
Re: Issue 132789 in chromium: Remove proxy dependencies from pyautolib
Re: Issue 141028 in chromium: If I plug in my USB Web camera and Gmail open
or Google+ or try and watch Flash content on a site like Crunchyroll.com
the light on the USB web camera flashes and the cursor and scrolling halt
cyclically. During Flash play back the audio is continuous but the video
halts cyclically while the light on the USB web camera flashes.
Re: Issue 141249 in chromium: The login UI freezes and doesn't let us use
any of its fields.
Re: Issue 134903 in chromium: Can't have global variable called 'toolbar'
in a packaged app
Re: Issue 141184 in chromium: Uber tray Volume controller selection not
visible with TAB key traverse
Re: Issue 141184 in chromium: Uber tray Volume controller selection not
visible with TAB key traverse
Re: Issue 140021 in chromium: Rename webkit_resources.pak to
webkit_resources_100_percent.pak
Re: Issue 141235 in chromium: Resize image with higher quality method in
RenderWidgetHostView*::CopyFromCompositingSurface
Re: Issue 138337 in chromium: cannot call window.performance.webkitNow when
assigning that function to a variable
Re: Issue 140498 in chromium: Pepper Flash: loading fails on Gangan online
Re: Issue 140964 in chromium: Profile Name is shown as 'Not signed in'
Re: Issue 140323 in chromium: Crash in
WebsiteSettingsPopupView::OnWidgetClosing
Re: Issue 141147 in chromium: Remove hide_hosted_documents from
ReadDirectoryCallback
Re: Issue 137090 in chromium: Theme images are offset by 5px on Chromeos in
tab background
Re: Issue 130015 in chromium: Chrome downloads RSS pages as a file instead
of showing the source in the browser
Re: Issue 140323 in chromium: Crash in
WebsiteSettingsPopupView::OnWidgetClosing
Issue 141252 in chromium: Device completely unresponsive on login screen
unless user presses "esc" key
Re: Issue 139521 in chromium: All profiles always open in background
Re: Issue 140780 in chromium: In Youtube, Pause is observed when switching
between Full Screen and Exit Full Screen
Issue 141253 in chromium: owners checks for changes to owners files don't
work right
Re: Issue 134903 in chromium: Can't have global variable called 'toolbar'
in a packaged app
Re: Issue 138184 in chromium: Upstream ChromeBrowserMainPartsAndroid
Re: Issue 140541 in chromium: Media element preloads too aggressively
Re: Issue 140855 in chromium: Chrome always defaults back to two-sided
printing, even though user checks it off before closing
Re: Issue 47246 in chromium: Flash audio plays, video doesn't
--
Automated mail from issue updates at http://crbug.com/
Subscription options: http://groups.google.com/a/chromium.org/group/chromium-bugs
c***@googlecode.com
2012-08-08 17:16:42 UTC
Permalink
Your project notifications generated too many emails to send
individually. Here are the subject lines of the emails you would have
received:

Re: Issue 110231 in chromium: correct touch update coalescing for queueing
Re: Issue 141252 in chromium: Device completely unresponsive on login
screen unless user presses "esc" key
Re: Issue 132761 in chromium: DevTools need HiDPI assets
Issue 141385 in chromium: Android accessibility: allow scrolling to be
locked to one axis at a time
Re: Issue 140465 in chromium: PyAuto: Chrome crashes if making repeated
calls to getUserMedia
Re: Issue 140441 in chromium: getUserMedia on Mac OS X v.10.8 Mountain
Lion. System tray indicator can incorrectly show that camera is being used.
Re: Issue 139340 in chromium: Find Menu needs HiDPI touch-friendly assets
Re: Issue 139833 in chromium: Unify WebKit context menu and combo box height
Re: Issue 139834 in chromium: Unify size of WebUI between touch and
non-touch
Re: Issue 140441 in chromium: getUserMedia on Mac OS X v.10.8 Mountain
Lion. System tray indicator can incorrectly show that camera is being used.
Re: Issue 141132 in chromium: Quoting in GR_GL_CUSTOM_SETUP_HEADER breaks
VS2008 build.
Issue 141387 in chromium: "Open with" menu in Drive File viewer does not
display all possible apps that can open the file
Re: Issue 140687 in chromium: Chrome: `anonymous
namespace'::DownloadItemToJSON(content::DownloadItem *)
Re: Issue 129733 in chromium: SWFFit bug with resizing flash sites
Issue 141389 in chromium: Scroll bars are blurry in high-DPI
Re: Issue 138553 in chromium: Update history service to store size in
thumbnail database
Re: Issue 141302 in chromium: Race condition on Linux when forking at
shutdown
Re: Issue 141367 in chromium: Chrome: Crash Report - Stack
Signature: MediaStreamDispatcher::RemoveEnumerationReq...
Re: Issue 32757 in chromium: Implement PulseAudio backend
Re: Issue 138281 in chromium: Remove touch-optimized-UI mode from ChromeOS
Re: Issue 136100 in chromium: No left padding in overflow bookmark menu in
touch-optimized high DPI
Re: Issue 117914 in chromium: Implement generic Fingerprint type for X509
Certificates
Re: Issue 140687 in chromium: Chrome: `anonymous
namespace'::DownloadItemToJSON(content::DownloadItem *)
Re: Issue 84045 in chromium: Investigate profile/cache on a network hosted
location
Re: Issue 138777 in chromium: Bottom bezel swipe fixes
Re: Issue 134159 in chromium: WebUI download page progress disk is pixely
in hidpi mode
Re: Issue 139271 in chromium: Add readme files to all the apps samples
Re: Issue 139147 in chromium: Increase crash rates due to gpu-process
pre-launching
Re: Issue 137799 in chromium: Need a way to get audio/video input device
list change notifications
Re: Issue 139650 in chromium: Long-press UI polish
Re: Issue 454 in chromium: pages with http auth are displayed with full
content, don't asks to auth on startup
Issue 141390 in chromium: Spell check + Google suggestions = Broke
Re: Issue 141264 in chromium: Getting SSL_PINNED_KEY_NOT_IN_CERT_CHAIN at
OOBE
Re: Issue 141380 in chromium: Latest Chrome Canary does not like Google's
SSL Certificates
Re: Issue 98708 in chromium: Linux ALSA code does not check PcmWritei wrote
all the data
Re: Issue 140503 in chromium: Prevent console output from extensions
Re: Issue 32757 in chromium: Implement PulseAudio backend
Re: Issue 139410 in chromium: [Regression] chrome 22 clears page actions on
in-page navigations
Re: Issue 137160 in chromium: Add GetEntryInfoByPath() and
ReadDirectoryByPath() to GDataDirectoryService
Re: Issue 140944 in chromium: Web intents: invoking an explicit intent fails
2 issues changed in chromium
Re: Issue 141264 in chromium: Getting SSL_PINNED_KEY_NOT_IN_CERT_CHAIN at
OOBE
Re: Issue 140944 in chromium: Web intents: invoking an explicit intent fails
Re: Issue 141132 in chromium: Quoting in GR_GL_CUSTOM_SETUP_HEADER breaks
VS2008 build.
Re: Issue 111218 in chromium: Background images that were hidden, and then
exposed sometimes disappear
Issue 141391 in chromium: Launcher background doesn't change when
transitioning from maximized to minimized
Re: Issue 122595 in chromium: Domino's Pizza Tracker causes Google Chrome
to hang
Re: Issue 132701 in chromium: Crash in
media_stream::MediaStreamManager::StartEnumeration
Re: Issue 141300 in chromium: [Feature]: UI to remove previous local data
from signed in user in Metro
Re: Issue 139803 in chromium: Repack 100_percent and 200_percent PAK files
each into a single PAK
Re: Issue 140239 in chromium: An additional scroll bar appears at the right
on many sites
Issue 141392 in chromium: Status bar is unreadable
Re: Issue 139953 in chromium: Video playback fails on YouTube or any flash
based site
Re: Issue 137681 in chromium: Window.open() disregards "left" parameter
when Chrome is on second monitor
Re: Issue 140239 in chromium: An additional scroll bar appears at the right
on many sites
Issue 141393 in chromium: Double scrollbar, even on Google.com
Re: Issue 133690 in chromium: Can't install apps from sites!!
Re: Issue 111218 in chromium: Background images that were hidden, and then
exposed sometimes disappear
Re: Issue 135321 in chromium: SVG horizontal lines fail to draw on
display/reload
Re: Issue 60306 in chromium: SVG - horizontal polyline inside clip-path is
not drawn
Re: Issue 140239 in chromium: An additional scroll bar appears at the right
on many sites
Re: Issue 141259 in chromium: Wallpaper on startscreen becomes white on
deselection
Re: Issue 141055 in chromium: Frequent "Could not load Shockwave Flash"
error on Mac
Re: Issue 138420 in chromium: Add HiDPI asset for
media_stream_capture_indicator.cc bitmap for Mac
Re: Issue 43039 in chromium: Chromium remembers changed password (not the
one entered by the user)
Re: Issue 139353 in chromium: hterm: Hangs saying "Loading NaCl plugin"
Re: Issue 141107 in chromium: Unable to install 'Angry Birds' app on MAC OS
X 10.8 (latest Dev 22.0.1228.3 and Latest Canary 22.0.1228.3) - Observing
Weird behaviour
Issue 141394 in chromium: Uber tray line item to set monitor settings
Issue 141396 in chromium: Add 'Share' button in /drive
Re: Issue 128798 in chromium: Check that power manager doesn't suspend
until Chrome is displaying lock screen
Issue 141397 in chromium: Documents print in black and white even when
selecting "Color" for local printers only.
Issue 141398 in chromium: error 150 on google.com
Re: Issue 141295 in chromium: Fix worker_thread.py post change in issue
10830193
Re: Issue 141398 in chromium: error 150 on google.com
Re: Issue 141249 in chromium: The login UI freezes and doesn't let us use
any of its fields.
Issue 141399 in chromium: Back button from Google SRP to Youtube ends up on
youtube video
Re: Issue 141398 in chromium: error 150 on google.com
Re: Issue 137681 in chromium: Window.open() disregards "left" parameter
when Chrome is on second monitor
Re: Issue 141309 in chromium: App List should react to gesture
Re: Issue 98341 in chromium: Keyboard state not updated with keydown/keyup
events when page gains focus
Re: Issue 140812 in chromium: mixed content delivered by https to http
redirects are quietly blocked
Re: Issue 141398 in chromium: error 150 on google.com
Re: Issue 130351 in chromium: Mac OS X 10.5 deprecation message inside
chrome://chrome/help/
Re: Issue 140870 in chromium: Distance of Notifications too high
Re: Issue 140620 in chromium: Audio out of sync with Flash video
Re: Issue 140837 in chromium: Pressing window green button don't count dev
tools width when it is docked to right
Re: Issue 141259 in chromium: Wallpaper on startscreen becomes white on
deselection
Re: Issue 141132 in chromium: Quoting in GR_GL_CUSTOM_SETUP_HEADER breaks
VS2008 build.
Re: Issue 140757 in chromium: REGRESSION: Pinned tabs no longer load on
startup
Re: Issue 110343 in chromium: Page randomly turns into red/green gradient
boxes or solid blue
Re: Issue 140757 in chromium: REGRESSION: Pinned tabs no longer load on
startup
Re: Issue 128798 in chromium: Check that power manager doesn't suspend
until Chrome is displaying lock screen
Re: Issue 131863 in chromium: Chrome crashes when using Synergy and copying
from one computer to Chrome on Ubuntu
Re: Issue 98341 in chromium: Keyboard state not updated with keydown/keyup
events when page gains focus
Re: Issue 110343 in chromium: Page randomly turns into red/green gradient
boxes or solid blue
Re: Issue 110343 in chromium: Page randomly turns into red/green gradient
boxes or solid blue
Re: Issue 140757 in chromium: REGRESSION: Pinned tabs no longer load on
startup
Re: Issue 128805 in chromium: Add support for downloading contacts via the
Contacts GData API
Re: Issue 138212 in chromium: New notification of insecure content on page
not distinguishable enough.
Re: Issue 140787 in chromium: Prompt for allowing/blocking insecure content
on HTTPS pages is missing
Re: Issue 141277 in chromium: Web camera is ON when you open Change profile
picture.
--
Automated mail from issue updates at http://crbug.com/
Subscription options: http://groups.google.com/a/chromium.org/group/chromium-bugs
c***@googlecode.com
2012-08-09 17:40:59 UTC
Permalink
Your project notifications generated too many emails to send
individually. Here are the subject lines of the emails you would have
received:

Re: Issue 116986 in chromium: Geolocation Fails on Desktop
Re: Issue 141631 in chromium: Chrome plugin crashes when opening many tabs.
Re: Issue 141596 in chromium: Implement copy for directories
Re: Issue 129794 in chromium: Add tap target fuzzing in aura (to make it
easier to hit small targets)
Re: Issue 141649 in chromium: Make touch fuzzing parameters tunable
Re: Issue 130377 in chromium: PPAPINaClTest.ImageData test times out
consistently on all platforms
Re: Issue 139953 in chromium: Video playback fails on YouTube or any flash
based site
Re: Issue 139190 in chromium: Regression: The Scrollbar is not correctly
aligned
Re: Issue 141528 in chromium: Video : Videos slows down when viewing in
full screen.
Re: Issue 141514 in chromium: Trying to print to a android tablet hangs the
tab.
Re: Issue 141034 in chromium: Extension docs server: README doesn't mention
preview.py
Re: Issue 137617 in chromium: vh, vw units don't work in css transforms
Re: Issue 141055 in chromium: Frequent "Could not load Shockwave Flash"
error on Mac
Re: Issue 139684 in chromium: Sync reflected update detection does not
handle deleted items correctly
Re: Issue 141034 in chromium: Extension docs server: README doesn't mention
preview.py
Re: Issue 141055 in chromium: Frequent "Could not load Shockwave Flash"
error on Mac
Issue 141656 in chromium: Digital artifacts appear when using JQuery booklet
Re: Issue 141425 in chromium: Starting with 22.0.1229.0 fonts look fuzzy
Re: Issue 141575 in chromium: Cannot create object store in indexedDB
Re: Issue 141575 in chromium: Cannot create object store in indexedDB
Re: Issue 139953 in chromium: Video playback fails on YouTube or any flash
based site
Issue 141658 in chromium: Screen in the gradient squares
Re: Issue 140620 in chromium: Audio out of sync with Flash video
Re: Issue 136828 in chromium: Severe memory leak over time when reloading a
tab containing a HTML5 game
Re: Issue 138323 in chromium: Chrome_Linux: Crash Report - Stack
Signature: extensions::ScriptBadgeController::GetPageI...
Re: Issue 125643 in chromium: Cookies doesn't get populated upon refreshing
once they are deleted
Re: Issue 141451 in chromium: Chrome crashes when tried to install bundle
apps
Re: Issue 141425 in chromium: Starting with 22.0.1229.0 fonts look fuzzy
Re: Issue 140964 in chromium: Profile Name is shown as 'Not signed in'
Re: Issue 136118 in chromium: Broken image icon does not appear in high dpi
Re: Issue 137681 in chromium: Window.open() disregards "left" parameter
when Chrome is on second monitor
Re: Issue 125643 in chromium: Cookies doesn't get populated upon refreshing
once they are deleted
Re: Issue 139800 in chromium: -webkit-transform translateX(0) causes pixel
reside on screen when animating
Re: Issue 141451 in chromium: Chrome crashes when tried to install bundle
apps
Re: Issue 141514 in chromium: Trying to print to a android tablet hangs the
tab.
Re: Issue 140944 in chromium: Web intents: invoking an explicit intent fails
Re: Issue 141583 in chromium: Quota API should return available disk space
for installed apps if the app has unlimitedStorage permission
Re: Issue 141641 in chromium: New zoom icon in omnibox doesn't support
high-dpi
Re: Issue 97285 in chromium: Chrome_Mac: Magic Signature:
IPC::Channel::ChannelImpl::CreatePipe
Re: Issue 126634 in chromium: Eliminate if (!callback.is_null()) where
callback is never null
Re: Issue 130854 in chromium: homepage not loading
Re: Issue 141587 in chromium: Make ViewMsg_UpdateVSyncParameters robust to
brooken high resolution clocks
Issue 141660 in chromium: NaCl build bot stuck on VS, bad install
Issue 141659 in chromium: Re-add sourceSetTimestampOffset to
webmediaplayer_impl
Re: Issue 141467 in chromium: UI resource paks on ChromeOS have grown
significantly.
Re: Issue 140271 in chromium: [Feature] suppress the onscreen keyboard,
when user selects chrome settings
Re: Issue 141584 in chromium: Add UI to show the user how much disk each
installed App is using
Re: Issue 141584 in chromium: Add UI to show the user how much disk each
installed App is using
Re: Issue 139699 in chromium: WebApps are shown for non-Drive items as well
Re: Issue 141439 in chromium: Need 2x broken image asset
Re: Issue 141107 in chromium: Unable to install 'Angry Birds' app on MAC OS
X 10.8 (latest Dev 22.0.1228.3 and Latest Canary 22.0.1228.3) - Observing
Weird behaviour
Re: Issue 141514 in chromium: Trying to print to a android tablet hangs the
tab.
Re: Issue 141055 in chromium: Frequent "Could not load Shockwave Flash"
error on Mac
Re: Issue 138386 in chromium: IcedTea gets detected as out of date; update
button not helpful
Re: Issue 141583 in chromium: Quota API should return available disk space
for installed apps if the app has unlimitedStorage permission
Re: Issue 139699 in chromium: WebApps are shown for non-Drive items as well
Re: Issue 141514 in chromium: Trying to print to a android tablet hangs the
tab.
Re: Issue 141639 in chromium: Fullscreen icon is 1px too far right
Re: Issue 134694 in chromium: Implement multi-process Chromoting Daemon
architecture
Re: Issue 141621 in chromium: Add a switch to about:flags for enabling the
website settings UI
Issue 141661 in chromium: Wrong Thumbs when opening new tab
Re: Issue 141621 in chromium: Add a switch to about:flags for enabling the
website settings UI
Re: Issue 141055 in chromium: Frequent "Could not load Shockwave Flash"
error on Mac
Re: Issue 140044 in chromium: PRINT GOOGLE CALENDER NOT LOADING
Re: Issue 109934 in chromium: Flash 11: Mouse cursor sometimes disappears
Re: Issue 141640 in chromium: Link to youtube will play audio not video
Re: Issue 139356 in chromium: Ensure Chrome (WebRTC, gTalk, others)
properly handle V4L2 devices
Issue 141662 in chromium: Merge M22 strings for Chromoting
Re: Issue 140651 in chromium: Auto-fill not working
Re: Issue 140044 in chromium: PRINT GOOGLE CALENDER NOT LOADING
Re: Issue 139635 in chromium: Leak in
JsSyncManagerObserverTest.OnInitializationComplete
Re: Issue 141587 in chromium: Make ViewMsg_UpdateVSyncParameters robust to
brooken high resolution clocks
Re: Issue 139699 in chromium: WebApps are shown for non-Drive items as well
Re: Issue 141467 in chromium: UI resource paks on ChromeOS have grown
significantly.
Re: Issue 113688 in chromium: Add Website Settings UI behind a flag
Re: Issue 139699 in chromium: WebApps are shown for non-Drive items as well
Re: Issue 141587 in chromium: Make ViewMsg_UpdateVSyncParameters robust to
brooken high resolution clocks
Re: Issue 73945 in chromium: Request headers and cookies are not available
for https (SPDY)
Re: Issue 141650 in chromium: browser windows become unresponsive when an
alert from a different browser window comes up
Re: Issue 73945 in chromium: Request headers and cookies are not available
for https (SPDY)
Re: Issue 140244 in chromium: Content-Disposition attachment header
ignored; browser displays links to app store instead
Re: Issue 141587 in chromium: Make ViewMsg_UpdateVSyncParameters robust to
brooken high resolution clocks
Re: Issue 140944 in chromium: Web intents: invoking an explicit intent fails
Re: Issue 140944 in chromium: Web intents: invoking an explicit intent fails
Re: Issue 99537 in chromium: Sync: Changing a single preference causes an
Unrecoverable error and sync turns OFFLINE_UNUSABLE
Re: Issue 130172 in chromium: Sync Error: Preferences
***@chrome/browser/sync/glue/generic_change_processor.cc:317
Re: Issue 141575 in chromium: Cannot create object store in indexedDB
Re: Issue 141041 in chromium: Chrome_Mac: Crash Report - Stack
Signature: device_orientation::ObserverDelegate::OnDev...
Re: Issue 141259 in chromium: Wallpaper on startscreen becomes white on
deselection
Re: Issue 141467 in chromium: UI resource paks on ChromeOS have grown
significantly.
Re: Issue 141642 in chromium: GPU acceleration broken
Re: Issue 141633 in chromium: Window.print() Is "Snagged" in JavaScript
when a <video> element is in the DOM
Re: Issue 141108 in chromium: Unresponsiveness on the first time i write on
omnibox
Re: Issue 141632 in chromium: Fullscreen Video Shrinks AND Doesn't Open on
Default Monitor
Re: Issue 140271 in chromium: [Feature] Win 8: Suppress the on-screen
keyboard when the Chrome (Wrench) menu is opened
Re: Issue 141259 in chromium: Wallpaper on startscreen becomes white on
deselection
Re: Issue 141285 in chromium: Browser crash @
ash::internal::WebNotificationContentsView::Update
Re: Issue 107413 in chromium: Establish UDP port reuse policy for DNS
transactions in DnsTransaction.
Re: Issue 141259 in chromium: Wallpaper on startscreen becomes white on
deselection
Re: Issue 138288 in chromium: [NaCl SDK] Add chromium_builder_qa_nacl_win64
to all.gyp
Issue 141663 in chromium: Move Ash wallpapers from ui/resources/ to
ash/resources/
--
Automated mail from issue updates at http://crbug.com/
Subscription options: http://groups.google.com/a/chromium.org/group/chromium-bugs
c***@googlecode.com
2012-08-13 18:32:18 UTC
Permalink
Your project notifications generated too many emails to send
individually. Here are the subject lines of the emails you would have
received:

Re: Issue 136624 in chromium: Sound is choppy or distorted
Re: Issue 142010 in chromium: cross-frame function calls have wrong 'this'
Re: Issue 141718 in chromium: Chrome OS should open to blank desktop
Re: Issue 141968 in chromium: Download location can't be edited
7 issues changed in chromium
Issue 142378 in chromium: Browser Plugin: Delete "old" implementation and
all references to it in the codebase.
Re: Issue 142261 in chromium: Missing + from the add tab icon at the top
and ellipsis from tabs when text is too long
Re: Issue 142224 in chromium: Chrome wrench menu does not display properly
in simplified Chinese
Re: Issue 141825 in chromium: NetworkSmsHandlerTest.SmsHandlerDbusStub is
broken
Re: Issue 135341 in chromium: Chrome 20 Rendering Issues
Re: Issue 142336 in chromium: UI created by IdentifyAlertableExtensions
crashes on close
Issue 142379 in chromium: Browser Plugin: Make new BrowserPlugin
implementation be of type="application/browser-plugin"
Re: Issue 142181 in chromium: <Esc> doesn't dismiss web intents dialog
Re: Issue 142182 in chromium: Print preview is not working... says it is
loading but nothing happens
Re: Issue 141598 in chromium: Run tests on linux_chromeos CQ bots
28 issues changed in chromium
Re: Issue 142275 in chromium: Apps on windows don't receive mouse events in
draggable regions
Re: Issue 139183 in chromium: Window Maximize/Close buttons in wrong
location when maximized
Re: Issue 142052 in chromium: first run ui can't be suppressed in
distribution scenarios
Re: Issue 140498 in chromium: Pepper Flash: loading fails on Gangan online
Re: Issue 140578 in chromium: Cannot change PIN
Re: Issue 140570 in chromium: Pepper Flash: issues around Flash storage
permission on Niconico video
Issue 142380 in chromium: Chrome on Mac should not request exclusive access
of HID Devices
Re: Issue 141044 in chromium: Chrome: `anonymous namespace'::AsyncWrite
Re: Issue 61102 in chromium: VisitedLinkMaster does occasional writes on
the UI thread
Re: Issue 135286 in chromium: File manager notifications stays even after
removing the external drive
Re: Issue 140578 in chromium: Cannot change PIN
Re: Issue 113401 in chromium: Third-party iFrames can no longer read their
own cookies when "Block third-party cookies and site data" is enabled
Re: Issue 98241 in chromium: Changing third-party cookie blocking behavior
to prevent reading as well as setting.
Re: Issue 135286 in chromium: File manager notifications stays even after
removing the external drive
Re: Issue 128418 in chromium: Chrome: Crash Report - Stack
Signature: WebCore::SVGTextRunRenderingContext::glyphD...
Re: Issue 141775 in chromium: No New Notifications text too big and black
Re: Issue 141775 in chromium: No New Notifications text too big and black
Issue 142381 in chromium: Rename and break down
chrome/app/generated_resources.grd
Re: Issue 140495 in chromium: Text box fails to render contents and does
not accept user input.
Re: Issue 128799 in chromium: Instant interactive UI tests flaky/failing on
Win
Re: Issue 138841 in chromium: Unable to load Scratchpad Application
Issue 142383 in chromium: Find bar displays negative counts like "-10 of 1"
Re: Issue 141591 in chromium: Chrome does not gracefully recover from a
broken Cookies SQLite database
Issue 142385 in chromium: Browser window moves offscreen (disappears), when
switching viewports using TwinView
Issue 142384 in chromium: Add chromeos_unittests to the relevant chromeos
builders
Re: Issue 142383 in chromium: Find bar displays negative counts like "-10
of 1"
Issue 142386 in chromium:
http://www.google.com/doodles/finder/2012/All%20doodles The url back
button does not work in IEXPLORE.
Re: Issue 114255 in chromium: Proxy Extension API - "Error Tunnel
connection failed" proxy error is shown
Re: Issue 142364 in chromium: Threaded compositor: Placing 2 fingers on the
trackpad does not show the overlay scrollbar on Mountain Lion
Re: Issue 142386 in chromium:
http://www.google.com/doodles/finder/2012/All%20doodles The url back
button does not work in IEXPLORE.
Re: Issue 128359 in chromium: Crash trying to access a deleted InstantLoader
Re: Issue 136041 in chromium: Add UMA logs to print to analyse Windows 8
metro charm usage.
Re: Issue 142380 in chromium: Chrome on Mac should not request exclusive
access of HID Devices
Re: Issue 141591 in chromium: Chrome does not gracefully recover from a
broken Cookies SQLite database
Re: Issue 136041 in chromium: Add UMA logs to print to analyse Windows 8
metro charm usage.
Re: Issue 98241 in chromium: Changing third-party cookie blocking behavior
to prevent reading as well as setting.
Re: Issue 113401 in chromium: Third-party iFrames can no longer read their
own cookies when "Block third-party cookies and site data" is enabled
Re: Issue 142380 in chromium: Chrome on Mac should not request exclusive
access of HID Devices
Re: Issue 131870 in chromium: Chrome OS: Honor owner's swap-mouse-buttons
setting on login screen
Re: Issue 140688 in chromium: Chrome:
base::HistogramSnapshotManager::PrepareDelta(base::Histogram const &)
Re: Issue 142367 in chromium: User-friendly download destination
Re: Issue 142364 in chromium: Threaded compositor: Placing 2 fingers on the
trackpad does not show the overlay scrollbar on Mountain Lion
Re: Issue 142189 in chromium: Security: URL based DOM XSS bypass on XSS
Auditor
Issue 142387 in chromium: Chrome: Crash Report - Stack Signature:
browser_sync::DataTypeController::CreateAnd...
Re: Issue 98241 in chromium: Changing third-party cookie blocking behavior
to prevent reading as well as setting.
Re: Issue 113401 in chromium: Third-party iFrames can no longer read their
own cookies when "Block third-party cookies and site data" is enabled
Re: Issue 141964 in chromium: unable to upload files
Issue 142388 in chromium: Chrome: Crash Report - Stack Signature:
SECITEM_CopyItem_Util-113d04dc_c7d63bc5_9e5...
Re: Issue 141718 in chromium: Chrome OS should open to blank desktop
Re: Issue 141873 in chromium: Chrome: Crash Report - Stack
Signature: views::MenuRunner::~MenuRunner()-11717317_a...
Re: Issue 142364 in chromium: Threaded compositor: Placing 2 fingers on the
trackpad does not show the overlay scrollbar on Mountain Lion
Re: Issue 140495 in chromium: Text box fails to render contents and does
not accept user input.
Re: Issue 133093 in chromium: Support Lion scrollbars in the compositor
thread
Re: Issue 141591 in chromium: Chrome does not gracefully recover from a
broken Cookies SQLite database
Issue 142389 in chromium: Chrome: Crash Report - Stack Signature:
DownloadsDOMHandler::ModelChanged(content::...
Re: Issue 140313 in chromium: Browser Plugin: Report Errors to Embedder
Re: Issue 141873 in chromium: Chrome: Crash Report - Stack
Signature: views::MenuRunner::~MenuRunner()-11717317_a...
Issue 142390 in chromium: Computer will not sleep while Chrome is running
Re: Issue 112491 in chromium: Request new git repo for glmark2
Re: Issue 141044 in chromium: Chrome: `anonymous namespace'::AsyncWrite
Re: Issue 142213 in chromium: Issue 45085: Images should be loaded outwards
from the user's viewport, not top-to-bottom
Re: Issue 113401 in chromium: Third-party iFrames can no longer read their
own cookies when "Block third-party cookies and site data" is enabled
Re: Issue 142333 in chromium: Touch scrolling of gmail lags more than with
trackpad
Re: Issue 141718 in chromium: Chrome OS should open to blank desktop
Re: Issue 132983 in chromium: Linux Fullscreen Issue with Dual Monitor
Re: Issue 141971 in chromium: Chrome reporting very large page load times
to Google Analytics while the page loads quickly.
Re: Issue 129907 in chromium: Disconnect toolbar appears under Start Menu
if user logs on while Chromoting is connected
Re: Issue 139811 in chromium: RFC: Re-use AF_UNSPEC results to address
AF_INET HostResolver requests.
Re: Issue 129835 in chromium: Your Desktop is being shared box disappears
when resolution is lowered
Issue 142391 in chromium: Chrome: BrowserThemePack::GetImageNamed(int)
Re: Issue 125607 in chromium: Canvas Bezier curves broken in ChromeOS 18,
19, 20 (when ctx.lineWidth = 1)
Re: Issue 140495 in chromium: Text box fails to render contents and does
not accept user input.
Issue 142392 in chromium: Taskbar is missing on right bottom corner of the
monitor.
Re: Issue 79194 in chromium: add Chromium ARM try bot
Re: Issue 111851 in chromium: Search in History doesn't match file
extension (e.g. "pdf") in URL
Re: Issue 139605 in chromium: Can not adding Chrome Apps or Extensions.
(The screenshot will explain my problem)
Re: Issue 141377 in chromium: Giant teximage2d calls when viewing posts on
theverge.com on OSX 10.6
Re: Issue 104956 in chromium: content tests should be available in the
flakiness dashboard
Re: Issue 140495 in chromium: Text box fails to render contents and does
not accept user input.
Re: Issue 142353 in chromium: URl Obfuscation Vulnerability
Re: Issue 141377 in chromium: Giant teximage2d calls when viewing posts on
theverge.com on OSX 10.6
Issue 142393 in chromium: Fullscreen mouse x/y with dual monitors
Issue 142394 in chromium: Incorrect tab activated when middle-clicking
links with explicit target
Re: Issue 16123 in chromium: Make most step 'buildbot properties' based
Re: Issue 141718 in chromium: Chrome OS should open to blank desktop
--
Automated mail from issue updates at http://crbug.com/
Subscription options: http://groups.google.com/a/chromium.org/group/chromium-bugs
c***@googlecode.com
2012-08-13 19:34:22 UTC
Permalink
Your project notifications generated too many emails to send
individually. Here are the subject lines of the emails you would have
received:

Re: Issue 128702 in chromium: Request
/cache/f90b2e04c24c3911d2712d7eff2f9934
Re: Issue 132059 in chromium: Chrome causing 404's ending with
“/cache/[hex-string]/”
Re: Issue 142371 in chromium: Security - PDF Viewer allows execution of
embedded JavaScript XSS
Re: Issue 141878 in chromium: Chrome:
OmniboxEditModel::DoInstant(AutocompleteMatch const
&,std::basic_string,std::allocator > *,InstantCompleteBehavior *)
Re: Issue 1019 in chromium: Set image as wallpaper (update: You can now
grab the extension from the gallery)
Re: Issue 133789 in chromium: chrome dev tools will not let you add or
modify CSS properties easily
Re: Issue 141044 in chromium: Chrome: `anonymous namespace'::AsyncWrite
Re: Issue 142271 in chromium: Text selection sometimes leaves residual
selection highlight after un-selecting
Re: Issue 140834 in chromium: Fixes for the Window Control Menu
Re: Issue 140773 in chromium: Cannot scroll down the page smoothly
Re: Issue 141051 in chromium: Cannot scroll up and down
Re: Issue 141908 in chromium: New touch responds to the last touched item.
Re: Issue 141044 in chromium: Chrome: `anonymous namespace'::AsyncWrite
Re: Issue 142189 in chromium: Security: URL based DOM XSS bypass on XSS
Auditor
Re: Issue 141878 in chromium: Chrome:
OmniboxEditModel::DoInstant(AutocompleteMatch const
&,std::basic_string,std::allocator > *,InstantCompleteBehavior *)
Re: Issue 128636 in chromium: Crash on USB API on Linux
Re: Issue 141723 in chromium: Add privacy message in Settings page
Issue 142402 in chromium: H.264 H/W video decoding on Windows 7 and above
seems to have caused gpu process crashes to increase
Re: Issue 137719 in chromium: REGRESSION: reliability_tests unable to
locate Chrome build on Mac
Re: Issue 141918 in chromium: Create a sample extension that uses event
pages to open a set of optionally pinned tabs on startup
Re: Issue 140117 in chromium: Remove Exit option from wrench menu in Metro
Re: Issue 137124 in chromium: Opening Docs consistently shows an HTML Web
Worker error message
Issue 142403 in chromium: Flash Player Pepper render mode OpenGL causes
stage3D Aliasing.
Re: Issue 142018 in chromium: Extension Docs 2: Rationalize search options
Re: Issue 137719 in chromium: REGRESSION: reliability_tests unable to
locate Chrome build on Mac
Re: Issue 139339 in chromium: Top-level window should be single
gesture-consumer
Re: Issue 141870 in chromium: Touch: Tapping the tab bar frequently crashes
Chrome in ui::Layer::Remove
Re: Issue 142405 in chromium: Massive display problems in new version
Re: Issue 132950 in chromium: Document signatures for Event.[add|remove|
has]Listener()
Re: Issue 141870 in chromium: Touch: Tapping the tab bar frequently crashes
Chrome in ui::Layer::Remove
Re: Issue 139102 in chromium: Behavior of window mover icon should track
launcher position
Re: Issue 140773 in chromium: Cannot scroll down the page smoothly
Re: Issue 142404 in chromium: double tap/reflow undoes text zoom
(regression)
Re: Issue 141870 in chromium: Touch: Tapping the tab bar frequently crashes
Chrome in ui::Layer::Remove
Re: Issue 142367 in chromium: User-friendly download destination
Re: Issue 41756 in chromium: WebKit gradients show banding on Chrome
Re: Issue 141734 in chromium: 3G:Highlighting on Verizon Activation dialog
is invisible
Re: Issue 142387 in chromium: Chrome: Crash Report - Stack
Signature: browser_sync::DataTypeController::CreateAnd...
Re: Issue 141734 in chromium: 3G:Highlighting on Verizon Activation dialog
is invisible
Issue 142407 in chromium: Facebook picture albums full screen mode
switching off
Re: Issue 141018 in chromium: Projectmanager.com application causes Flash
to hang
Re: Issue 141308 in chromium: Launcher and ueber tray colors need to be
adjusted
Re: Issue 141911 in chromium: Touching the tabstrip can cause crashes in
GpuProcessTransportFactory::CreateTransportClient
Re: Issue 43245 in chromium: Flash video skips every couple of seconds
Re: Issue 141110 in chromium: PPAPI Flash doesn't pick up default encoding
from settings
Re: Issue 141591 in chromium: Chrome does not gracefully recover from a
broken Cookies SQLite database
Issue 142408 in chromium: Poor experience with Chrome desktop notifications
in OS X 10.8 (Notification Center)
Re: Issue 120632 in chromium: FieldTrial s default group is not assigned
the right ID when forced in a child process.
Issue 142409 in chromium: add functional tests for media galleries dialog
Re: Issue 128462 in chromium: Implement gcapi for Mac
Re: Issue 142296 in chromium: DOM Exception 18 when accessing e.stack in
sandboxed iframe
Re: Issue 141971 in chromium: Chrome reporting very large page load times
to Google Analytics while the page loads quickly.
Re: Issue 141878 in chromium: Chrome:
OmniboxEditModel::DoInstant(AutocompleteMatch const
&,std::basic_string,std::allocator > *,InstantCompleteBehavior *)
Re: Issue 87222 in chromium: Memory leaks since r89892
Issue 142410 in chromium: valgrind/chrome_tests.sh only accepts one
--tool_flags argument
Re: Issue 128636 in chromium: Crash on USB API on Linux
Re: Issue 138140 in chromium: Tab crashes on CTRL+U
Re: Issue 9694 in chromium: Show calculator results inline
Re: Issue 138140 in chromium: Tab crashes on CTRL+U
Re: Issue 142299 in chromium: "Aw snap!" when debugging script in sandboxed
iframe
Re: Issue 135326 in chromium: Header and footer partly cut-off when printing
Re: Issue 37615 in chromium: Proxy with authentication: unable to verify
https certificates & unable to update chrome
Re: Issue 124069 in chromium: navigator.onLine returning false negatives.
Re: Issue 142241 in chromium: Chrome silently fails to handle unrecognized
URI schemes
Re: Issue 142058 in chromium: devtools API shows up in apps docs
Re: Issue 141591 in chromium: Chrome does not gracefully recover from a
broken Cookies SQLite database
Re: Issue 127019 in chromium: Chrome OS behind proxy-auth can't get any
updates
Re: Issue 129259 in chromium: Notification icons for status tray
Re: Issue 142325 in chromium: When zooming in page, borders with em units
scale up too much
Re: Issue 120383 in chromium: Chrome Extensions Compression
Re: Issue 101556 in chromium: New Accelerated Compositing Scheduler
Re: Issue 113389 in chromium: Smooth scrolling, even when renderer is busy
Re: Issue 142058 in chromium: devtools API shows up in apps docs
Re: Issue 142360 in chromium: Native implement of require() for extensions
Re: Issue 83666 in chromium: Do not hold InputEventAck on DoDeferredUpdate
when accelerated rendering
Re: Issue 96302 in chromium: Reduce rendering latency in accelerated
compositing mode
Re: Issue 137935 in chromium: Verify that input latency is tolerable in
threaded compositin gmode
Re: Issue 83666 in chromium: Do not hold InputEventAck on DoDeferredUpdate
when accelerated rendering
Re: Issue 101556 in chromium: New Accelerated Compositing Scheduler
Re: Issue 101556 in chromium: New Accelerated Compositing Scheduler
Re: Issue 129259 in chromium: Notification icons for status tray
Re: Issue 142061 in chromium: Every extension gets an always-on compositor
thread
Re: Issue 124148 in chromium: CrOS extensions cause the compositor to tick
constantly in the background
Re: Issue 123872 in chromium: Issue async trace_events when animations are
running
Re: Issue 123723 in chromium: Aw Snap switching from Chromoting to New Tab
and back again immediately after browser reload
Re: Issue 89653 in chromium: Replace broken extension installed infobar
with bubble pointing at the wrench icon
Re: Issue 142058 in chromium: devtools API shows up in apps docs
Re: Issue 118860 in chromium: about:gpu should indicate
threaded-compositing and force-compositing mode status
Re: Issue 112837 in chromium: Clean up WebWidget::setNeedsRedraw()
Re: Issue 85499 in chromium: Frame rate destabilizes after switching tabs
Re: Issue 141142 in chromium: OOBE selected profile picture is not in the
choose picture list.
Re: Issue 81109 in chromium: about:gpu page on linux+ATI links to a
security bug that will 403 for users
Re: Issue 121077 in chromium: GPU acceleration performance poor in
18.0.1025.142
Re: Issue 136624 in chromium: Sound is choppy or distorted
Re: Issue 142393 in chromium: Fullscreen mouse x/y with dual monitors
Re: Issue 139339 in chromium: Top-level window should be single
gesture-consumer
Re: Issue 140495 in chromium: Text box fails to render contents and does
not accept user input.
Re: Issue 65677 in chromium: Resizing of the main browser window, when the
compositor is enabled, is very janky on Windows
Re: Issue 142408 in chromium: Poor experience with Chrome desktop
notifications in OS X 10.8 (Notification Center)
Re: Issue 128399 in chromium: timeline_model import events is sensitive to
import order
Re: Issue 133621 in chromium: Java detected as out-of-date
--
Automated mail from issue updates at http://crbug.com/
Subscription options: http://groups.google.com/a/chromium.org/group/chromium-bugs
c***@googlecode.com
2012-08-13 22:25:24 UTC
Permalink
Your project notifications generated too many emails to send
individually. Here are the subject lines of the emails you would have
received:

Re: Issue 141047 in chromium: Youtube video lags/choppy when transitioning
to fullscreen and vice versa
Re: Issue 53518 in chromium: Right-clicking in a popup should allow you to
open the inspector
Re: Issue 130398 in chromium: Mac bot appears to have failing harddrive
Re: Issue 142466 in chromium:
GDataFileSystem::OnGetEntryCompleteForCloseFile() is modifying a GDataEntry
directly
Re: Issue 127856 in chromium: Implement metadata storage for the file system
Re: Issue 130422 in chromium: Quick way to dump webpage to skpicture and
then to file
Re: Issue 52344 in chromium: Can't import certain Firefox bookmarks into
Chrome
Re: Issue 142462 in chromium: Chrome OS stopwatch boot time is nearly 9
seconds on stable channel
Re: Issue 132377 in chromium: Text rendering is too thin in HiDPI mode
Re: Issue 142424 in chromium: Chrome: Crash Report - Stack
Signature: WTF::ChromiumThreading::callOnMainThread(vo...
Re: Issue 141451 in chromium: Chrome crashes when tried to install bundle
apps
Re: Issue 139339 in chromium: 4-Finger gestures should apply to the entire
window
Re: Issue 138846 in chromium: Add UMA metric for touch events (radius,
interval etc.)
Re: Issue 126634 in chromium: Eliminate if (!callback.is_null()) where
callback is never null
Re: Issue 85609 in chromium: Import Firefox html bookmarks export
Re: Issue 134486 in chromium: Chrome_ChromeOS: Crash in
ui::GestureSequence::IsSecondTouchDownCloseEnoughForTwoFingerTap
Re: Issue 127323 in chromium: Panels: Refactor implementation to eliminate
dependency on browser classes
Re: Issue 142420 in chromium: Remove use of FindEntryCallback from
GDataFileSystem::FindEntryByPathAsyncOnUIThread()
Re: Issue 36544 in chromium: Chromium's cache ignores Vary and headers
Re: Issue 141598 in chromium: Run tests on linux_chromeos CQ bots
Re: Issue 142460 in chromium: [Metro] Always opens up "Crashed"
Re: Issue 141544 in chromium: "The site's security is certificate signed a
using weak signature algorithm!" error
Re: Issue 137523 in chromium: Flash video full screen displays on wrong
monitor
Re: Issue 141975 in chromium: full screen flash video on secondary monitor
in dual monitor set up does not maximize on sec. monitor but on primary
monitor in sec. monitor resolution
Re: Issue 53518 in chromium: Right-clicking in a popup should allow you to
open the inspector
Re: Issue 138366 in chromium: Flash Player Setting controls not clickable
in Chrome 21.0.1180.49 beta (under some CSS conditions)
Re: Issue 121562 in chromium: Task manager column settings not persistent
Re: Issue 133599 in chromium: Flash full screen centered incorrectly on
multi-monitor Linux
Re: Issue 142193 in chromium: Chrome's flash version - blocking javascript
window.open / shared object / localconnection
Issue 142468 in chromium: PyAuto-replacement for GPU tests
Re: Issue 138218 in chromium: Upstream accessibility
Re: Issue 125937 in chromium: aura/views: Merge events
Re: Issue 130422 in chromium: Quick way to dump webpage to skpicture and
then to file
Re: Issue 140495 in chromium: Text box fails to render contents and does
not accept user input.
Re: Issue 141337 in chromium: html5 video with mediattribute makes the
player unusable
Re: Issue 136627 in chromium: "Global Settings" should take user to
chrome://chrome/settings/ instead of old online settings manager
Re: Issue 141464 in chromium: Changing theme on Chrome on Windows 8 leads
to crash
Issue 142470 in chromium: Google 'do a barrel roll' easter egg does not work
Issue 142471 in chromium: Chrome OS: window dragging does not work in high
DPI mode
Re: Issue 141439 in chromium: Need 2x broken image asset
Re: Issue 141926 in chromium: Starting Chrome after update to Mountain Lion
causes runaway CPU. Does not require a web page to load and does not appear
to be related to Adobe Flash or Shockwave
Re: Issue 133599 in chromium: Flash full screen centered incorrectly on
multi-monitor Linux
Re: Issue 141491 in chromium: Lag in full screen [Unclear whether Flash or
HTML5]
Re: Issue 141634 in chromium: Settings checkboxes are hard to hit with touch
Re: Issue 139833 in chromium: Unify WebKit context menu and combo box height
Re: Issue 142457 in chromium: After updating to V21, device only boots up
to Chrome Splash screen
Re: Issue 142440 in chromium: CR-48 not booting in dev-mode - hangs in
Chrome logo after AU to 22
Re: Issue 141294 in chromium: Inconsistent Bluetooth Connected device lis
Re: Issue 142472 in chromium: chrome:imageburner page does not open links
in new tabs.
Re: Issue 140325 in chromium: Currrent invalidation API unregisters
everything on shutdown
Re: Issue 140325 in chromium: Currrent invalidation API unregisters
everything on shutdown
Re: Issue 126634 in chromium: Eliminate if (!callback.is_null()) where
callback is never null
Re: Issue 142047 in chromium: DCHECK on second HW decode instance in
chrome; don't deref compositor thread's context's WeakPtr on render thread!
Re: Issue 141555 in chromium: Auto-create credential cache for users who
are already signed in and go on to upgrade Chrome
Re: Issue 138615 in chromium: Uninstalling chrome is not deleting "Google
folder" from "C:\Users\<username>\AppData\Local\Google\Chrome"
Re: Issue 141425 in chromium: Starting with 22.0.1229.0 fonts look fuzzy
Re: Issue 141926 in chromium: Starting Chrome after update to Mountain Lion
causes runaway CPU. Does not require a web page to load and does not appear
to be related to Adobe Flash or Shockwave
Re: Issue 138368 in chromium: webkitfullscreenchange not fired properly in
iframe
Re: Issue 142126 in chromium: Trouble Installing Google Chrome MSI Package
Re: Issue 136564 in chromium: PPAPI flash does not show full screen video
correctly[multi-display]
Re: Issue 133599 in chromium: Flash full screen centered incorrectly on
multi-monitor Linux
Re: Issue 130212 in chromium: Chrome Performance Monitor
Re: Issue 141692 in chromium: Excessive logging on push_notifications_*
Re: Issue 137941 in chromium: Wifi network's showing up as VPN's
Re: Issue 142367 in chromium: User-friendly download destination
Re: Issue 56615 in chromium: Make default Pepper encoding, exposed by
PPB_CharSet_Dev::GetDefaultCharSet(), come from prefs
Re: Issue 141110 in chromium: PPAPI Flash doesn't pick up default encoding
from settings
Re: Issue 118549 in chromium: Panels [WIN]: Auto-hiding taskbar causes
panels to be ugly, especially with draw attention
Re: Issue 133429 in chromium: Trusted Pepper Plugin Does not fire onload()
event
Issue 142473 in chromium: ERROR:ipc_sync_channel.cc(378)] Canceling pending
sends
Re: Issue 141555 in chromium: Auto-create credential cache for users who
are already signed in and go on to upgrade Chrome
Re: Issue 139446 in chromium: Remove unnecessary use of PostTask() in
GDataFileSystem
Re: Issue 126634 in chromium: Eliminate if (!callback.is_null()) where
callback is never null
Re: Issue 137694 in chromium: Remove use of
DirectoryService::FindEntryByPathSync() from GDataFileSystem
Re: Issue 142367 in chromium: User-friendly download destination
Re: Issue 138755 in chromium: Upstream Chrome for Android custom
ContentProvider
Re: Issue 135201 in chromium: Panels [WIN]: about:blank mini-URL bar is
shown temporarily in panel content area
Issue 142475 in chromium: Should be a way for SyncNotifierObservers to know
the initial invalidation enabled/disabled state
Re: Issue 133406 in chromium: No draw attention indicator outside of the
detached panel on Linux.
Issue 142476 in chromium: ProfileSyncServiceBookmarkTest should use
TestProfileSyncService instead of creating its own user shares
Issue 142477 in chromium: Many webgl/nacl apps not rendering on chrome os
Re: Issue 141192 in chromium: Dragged item always shown on the primary
display
Re: Issue 142476 in chromium: ProfileSyncServiceBookmarkTest should use
TestProfileSyncService instead of creating its own user shares
Re: Issue 133958 in chromium: Unable to install stable chrome from omaha
due to "Google Update Installation failed with error 0x80070057"
Re: Issue 125218 in chromium: Panels [OSX]: Visual tweak to "pulse" used
for drawing attention to panels
Issue 142478 in chromium: Can't read developer tools settings text
Re: Issue 105550 in chromium: Convert Canvas::DrawString*() to draw text
via skia.
Re: Issue 133429 in chromium: Trusted Pepper Plugin Does not fire onload()
event
Re: Issue 142109 in chromium: Delayed sound on videos and streams
Issue 142479 in chromium: Flash "enhanced microphone" audio output choppy
Issue 142480 in chromium: Browser renders page in black
Re: Issue 136624 in chromium: Sound is choppy or distorted
Re: Issue 133342 in chromium: Draw attention on OSX for detached panel only
causes the Chrome icon to jump once.
Re: Issue 133345 in chromium: Draw attention for a detached panel on OSX
doesn't have a visible affect if any window in Chrome has focus.
Re: Issue 133429 in chromium: Trusted Pepper Plugin Does not fire onload()
event
Re: Issue 133348 in chromium: Clicking on Chrome icon on OSX when bounced
doesn't bring the draw attention window to the foreground.
Re: Issue 125274 in chromium: Move User Creation flow into captive portal UI
Re: Issue 68258 in chromium: Fails to display both inline image/x-xbitmap
and provided ALT text
Re: Issue 134748 in chromium: The suggested Windows Media Player plugin
doesn't work
Re: Issue 137224 in chromium: 2x image of discloure_arrow.png
Re: Issue 142391 in chromium: Chrome: BrowserThemePack::GetImageNamed(int)
--
Automated mail from issue updates at http://crbug.com/
Subscription options: http://groups.google.com/a/chromium.org/group/chromium-bugs
c***@googlecode.com
2012-08-14 02:36:25 UTC
Permalink
Your project notifications generated too many emails to send
individually. Here are the subject lines of the emails you would have
received:

Re: Issue 142280 in chromium: Feature request: autorefresh/pause frames in
devtools WebSocket Frames tab
Re: Issue 142280 in chromium: Feature request: autorefresh/pause frames in
devtools WebSocket Frames tab
Re: Issue 141714 in chromium: missing layers in compositing mode, probably
due to transforms
Re: Issue 137454 in chromium: Command-line extension packaging pops up
message box that can't be dismissed
Re: Issue 115764 in chromium: Clicking previous in Chrome search goes into
negative numbers.
Re: Issue 142521 in chromium: Apps can use each other's TCP/UDP sockets,
serial port connections and USB devices
Re: Issue 142517 in chromium: Remove background_alias_do_not_use permission
Re: Issue 84231 in chromium: sound crackles when using google chrome
Re: Issue 119900 in chromium: Chrome Periodically Redownloads YouTube App
After Deletion
Re: Issue 138930 in chromium: SkCanvasVideoRendererTest.* failing on
Android FYI bot.
Re: Issue 140773 in chromium: Cannot scroll down the page smoothly
Re: Issue 142518 in chromium: ConvertYUVToRGB32Row_{SSE,MMX,C} need to be
updated to match platform skia layout
Re: Issue 87532 in chromium: need 64bit version of chromium
Issue 142524 in chromium: The Esc keypress that the user presses to exit
fullscreen can be used to reenter fullscreen.
Re: Issue 142518 in chromium: ConvertYUVToRGB32Row_{SSE,MMX,C} need to be
updated to match platform skia layout
Re: Issue 140203 in chromium: 64x version
Re: Issue 142524 in chromium: The Esc keypress that the user presses to
exit fullscreen can be used to reenter fullscreen.
Re: Issue 137447 in chromium: Regression: Gnome-shell window manager
(Mutter) fails to render window decorations/controls in maximized mode
Re: Issue 137083 in chromium: No update check notification for a while on
about page
Re: Issue 140732 in chromium: Rewrite TemplateURLService sync logic to
avoid ACTION_DELETEs
Re: Issue 142513 in chromium: Search engine floodgates will release a bunch
of pending deletes/adds/updates
Re: Issue 142479 in chromium: Flash "enhanced microphone" audio output
choppy
Issue 142525 in chromium: Maintain double-buffered IOSurfaces per window
rather than one per tab
Re: Issue 139755 in chromium: Onion video is crashing.
Re: Issue 141790 in chromium: Print Preview Page Slider
Re: Issue 141792 in chromium: "word-break:keep-all" not supported (for
control of word-wrapping in CJK text)
Re: Issue 141793 in chromium: dynamically created SVG animate element does
not update correctly with beginElement()
Re: Issue 141816 in chromium: developer tools bug
Re: Issue 141817 in chromium: Chrome 19 is much faster than 21 in
fullscreen youtube video
Re: Issue 141796 in chromium: Youtube videos lag on full screen
Re: Issue 141823 in chromium: -webkit-animation with -webkit-transform
using percentage do not work correctly
Re: Issue 123984 in chromium: Problem with certificate based authentication
Re: Issue 141841 in chromium: touchmove event does not respect div
boundaries
Issue 142526 in chromium: File manager: selecting multiple folders fails to
include file icons
Re: Issue 141846 in chromium: Border color using wrong color for content
inserted with javascript after page load
Re: Issue 141887 in chromium: Textwrap Bug When Negative Margin
Re: Issue 141892 in chromium: -webkit-calc() fails to recalculate on
browser zoom
Re: Issue 141895 in chromium: CSSTransform leaves trail on borders.
Re: Issue 141897 in chromium: Transparency in WebP images shows inverted
background insead
Re: Issue 141945 in chromium: Monospaced Italic Text Gains Height
Re: Issue 141977 in chromium: scrollheight is not updated correctly when an
innerHTML should lead to scrollheight==clientheight
Re: Issue 142262 in chromium: chromium 23.x snap shots show hand on some
pages when disk busy
Re: Issue 141983 in chromium: Text entered right after pasting styled text
should not inherit style from pasted text.
Re: Issue 141985 in chromium: Hyperlink :before element content not
clickable unless background color set
Re: Issue 140688 in chromium: Chrome:
base::HistogramSnapshotManager::PrepareDelta(base::Histogram const &)
Re: Issue 141698 in chromium: REGRESSION: All pages fail to render
Re: Issue 142075 in chromium: * { display: block } spits out styles and
scripts content on page unless style type was specified
Re: Issue 142084 in chromium: Inconsistent scaled background rendering
Re: Issue 142086 in chromium: "focus" parameter for
document.addEventListener doesn't trigger its listener function.
Re: Issue 142525 in chromium: Maintain double-buffered IOSurfaces per
window rather than one per tab
Re: Issue 142090 in chromium: Table with align tag breaks out of a div
Re: Issue 142075 in chromium: * { display: block } spits out styles and
scripts content on page unless style type was specified
Re: Issue 142130 in chromium: customize fonts won't work
Re: Issue 142075 in chromium: * { display: block } spits out styles and
scripts content on page unless style type was specified
Re: Issue 50186 in chromium: Javascript "Self.Print()" Defect.
Re: Issue 141055 in chromium: Frequent "Could not load Shockwave Flash"
error on Mac
Re: Issue 142038 in chromium: Rendering issue - black artefacts/blocks on
page
Re: Issue 142134 in chromium: Chrome fails to display XML document with
embedded CSS stylesheet
Re: Issue 142140 in chromium: search for text on a webpage misses text
inside slow iframe
Re: Issue 142151 in chromium: SVG inserted using either CSS
background-image or img element ignores external CSS
Re: Issue 142038 in chromium: Rendering issue - black artefacts/blocks on
page
Re: Issue 142153 in chromium: broken redraw of scrolled iframe
Re: Issue 142525 in chromium: Maintain double-buffered IOSurfaces per
window rather than one per tab
Re: Issue 142154 in chromium: text-overflow ellipsis broken with fractional
padding
Re: Issue 142157 in chromium: innerHTML convert <> into &lt;&gt;
Re: Issue 142075 in chromium: * { display: block } spits out styles and
scripts content on page unless style type was specified
Re: Issue 142166 in chromium: Crash null ptr on
chrome_54a00000!WebCore::RenderTableCell::borderTop+0x5.
Re: Issue 138015 in chromium: Background audio
Re: Issue 142168 in chromium: Wrong namespace serialization of xml when
creating attribute with setAttributeNS
Re: Issue 142167 in chromium: Wrong namespace serialization of xml when
creating attribute with setAttributeNS
Issue 142528 in chromium: view-source handler does not respect Dev Tools
settings
Issue 142529 in chromium: Extension docs server: integration tests are
broken
Re: Issue 141363 in chromium: Chrome: Crash Report - Stack
Signature: WebCore::RenderTableCell::borderTop()-1ec70...
Issue 142530 in chromium: Extension docs server: preview.py doesn't work
Re: Issue 141363 in chromium: Chrome: Crash Report - Stack
Signature: WebCore::RenderTableCell::borderTop()-1ec70...
Re: Issue 142166 in chromium: Crash null ptr on
chrome_54a00000!WebCore::RenderTableCell::borderTop+0x5.
Re: Issue 142479 in chromium: Flash "enhanced microphone" audio output
choppy
Re: Issue 142168 in chromium: Wrong namespace serialization of xml when
creating attribute with setAttributeNS
Re: Issue 142187 in chromium: event.target incorrect on touchend
Re: Issue 142188 in chromium: Contenteditable does not lose focus on
checkbox click
Re: Issue 142288 in chromium: [Pepper Flash] Virtual Keyboard (by Google)
chrome extension is breaking youtube/nicovideo/...
Issue 142531 in chromium: PDFBrowserTest.Basic fails on internal Official
Mac bot
Re: Issue 138074 in chromium: Layout in the ShellWindow becomes chaos after
the window restored from minimize operation.
Re: Issue 141363 in chromium: Chrome: Crash Report - Stack
Signature: WebCore::RenderTableCell::borderTop()-1ec70...
Issue 142532 in chromium: Twitter hangs renderer process on Canary
Re: Issue 142531 in chromium: PDFBrowserTest.Basic fails on internal
Official Mac bot
Re: Issue 122279 in chromium: Run chromeos_unittests on all chromeos bots
Re: Issue 142384 in chromium: Add chromeos_unittests to the relevant
chromeos builders
Re: Issue 142212 in chromium: Chrome 23 does not apply pseudo
class :first-child on element <dd>
Re: Issue 142215 in chromium: SVG: "tspan" element does not inherit
attibutes from surrounding "text" element
Issue 142533 in chromium: Needs a finer lifetime management for isolated
filesystem
Re: Issue 142526 in chromium: File manager: selecting multiple folders
fails to include file icons
Re: Issue 136531 in chromium: Need folder icon for thumbnail view
Re: Issue 114906 in chromium: when playing a youtube video, video starts,
but the buffering animation doesn't go away and the video controls are
non-responsive, and the "reload" button in chrome looks like it's pressed
down
Re: Issue 142528 in chromium: view-source handler does not respect Dev
Tools settings
Re: Issue 115373 in chromium: Flash crash
Re: Issue 142466 in chromium:
GDataFileSystem::OnGetEntryCompleteForCloseFile() is modifying a GDataEntry
directly
Re: Issue 116520 in chromium: internal flash plugin not working
Re: Issue 142532 in chromium: Twitter hangs renderer process on Canary
Re: Issue 142287 in chromium: Twitter page Freeze and crash evantually
Re: Issue 142289 in chromium: Needs a finer permission control mechanism
for accessing files/filesystems
--
Automated mail from issue updates at http://crbug.com/
Subscription options: http://groups.google.com/a/chromium.org/group/chromium-bugs
c***@googlecode.com
2012-08-14 22:41:32 UTC
Permalink
Your project notifications generated too many emails to send
individually. Here are the subject lines of the emails you would have
received:

Re: Issue 118002 in chromium: Cannot globally disable spell checking
Re: Issue 122138 in chromium: Spell check confirmation bubble should look
more Mac-like
Re: Issue 142223 in chromium: Problems with spellcheck on OS X again ...
Re: Issue 139409 in chromium: Can't run ppapi gles2 example
Re: Issue 140214 in chromium: GPU Rendering fails on nvidia 304.30 drivers
Re: Issue 140214 in chromium: GPU Rendering fails on nvidia 304.30 drivers
Re: Issue 141793 in chromium: dynamically created SVG animate element does
not update correctly with beginElement()
Re: Issue 32102 in chromium: Requests for dictionaries with no language or
country
Re: Issue 40567 in chromium: ' not recognized as part of word
Issue 142739 in chromium: Upgrade to the latest AMD Linux driver for the
GPU ATI bot
Re: Issue 142495 in chromium: Add a build target for perf_av bot
dependencies
Re: Issue 40900 in chromium: Spellchecker handles mixed case suggestions
poorly
Re: Issue 140495 in chromium: Text box fails to render contents and does
not accept user input.
Issue 142740 in chromium: Chrome consuming excessive resources on Mac Lion
- started with today's build
Re: Issue 142714 in chromium: alert/confirm/prompt breaks event cancellation
Re: Issue 142740 in chromium: Chrome consuming excessive resources on Mac
Lion - started with today's build
Re: Issue 141441 in chromium: Flash assets disappear from page after
changing tabs
Re: Issue 141441 in chromium: Flash assets disappear from page after
changing tabs
Re: Issue 142738 in chromium: Ogg file no longer plays
Issue 142741 in chromium: HP Simple Pass incompatability
Re: Issue 132794 in chromium: Refactor PyAuto to use only the JSON
automation interface
Issue 142742 in chromium: HP Simple Pass incompatability
Re: Issue 36544 in chromium: Chromium's cache ignores Vary and headers
Issue 142743 in chromium: MediaSource object needs reverted for Chrome 22
Re: Issue 140648 in chromium: Print: Unable to load print preview page,
shows "Loading preview" message for long time.
Re: Issue 126634 in chromium: Eliminate if (!callback.is_null()) where
callback is never null
Re: Issue 141699 in chromium: Prompt for host login pops up after refreshing
Re: Issue 141512 in chromium: [chromoting]: Cleanup threading semantics in
event executors
Re: Issue 132193 in chromium: EventExecutor implementations may be crashy
Re: Issue 141831 in chromium: crash in the destructor of
MediaStreamCaptureIndicator
Re: Issue 141642 in chromium: GPU acceleration broken
Re: Issue 142124 in chromium: full screen video playback is jittery. normal
size is fine though.
Issue 142744 in chromium: Context menu stays until page refresh on
chrome://bookmarks
Re: Issue 80601 in chromium: sticky cursor in Street View in Cr 11 and 12
Re: Issue 140226 in chromium: Print preview stuck in win XP
Re: Issue 141831 in chromium: crash in the destructor of
MediaStreamCaptureIndicator
Re: Issue 118154 in chromium: Crash on loading wetransfer.com
Re: Issue 140831 in chromium: Flash crashes very frequently on Chrome 21 on
Windows 7
Re: Issue 142744 in chromium: Context menu stays until page refresh on
chrome://bookmarks
Re: Issue 118002 in chromium: Cannot globally disable spell checking
Issue 142745 in chromium: Patch related to MediaSource needs reverted for
Chrome 22
Re: Issue 97153 in chromium: Chrome_Mac: Browser crash expanding web
content popup menu on Lion
Re: Issue 141935 in chromium: Add error-handling to Win32 API calls in
DisconnectWindowWin
Re: Issue 142745 in chromium: Patch related to MediaSource needs reverted
for Chrome 22
Re: Issue 142743 in chromium: MediaSource object needs reverted for Chrome
22
Issue 142747 in chromium: In packaged apps, context menu API onclick event
has an invalid Tab value
Re: Issue 139253 in chromium: Move chrome.experimental.app.onLaunched to
chrome.app.runtime.onLaunched
Re: Issue 142747 in chromium: In packaged apps, context menu API onclick
event has an invalid Tab value
Issue 142748 in chromium: https fail CHromium, OK in Safari
Re: Issue 136332 in chromium: Google Chrome could not sync your data
because it could not connect to the sync server.
Re: Issue 121680 in chromium: Buffer underruns with HTML5 audio
Re: Issue 140498 in chromium: Pepper Flash: loading fails on Gangan online
Re: Issue 142479 in chromium: Flash "enhanced microphone" audio output
choppy
Re: Issue 141451 in chromium: Chrome crashes when tried to install bundle
apps
Re: Issue 129776 in chromium: WebDrive hosted external app files don't show
the proper icon
Re: Issue 142426 in chromium: Make Linux host auto-start after reboot.
Issue 142749 in chromium: Product Tour is displaying blank screen (Dev
Channel)
Re: Issue 142426 in chromium: Make Linux host auto-start after reboot.
Re: Issue 130342 in chromium: Need to wire external apps in to default open
mechanism in file browser.
Re: Issue 139861 in chromium: Linux: GPU process spins consuming 100% CPU
after opening multiple MapsGL tabs
Issue 142750 in chromium: Letter picker misaligned in omnibox
Re: Issue 142670 in chromium: NVIDIA Linux GPU bot drawing all black for
many GPU smoke tests
Re: Issue 130342 in chromium: Need to wire external apps in to default open
mechanism in file browser.
Re: Issue 136839 in chromium: Drive 3rd party icons should be consistent in
list view and default action picker
Re: Issue 141806 in chromium: Stack-buffer-overflow in
v8::internal::Factory::NewStringFromUtf8
Re: Issue 142744 in chromium: Context menu stays until page refresh on
chrome://bookmarks
Re: Issue 142738 in chromium: Ogg file no longer plays
Re: Issue 116317 in chromium: Switch NaCl's PPAPI Proxy to use Chrome IPC
and its IPC-based Proxy.
Re: Issue 97153 in chromium: Chrome_Mac: Browser crash expanding web
content popup menu on Lion
Re: Issue 138357 in chromium: Aviary Drive app not showing in Files app
Re: Issue 142426 in chromium: Make Linux host auto-start after reboot.
Re: Issue 140044 in chromium: Print preview takes forever on Win XP
Re: Issue 142562 in chromium: Overflow clipping broken with composited
elements
Re: Issue 140648 in chromium: Print: Unable to load print preview page,
shows "Loading preview" message for long time.
Re: Issue 141108 in chromium: Omnibox hangs browser process due to RLZ
lockfile
Re: Issue 140262 in chromium: Extension docs server:
memcache_file_system.py is inefficient
Re: Issue 116317 in chromium: Switch NaCl's PPAPI Proxy to use Chrome IPC
and its IPC-based Proxy.
Re: Issue 142739 in chromium: Upgrade to the latest AMD Linux driver for
the GPU ATI bot
Re: Issue 97153 in chromium: Chrome_Mac: Browser crash expanding web
content popup menu on Lion
Re: Issue 141906 in chromium: Disable 'Save Video As' option in right-click
menu for elements using Media Source API
Re: Issue 115482 in chromium: documentation for default extension CSP
policy is unclear
Re: Issue 121587 in chromium: Unrecoverable error with bookmarks. Modified
bookmark not found in sync model.
Re: Issue 97153 in chromium: Chrome_Mac: Browser crash expanding web
content popup menu on Lion
Re: Issue 142730 in chromium: Short-cuts don't work after closing developer
tools on chrome://chrome/settings/contentExceptions#popups
Re: Issue 141451 in chromium: Chrome crashes when tried to install bundle
apps
Re: Issue 134971 in chromium: Separator line between toolbar and contents
area should fade in/out on appearing/disappearing.
Re: Issue 121587 in chromium: Unrecoverable error with bookmarks. Modified
bookmark not found in sync model.
Re: Issue 142744 in chromium: Context menu stays until page refresh on
chrome://bookmarks
Re: Issue 134920 in chromium: Fullscreen mode should work with Instant
Extended API
Re: Issue 134920 in chromium: Fullscreen mode should work with Instant
Extended API
Issue 142751 in chromium: NSExceptions thrown loading services menu.
Re: Issue 142662 in chromium: Tabstrip should always use touch stacking
arrangement when touched.
Re: Issue 92399 in chromium: Crash in OSX SpellChecker code.
Issue 142752 in chromium: "Paste and go" & "Paste and search" swapped in
new tab
Re: Issue 141572 in chromium: Draw (more) attention to active Talk
conversations
Re: Issue 113993 in chromium: Implement RFC3484 in net/dns
Re: Issue 142529 in chromium: Extension docs server: integration tests are
broken
Re: Issue 134946 in chromium: Alternate search providers should work with
Instant Extended API
Re: Issue 142744 in chromium: Context menu stays until page refresh on
chrome://bookmarks
Re: Issue 87876 in chromium: Apps pinned to taskbar always start in same
position (do not remember previous location)
Re: Issue 121587 in chromium: Unrecoverable error with bookmarks. Modified
bookmark not found in sync model.
--
Automated mail from issue updates at http://crbug.com/
Subscription options: http://groups.google.com/a/chromium.org/group/chromium-bugs
c***@googlecode.com
2012-08-17 18:50:44 UTC
Permalink
Your project notifications generated too many emails to send
individually. Here are the subject lines of the emails you would have
received:

Re: Issue 143434 in chromium: Black bar appearing next to scroll bar
Issue 143435 in chromium: Chrome causes Macbook Pro to switch to discrete
Graphics.(NVidia card)
Issue 143436 in chromium: Slow drawing when using an external monitor
Re: Issue 143434 in chromium: Black bar appearing next to scroll bar
Re: Issue 141747 in chromium: Choppy Sound
Re: Issue 142416 in chromium: No way to recover from “Update server not
available (error: 12)”
Re: Issue 141763 in chromium: Profile pictures should appear in the launcher
Re: Issue 127313 in chromium: Poor user experience when accessing link that
is an RSS feed
Re: Issue 143434 in chromium: Black bar appearing next to scroll bar
Re: Issue 143434 in chromium: Black bar appearing next to scroll bar
Re: Issue 142896 in chromium: Http/MediaTest.VideoTulipWebm/0 occasionally
hits a WebKit compositing assert
Re: Issue 143312 in chromium: Context menus for text fields in packaged
apps should show available actions (copy, paste, etc) by default
Re: Issue 126411 in chromium: Allow viewing source of Atom feeds
Re: Issue 143434 in chromium: Black bar appearing next to scroll bar
Re: Issue 101922 in chromium: Incorrect visibility state when opening in
foreground tab
Re: Issue 137345 in chromium: Update Wrench menu style (unified touch /
non-touch)
Re: Issue 143434 in chromium: Black bar appearing next to scroll bar
Issue 143438 in chromium: Chrome does not quit (sometimes)
Re: Issue 140022 in chromium: WebGL Conformance Tests fail when NVIDIA
Optimus GPU is used
Re: Issue 143275 in chromium: Enable packaged apps to listen for events on
startup, shutdown, active, and idle
Re: Issue 43902 in chromium: innerHTML decompilation issues in textarea
Re: Issue 143434 in chromium: Black bar appearing next to scroll bar
Re: Issue 141774 in chromium: Audio Glitch
Re: Issue 140361 in chromium: Simpler naclsdk list/update commands
Re: Issue 131942 in chromium: Computer hangs after clicking the wrench in
Chrome
Issue 143442 in chromium: ctrl + w (close tab) doesnt work on going full
screen
Re: Issue 143260 in chromium: Updates to packaged apps should provide a
mechanism for implementing a graceful transition
Re: Issue 137224 in chromium: 2x image of discloure_arrow.png
Issue 143443 in chromium: Chrome crashes when importing spreadsheet
Re: Issue 143256 in chromium: chrome.app.window.create should allow windows
to be created in the minimized & attention states
Re: Issue 131742 in chromium: Separate shell window creation from showing
Issue 143445 in chromium: swappedout:// shown in the URL bar
Re: Issue 143222 in chromium: Packaged apps should have control over
launcher right-click context menu
Re: Issue 143443 in chromium: Chrome crashes when importing spreadsheet
Re: Issue 143346 in chromium: Chrome OS hangs after reboot if first user
has solid background wallpaper
Re: Issue 142680 in chromium: Chrome requires inline app install to be
initiated from "verified site", CWS only allows one
Re: Issue 143434 in chromium: Black bar appearing next to scroll bar
Re: Issue 143219 in chromium: Icon badging should be supported for packaged
apps
Re: Issue 142962 in chromium: Extract HWNDy bits from NativeWidgetWin
Re: Issue 66851 in chromium: App badges
Re: Issue 143219 in chromium: Icon badging should be supported for packaged
apps
Re: Issue 143346 in chromium: Chrome OS hangs after reboot if first user
has solid background wallpaper
Re: Issue 143428 in chromium: Text on web pages not rendering properly
Re: Issue 143428 in chromium: Text on web pages not rendering properly
Re: Issue 143434 in chromium: Black bar appearing next to scroll bar
Re: Issue 143434 in chromium: Black bar appearing next to scroll bar
Re: Issue 143434 in chromium: Black bar appearing next to scroll bar
Re: Issue 143217 in chromium: Packaged apps need draw/clear attention
functions on chrome.app.window
Issue 143448 in chromium: Remove kOffTheRecordMediaCacheDirname
Re: Issue 143215 in chromium: Browser Plugin: Need plug-in access for
content loaded using the browser plug-in
Re: Issue 143213 in chromium: Browser Plugin: Need to inject authentication
cookies
Re: Issue 142450 in chromium: Expose system tray, status area presence to
apps
Issue 143449 in chromium: "The webpage is not available" references wrench
menu, which is no longer a wrench
Re: Issue 134907 in chromium: Provide default implementation of common Mac
menu accelerators in apps
Re: Issue 140239 in chromium: An additional scroll bar appears at the right
on many sites
Re: Issue 142428 in chromium: Chrome: Crash Report - Stack
Signature: WebCore::CCScopedLockResourceForRead::CCSco...
Re: Issue 143434 in chromium: Black bar appearing next to scroll bar
Re: Issue 143219 in chromium: Icon badging should be supported for packaged
apps
Re: Issue 38214 in chromium: Add Alpha, Beta and Stable versions to
Extensions
Re: Issue 143428 in chromium: Text on web pages not rendering properly
Re: Issue 143428 in chromium: Text on web pages not rendering properly
Re: Issue 143312 in chromium: Context menus for text fields in packaged
apps should show available actions (copy, paste, etc) by default
Re: Issue 142847 in chromium: Expose names of system-installed fonts to
packaged apps
Re: Issue 143428 in chromium: Text on web pages not rendering properly
Re: Issue 142680 in chromium: Chrome requires inline app install to be
initiated from "verified site", CWS only allows one
Re: Issue 142703 in chromium: Audit URLRequestContext subobjects to make
sure nothing other than HTTP Cookies + Cache need to be sepearated for
Isolated Apps.
Re: Issue 142703 in chromium: Audit URLRequestContext subobjects to make
sure nothing other than HTTP Cookies + Cache need to be sepearated for
Isolated Apps.
Re: Issue 139444 in chromium: Add local storage space remaining to
chrome:drive-internals
Re: Issue 143274 in chromium: linux_clang try bot timing out when rolling
gyp r1471
Re: Issue 141629 in chromium: Error 101 (net::ERR_CONNECTION_RESET) if IIS
requests client certificates.
Re: Issue 139938 in chromium: Incorrect dirty rectangles leading to garbage
on screen
Re: Issue 142680 in chromium: Chrome requires inline app install to be
initiated from "verified site", CWS only allows one
Re: Issue 143434 in chromium: Black bar appearing next to scroll bar
Re: Issue 143434 in chromium: Black bar appearing next to scroll bar
Re: Issue 55071 in chromium: dataTransfer setData multiple formats does not
work in Chrome for Windows if one of the types is "DownloadURL"
Re: Issue 143008 in chromium: kendoui javascript controls broken in dev
channel releases
Issue 143451 in chromium: Day of the week cut off in uber tray
Re: Issue 142025 in chromium: Error when loading images from FileSystem
within a platform app
Re: Issue 141940 in chromium: IDL parser doesn't generate C++ enums
Re: Issue 139800 in chromium: -webkit-transform translateX(0) causes pixel
reside on screen when animating
Re: Issue 140773 in chromium: Cannot scroll down the page smoothly
Re: Issue 142716 in chromium: Date is truncated in Tray
Re: Issue 143428 in chromium: Text on web pages not rendering properly
Re: Issue 143451 in chromium: Day of the week cut off in uber tray
Re: Issue 141891 in chromium: "Property '__defineGetter__' of object object
is not a function" when reloading platform app
Re: Issue 140185 in chromium: Clarify documentation around inline event
handlers' replacement for extensions/apps.
Re: Issue 137755 in chromium: Ensure that the Windows host component is
updated, even if it is in use
Re: Issue 143214 in chromium: Crash in
CredentialCacheService::GetLastUpdatedTime()
Re: Issue 141555 in chromium: Auto-create credential cache for users who
are already signed in and go on to upgrade Chrome
Re: Issue 142271 in chromium: Text selection sometimes leaves residual
selection highlight after un-selecting
Re: Issue 143434 in chromium: Black bar appearing next to scroll bar
Re: Issue 141584 in chromium: Add UI to show the user how much disk each
installed App is using
Re: Issue 140856 in chromium: Remove
ExtensionService::GetInstalledAppForRenderer
Issue 143452 in chromium: Gmail using 2 much memory when using only pepper
flash
Re: Issue 140681 in chromium: Add API call to join multicast group
Re: Issue 140680 in chromium: Add API call to get available network
interfaces
Re: Issue 143428 in chromium: Text on web pages not rendering properly
Re: Issue 140239 in chromium: An additional scroll bar appears at the right
on many sites
Re: Issue 143452 in chromium: Gmail using 2 much memory when using only
pepper flash
Re: Issue 120321 in chromium: Spinner always present when using Google Docs
Re: Issue 143255 in chromium: View-source URLs should use a separate
SiteInstance in all cases.
--
Automated mail from issue updates at http://crbug.com/
Subscription options: http://groups.google.com/a/chromium.org/group/chromium-bugs
c***@googlecode.com
2012-08-18 02:25:43 UTC
Permalink
Your project notifications generated too many emails to send
individually. Here are the subject lines of the emails you would have
received:

Re: Issue 142574 in chromium: Flash FileFilter doesn't work
Re: Issue 143527 in chromium: RolloverProtectedNow in time_win.cc not cross
process safe
Re: Issue 142588 in chromium: Chrome in Windows 8 build 8400
Re: Issue 142612 in chromium: Chrome startup registry entry missing quotes
Re: Issue 142618 in chromium: chrome://flags is overcrowded
Re: Issue 142629 in chromium: Web pages like ABC.com and Youtube lock up
and can't scroll. Sometime go completely white
Re: Issue 142633 in chromium: .htaccess: Not able to login on framesets
Re: Issue 143484 in chromium: After downloading xls file, black box appears
covering gmail
Re: Issue 121108 in chromium: REGRESSION: Chrome displays gibberish square
fonts
Re: Issue 143506 in chromium: gtalk is broken by r152100
Re: Issue 111316 in chromium: Run layout tests using content_shell
Re: Issue 139642 in chromium: unit_tests:
PromoResourceServiceTest.NotificationPromoTest fails on android.
Re: Issue 142636 in chromium: GET Request Cross Site Scripting Filter
Evasion
Re: Issue 141566 in chromium: Slider in Youtube videos sticking after mouse
click on it
Re: Issue 137415 in chromium: Issue with Youtube uploader using webcam
Re: Issue 143311 in chromium: GPU throughput test failures
Re: Issue 142640 in chromium: Please re-open issue #141566 - it is still
occurring
Re: Issue 130224 in chromium: Warn on localStorage Use
Re: Issue 142641 in chromium: setup chrome fail on Win7
Re: Issue 142671 in chromium: Error 310 (net::ERR_TOO_MANY_REDIRECTS):
There were too many redirects
Re: Issue 142699 in chromium: Flash plugin crash on all open instances of
chrome
Re: Issue 142707 in chromium: Chromium process hangs when open a lot of
tabs from http://www.google.ru/reader
Re: Issue 142806 in chromium: two versions of flash
Re: Issue 129291 in chromium: Alt+tab takes 2 - 3 hits before switching
from popped out windows
Re: Issue 140600 in chromium: Restoring a tab doesn't properly restore the
user agent override string
Re: Issue 141848 in chromium: Developer tools area remains open but not
visible on Youtube when tools are opened in another tab
Re: Issue 142817 in chromium: up/down scrolling in full-screen plus looks
wrong
Re: Issue 142831 in chromium: requestAnimationFrame callbacks are issued
far too slowly when Windows GPU load is high on GPUs with dynamic clock
speed adjustment
Re: Issue 142877 in chromium: Middle mouse button functionality inexistant
in Flash
Re: Issue 142828 in chromium: Chrome, spell check in Gmail not working when
switched to a different language, requires restart of browser.
Re: Issue 142834 in chromium: Not able to connect to jWebsocket server
Re: Issue 141796 in chromium: Pepper Flash slow in unaccelerated mode (esp.
full screen video on, e.g., XP)
Re: Issue 142884 in chromium: Latest Flash Player Issues - 15/08/2012
Re: Issue 142841 in chromium: IDL parser force API implementation to have a
separate directory even second-level namespace
Re: Issue 141848 in chromium: Developer tools area remains open but not
visible on Youtube when tools are opened in another tab
Re: Issue 142874 in chromium: Windows 8 scaling makes text blurry in chrome
Re: Issue 142881 in chromium: chrome crashes X when certain webpages are
opened
Re: Issue 143506 in chromium: gtalk is broken by r152100
Re: Issue 142894 in chromium: Overlay of an unwanted wihdow of text when
sending to a printer
Re: Issue 142897 in chromium: Incorrect rendering with HTML5 video,
scrolling, and position:fixed elements.
Re: Issue 142911 in chromium: Would like integration between timeline and
profiler (DevTools)
Re: Issue 143506 in chromium: gtalk is broken by r152100
Re: Issue 142929 in chromium: On httpauth with charset of auth and final
http call differend chromium shows wrong charset
Re: Issue 143364 in chromium: Web pages on Chrome don't match screen
resolution
Re: Issue 142932 in chromium: distribution.make_chrome_default=true does
not set chrome as default browser on windows 8, if we ignore UI screens to
select chrome browser as default.
Re: Issue 143214 in chromium: Crash in
CredentialCacheService::GetLastUpdatedTime()
Re: Issue 142669 in chromium: Add alternate New Tab Page for Instant
Extended work - HTML/JS components
Re: Issue 143214 in chromium: Crash in
CredentialCacheService::GetLastUpdatedTime()
Re: Issue 143184 in chromium: Open+close devtools: page loses keyboard focus
Re: Issue 143200 in chromium: Google Chrome frame installation on Windows
XP embedded gives BSOD
Re: Issue 143364 in chromium: Web pages on Chrome don't match screen
resolution
Re: Issue 140239 in chromium: An additional scroll bar appears at the right
on many sites
Re: Issue 142922 in chromium: Corrupt images on
http://www.oceanocoastalspa.com/
Re: Issue 143259 in chromium: website crashes, assertion failed
Re: Issue 143294 in chromium: Print problem
Re: Issue 143318 in chromium: Metro Chrome does not follow Fitts's law
Re: Issue 143326 in chromium: Developer tool fails to show all styles for
pseudo elements ::before and ::after
Re: Issue 142806 in chromium: two versions of flash
Re: Issue 143331 in chromium: Chrome ignores FTP proxy settings
Re: Issue 143332 in chromium: hanging of the browser while opening greater
than 25 tabs
Re: Issue 143338 in chromium: Shortcuts for Chrome breaking on Windows 8
Release Preview
Re: Issue 143339 in chromium: Lags And Slows Down When In Full Screen Mode
Re: Issue 135596 in chromium: unstable playing media files
Re: Issue 143350 in chromium: Scrolling with frames give nasty lines across
screen (see screenshot)
Re: Issue 143011 in chromium: Chrome omnibox (and other text entry) pauses
up to 20 seconds when returning to window
Re: Issue 143357 in chromium: chrome not idling
Re: Issue 143369 in chromium: Website Cookie Dialog Issues
Re: Issue 142574 in chromium: Flash FileFilter doesn't work
Re: Issue 143373 in chromium: Separate Content settings for Incognito
sessions
Re: Issue 143376 in chromium: Flash Player (pepflashplayer.dll ) doesn't
play local files
Re: Issue 143387 in chromium: Chrome Canar 23 crashes when clicking on the
action box, when Extensions in the Action box is turned on
Re: Issue 143398 in chromium: view-source crashes if the webpage isn't
loaded
Re: Issue 142160 in chromium: Flash loading error almost constantly
Re: Issue 143414 in chromium: Non-parallel downloads of linked stylesheets
with media attribute
Re: Issue 142132 in chromium: Problem with the Flash Player
Re: Issue 143435 in chromium: Chrome causes Macbook Pro to switch to
discrete Graphics.(NVidia card)
Re: Issue 143438 in chromium: Chrome does not quit (sometimes)
Issue 143542 in chromium: The initial focus is not set to the password box
on the login screen when external display is connected
Re: Issue 123998 in chromium: Get rid of DownloadFileManager
Re: Issue 140755 in chromium: Chrome JW Player problems for local video
Re: Issue 135370 in chromium: Flash player from a tutorial-dvd cannot play
videos!
Re: Issue 143449 in chromium: "The webpage is not available" references
wrench menu, which is no longer a wrench
Re: Issue 43563 in chromium: Use Rietveld for try jobs
Re: Issue 141969 in chromium: "git mv" then "git try" yields failing tryjobs
Re: Issue 143452 in chromium: Gmail using 2 much memory when using only
pepper flash
Re: Issue 143538 in chromium: Internet Details Dialog box isn't notified of
changing proxy settings in background page
Re: Issue 136624 in chromium: Sound is choppy or distorted
Re: Issue 143515 in chromium: Unable to Edit Content Handlers
Re: Issue 133812 in chromium: streaming videos (Youtube, BBC iplayer) sound
break up and distortion
Re: Issue 143434 in chromium: Black bar appearing next to scroll bar
Re: Issue 141966 in chromium: "git cl upload" does yield a CL that marks
moved files as deleted
Re: Issue 133780 in chromium: Infinite loop on Clear browser data when
NPAPI-Flash Player (gcswf32.dll) enabled and PPAPI is disabled
Re: Issue 142729 in chromium: Chrome crash
@ "ProfileKeyedServiceFactory::GetServiceForProfile
Re: Issue 143493 in chromium: Source code patches
Re: Issue 133191 in chromium: Video performance in the last two updates
Re: Issue 133135 in chromium: Audio & Video Skip
Re: Issue 133117 in chromium: FA content doesn't play in Guest mode and
incognito window
Re: Issue 140450 in chromium: Implement Website Settings Popup on Linux
(GTK)
Re: Issue 129236 in chromium: Sync animation for new OOBE
Re: Issue 128805 in chromium: Add support for downloading contacts via the
Contacts GData API
Re: Issue 133080 in chromium: Sound from flash videos no longer work all of
a sudden. IE works fine, system sounds work fine, just not in chrome.
--
Automated mail from issue updates at http://crbug.com/
Subscription options: http://groups.google.com/a/chromium.org/group/chromium-bugs
c***@googlecode.com
2012-08-20 21:09:07 UTC
Permalink
Your project notifications generated too many emails to send
individually. Here are the subject lines of the emails you would have
received:

Re: Issue 143355 in chromium: Audio tag does not work from extension
Re: Issue 143706 in chromium: Problems dismissing the screensaver in retail
mode
Re: Issue 143660 in chromium: ninja/windows failed to link unit_tests.exe:
multiply defined symbols found
Re: Issue 141084 in chromium: Chrome pdf plugin doesn't detect pdf in .ai
file
Re: Issue 143774 in chromium: GDB catching random exception. RDP failure
E01
Re: Issue 83323 in chromium: Be pessimistic for WAV files and fallback to
plugins if appropriate
Re: Issue 142561 in chromium: Zoom in shortcut (ctrl++) doesnt work on
czech (maybe all non us) keyboard layout
Re: Issue 140347 in chromium: Unable to disable Metro interface on windows
8 RP
Re: Issue 143749 in chromium: [Windows 8] UI Issue - Chrome favicons
overlapping on the navigation bar
Re: Issue 80996 in chromium: PDF fonts not displaying correctly (ligatures)
Re: Issue 143339 in chromium: Lags And Slows Down When In Full Screen Mode
Re: Issue 141084 in chromium: Chrome pdf plugin doesn't detect pdf in .ai
file
Re: Issue 132059 in chromium: Chrome causing 404's ending with
“/cache/[hex-string]/”
Re: Issue 143774 in chromium: GDB catching random exception. RDP failure
E01
Issue 143779 in chromium: VAVDA: cleanup ShiftRightAndInsert
Re: Issue 141747 in chromium: Choppy Sound
Re: Issue 143660 in chromium: ninja/windows failed to link unit_tests.exe:
multiply defined symbols found
Issue 143780 in chromium: Do not reshow mouse lock exit instructions if
unlocked and relocked when in fullscreen.
Issue 143781 in chromium: css Background-image overflows on certain page
zoom levels
Re: Issue 142705 in chromium: Mini Ninjas shaders fails on M21
Re: Issue 143639 in chromium: Regression: NewTabPage thumbnails have a
graphical glitch on the left site
Re: Issue 142939 in chromium: Middle clicking app in New Tab does not open
app in new tab if scroll bar is visible
Issue 143783 in chromium: Crash in PyAuto when using ActionTimeoutChanger
Issue 143782 in chromium: can't quit apps from task bar
Re: Issue 142962 in chromium: Extract HWNDy bits from NativeWidgetWin
Re: Issue 143783 in chromium: Crash in PyAuto when using
ActionTimeoutChanger
Re: Issue 80996 in chromium: PDF fonts not displaying correctly (ligatures)
Re: Issue 143614 in chromium: Restore Last session does not work
if "background apps" is allowed to run
Re: Issue 142231 in chromium: problems with full screen viewing of embedded
video
Issue 143785 in chromium: BreakpadWinDeathTest.TestAccessViolation flaked
on Win7 Tests (1)
Re: Issue 143706 in chromium: Problems dismissing the screensaver in retail
mode
Re: Issue 142993 in chromium: OffscreenTabsApiTest.OffscreenTabMouseEvents
test flakily times out on Windows and Linux
Re: Issue 143660 in chromium: ninja/windows failed to link unit_tests.exe:
multiply defined symbols found
Re: Issue 142804 in chromium: TraceEvent* tests are flaky on bots
Re: Issue 141640 in chromium: Link to youtube will play audio not video
Re: Issue 136825 in chromium: need 2x images for menu related resources
Re: Issue 141084 in chromium: Chrome pdf plugin doesn't detect pdf in .ai
file
Issue 143786 in chromium: deviceScaleFactor() in WebViewImpl always returns
1 downstream and upstream
Re: Issue 141481 in chromium: Video tag when not showing poster breaks
rendering
Re: Issue 143786 in chromium: deviceScaleFactor() in WebViewImpl always
returns 1 downstream and upstream
Re: Issue 143779 in chromium: VAVDA: cleanup ShiftRightAndInsert
Re: Issue 143770 in chromium: Extension manifest v2 forces JS files to be
separate from Extension's HTML - this slows down development
Re: Issue 143783 in chromium: Crash in PyAuto when using
ActionTimeoutChanger
Re: Issue 142939 in chromium: Middle clicking app in New Tab does not open
app in new tab if scroll bar is visible
Re: Issue 138090 in chromium: buffer overflow
Re: Issue 138090 in chromium: buffer overflow
Re: Issue 141790 in chromium: Print Preview Page Slider
Issue 143788 in chromium: blank space on tabstrip while moving tabs around
Issue 143787 in chromium: ProfileSyncServiceFactory handles kDisableSync
incorrectly
Issue 143789 in chromium: Possible bug with canvas flushing
Re: Issue 122913 in chromium: Add support for changing AudioDecoderConfig &
VideoDecoderConfig during playback
Re: Issue 143751 in chromium: xp-release-dual-core/intl2/times regression
Re: Issue 142962 in chromium: Extract HWNDy bits from NativeWidgetWin
Re: Issue 143748 in chromium: xp-release-dual-core/moz/total_byte_r
regression
Re: Issue 66694 in chromium: remove RFC2047 support from
Content-Disposition header handling
Re: Issue 143783 in chromium: Crash in PyAuto when using
ActionTimeoutChanger
Re: Issue 143614 in chromium: Restore Last session does not work
if "background apps" is allowed to run
Re: Issue 143772 in chromium: Double-finger Trackpad tap for right-clicking
a Popup Extension Icon displayed in Omnibox doesn't work
Re: Issue 118788 in chromium: Right mouse click on extension that uses Page
Action in Omni Bar only shows option once
Re: Issue 143785 in chromium: BreakpadWinDeathTest.TestAccessViolation
flaked on Win7 Tests (1)
Issue 143790 in chromium: TabStrip needs to indicate dragging mode somehow
Re: Issue 141084 in chromium: Chrome pdf plugin doesn't detect pdf in .ai
file
Re: Issue 143639 in chromium: Regression: NewTabPage thumbnails have a
graphical glitch on the left site
Re: Issue 142436 in chromium: The screen was filled with gradient color
tiles
Re: Issue 143774 in chromium: GDB catching random exception. RDP failure
E01
Issue 143791 in chromium: gMail not showing messages when window is not
full screen.
Re: Issue 142921 in chromium: "System_dialog" is seen before "EULA".
Re: Issue 143149 in chromium: Issue to the shockwave flash 11.3 r31
Re: Issue 143639 in chromium: Regression: NewTabPage thumbnails have a
graphical glitch on the left site
Issue 143792 in chromium: CSS Media Query innacurate for Win7+ Pointer
support
Re: Issue 142557 in chromium: can not play mp4 file created by
openRTSP(live555)
Re: Issue 142921 in chromium: "System_dialog" is seen before "EULA".
Re: Issue 103168 in chromium: CPU usage of Flash Video is too high.
Re: Issue 143792 in chromium: CSS Media Query innacurate for Win7+ Pointer
support
Re: Issue 143788 in chromium: blank space on tabstrip while moving tabs
around
Re: Issue 140238 in chromium: 'url' in URLFilter doesn't include protocol
Issue 143793 in chromium: linux-release/intl1/times regression
Re: Issue 66694 in chromium: remove RFC2047 support from
Content-Disposition header handling
Re: Issue 143739 in chromium: VAVDA: Ensure current pic is freed properly
Re: Issue 142939 in chromium: Middle clicking app in New Tab does not open
app in new tab if scroll bar is visible
Re: Issue 143669 in chromium: Confirm navigation security defect
Re: Issue 140562 in chromium: ConstrainedWindow(new) - dialog shape
Re: Issue 140548 in chromium: ConstrainedWindow(new) - dialog drop shadow
Re: Issue 134799 in chromium: Chrome 20 Freezes Briefly every few seconds
Re: Issue 143783 in chromium: Crash in PyAuto when using
ActionTimeoutChanger
Re: Issue 143783 in chromium: Crash in PyAuto when using
ActionTimeoutChanger
Re: Issue 142962 in chromium: Extract HWNDy bits from NativeWidgetWin
Re: Issue 128805 in chromium: Add support for downloading contacts via the
Contacts GData API
Re: Issue 140452 in chromium: Sound missing - problem on Google Chrome
after last update
Re: Issue 141734 in chromium: 3G:Highlighting on Verizon Activation dialog
is invisible
Re: Issue 137744 in chromium: New Chrome menu icon on all desktop platforms
Re: Issue 142614 in chromium: Certificate selection window columns missing
Re: Issue 143373 in chromium: Separate Content settings for Incognito
sessions
Re: Issue 140821 in chromium: Page size is not chosen correctly on Chrome
OS.
Re: Issue 143788 in chromium: blank space on tabstrip while moving tabs
around
Re: Issue 138025 in chromium: Update browser and page actions for HiDPI
Re: Issue 143660 in chromium: ninja/windows failed to link unit_tests.exe:
multiply defined symbols found
Issue 143794 in chromium: [Windows 8] Tabstrip context-menu is enabled in
Metro mode and allows minimizing Chrome
Re: Issue 143639 in chromium: Regression: NewTabPage thumbnails have a
graphical glitch on the left site
Issue 143795 in chromium: --no-sandbox should imply
--disable-seccomp-sandbox
Re: Issue 143683 in chromium: update_scripts flakily failing (timeout) on
chromium.webkit Win (dbg) buildbot
--
Automated mail from issue updates at http://crbug.com/
Subscription options: http://groups.google.com/a/chromium.org/group/chromium-bugs
c***@googlecode.com
2012-08-23 18:46:50 UTC
Permalink
Your project notifications generated too many emails to send
individually. Here are the subject lines of the emails you would have
received:

Re: Issue 20011 in chromium: Bookmark positions don't sync correctly if
bookmarks are re-positioned many times under the same parent
Re: Issue 144436 in chromium: Chrome: ModuleSystem::DumpException
Re: Issue 81103 in chromium: [Downloads] Chrome can't download files from
giantrealm.com
Issue 144437 in chromium: getUserMedia failed on second camera on Linux
Re: Issue 144434 in chromium: enable the 'commands' keyboard shortcut API
for packaged apps
Re: Issue 143729 in chromium: Mac: Window content doesn't revert back to
normal
Issue 144438 in chromium: Excessive memory usage in Ubuntu 12.10
Re: Issue 113468 in chromium: Cleanup LoginWebDialog
Re: Issue 144432 in chromium: Video from videotestmatrix doesn't play
Re: Issue 144234 in chromium: Flash game (transformice) fails to load
Re: Issue 132789 in chromium: Remove proxy dependencies from pyautolib
Re: Issue 144429 in chromium: pyauto ssl tests failing on all platforms
Re: Issue 135663 in chromium: pyautolib should detect automation channel
errors directly
Re: Issue 144431 in chromium: add nacl and flash to requirements section
Re: Issue 144425 in chromium: Tab strip context menu not working
Re: Issue 144427 in chromium: White text is corrupt with random pixelated
colors
Re: Issue 130351 in chromium: Mac OS X 10.5 deprecation message inside
chrome://chrome/help/
Re: Issue 133131 in chromium: Unable to Disable Rubber Band Scrolling on OS
X
Re: Issue 133131 in chromium: Unable to Disable Rubber Band Scrolling on OS
X
Issue 144439 in chromium: Progress of downloads (green circle) not displayed
Issue 144440 in chromium: Merge the change that enables component-updated
Flapper onto M22
Re: Issue 144428 in chromium: Human readable task name explanations
Re: Issue 141541 in chromium: Pepper Flash videos do not redraw and are
pixelated
Re: Issue 58151 in chromium: Fails to load xml file on local file system
using XMLHttpRequest
Re: Issue 144359 in chromium: Fix OnDiskSyncableDirectory.FailInitialWrite
test for Android.
Re: Issue 89945 in chromium: Enable search-by-image in the right-click
context menu
Re: Issue 144436 in chromium: Chrome: ModuleSystem::DumpException
Re: Issue 139020 in chromium: Horicontal bar seen above 'Print using system
dialog' on Print Preview
Issue 144442 in chromium: [Windows 8] UI issue with download scanning
protection
Re: Issue 129348 in chromium: Sync: Error Sign out then sign in again
Re: Issue 140221 in chromium: gif images rendering, then disappearing
Issue 144443 in chromium: CCLayerTreeHost::finishCommitOnImplThread wrong
setter order
Re: Issue 144425 in chromium: Tab strip context menu not working
Re: Issue 137808 in chromium: PDF Reader always jumps back to the first
page when the PDF finishes loading
Re: Issue 128103 in chromium: Google.com favicon persists for too long
Issue 144444 in chromium: black flash when windows widgets first pop up
(such as drop down menus)
Re: Issue 144432 in chromium: Video from videotestmatrix doesn't play
Re: Issue 143769 in chromium: Omnibox: Autocompletion is broken
Re: Issue 144432 in chromium: Video from videotestmatrix doesn't play
Re: Issue 144442 in chromium: [Windows 8] UI issue with download scanning
protection
Re: Issue 86342 in chromium: Save web page as pdf truncates text
Re: Issue 128103 in chromium: Google.com favicon persists for too long
Issue 144446 in chromium: Confusing entries about GCP connector in
chrome://flags
Re: Issue 141174 in chromium: minimize window halts audio/video playback
Issue 144447 in chromium: Many inline install browser tests could be unit
tests
Re: Issue 143413 in chromium: Breakpad tests are flaky on 32-bit
Windows "NaCl Tests" bot
Issue 144448 in chromium: Three finger tap on a word doesn't bring mac osx
dictionary popup
Re: Issue 143764 in chromium: Text looks faded if canvas is present
Re: Issue 144002 in chromium: Fix incorrect usage of
PAGE_TRANSITION_START_PAGE
Re: Issue 86342 in chromium: Save web page as pdf truncates text
Re: Issue 93965 in chromium: PDF viewer: buttons in control strip do not
have tooltips
Re: Issue 144252 in chromium: Bogus CSP message on chrome extension
Re: Issue 125196 in chromium: "Find..." box for unfocussed tabs does not
move when window resizes.
Re: Issue 139310 in chromium: Page search panel dont move when another tab
resized
Re: Issue 130773 in chromium: FR: rename "Extensions" menu in Settings
Re: Issue 144443 in chromium: CCLayerTreeHost::finishCommitOnImplThread
wrong setter order
Re: Issue 142992 in chromium: Right click a link not working properly
Re: Issue 140019 in chromium: OS X high CPU usage when Chrome not running
and AirPort off
Re: Issue 143831 in chromium: Plumb proper SwapBuffersAck to compositor
thread for Windows and Mac
Re: Issue 143742 in chromium: Polish ueber tray for 2x
Re: Issue 143425 in chromium: Automatically retry network requests on
certain errors.
Re: Issue 81712 in chromium: Tabs are not brought to foreground on mousedown
Re: Issue 143834 in chromium: WHO BROKE TAB DRAGGING ON MAC?
Re: Issue 144110 in chromium: crash in Image::ToNSImage
Re: Issue 144154 in chromium: Cmd (⌘) + Drag of download on Download shelf
does not move file
Re: Issue 86342 in chromium: Save web page as pdf truncates text
Re: Issue 143729 in chromium: Mac: Window content doesn't revert back to
normal
Re: Issue 86342 in chromium: Save web page as pdf truncates text
Re: Issue 143729 in chromium: Mac: Window content doesn't revert back to
normal
Issue 144451 in chromium: Object tag for rendering videos fail to show when
viewed.
Re: Issue 139020 in chromium: Horicontal bar seen above 'Print using system
dialog' on Print Preview
Re: Issue 144432 in chromium: Video from videotestmatrix doesn't play
Re: Issue 130773 in chromium: FR: rename "Extensions" menu in Settings
Re: Issue 143820 in chromium: "Right-click" menu fails to appear in the
tab strip area with Link touch screen
Re: Issue 144436 in chromium: Chrome: ModuleSystem::DumpException
Re: Issue 140019 in chromium: OS X high CPU usage when Chrome not running
and AirPort off
Issue 144452 in chromium: Player doesn't behave well after long pause
Re: Issue 143438 in chromium: Chrome does not quit (sometimes)
Re: Issue 144084 in chromium: Unable to load flash games via Flash Version
11.3.31.230 on Chrome
Re: Issue 144231 in chromium: Horizontal scrolling of app list is backwards
Re: Issue 6944 in chromium: sandbox tests should not fail when running from
the D:\ drive.
Re: Issue 144428 in chromium: Human readable task name explanations
Re: Issue 144084 in chromium: Unable to load flash games via Flash Version
11.3.31.230 on Chrome
Re: Issue 37028 in chromium: Attach sRGB to untagged images instead of
monitor profile (wide gamut monitor problems with Mac OSX)
Re: Issue 137316 in chromium: Refocus apps from App List Search should work
Re: Issue 131013 in chromium: getUserMedia should not need audio/video
device if it's not trying to get that media
Re: Issue 144425 in chromium: Tab strip context menu not working
Re: Issue 144340 in chromium: Touch::TPM is not displayed on EULA System
security settings during OOBE
Re: Issue 133033 in chromium: Paste as plain text should contain plain text
in text/html clipboard data
Re: Issue 133033 in chromium: Paste as plain text should contain plain text
in text/html clipboard data
Re: Issue 143292 in chromium: Add a disable sleep setting for Desktops
Re: Issue 140019 in chromium: OS X high CPU usage when Chrome not running
and AirPort off
Re: Issue 130351 in chromium: Mac OS X 10.5 deprecation message inside
chrome://chrome/help/
Re: Issue 144401 in chromium: Chrome:
extensions::PushMessagingEventRouter::Shutdown()
Re: Issue 143658 in chromium: CSS animations with both transform and
opacity are unsupported.
Re: Issue 144299 in chromium: [chrome] - stl_tree.h:1582]
content::VaapiH264Decoder::FillVAPicture
Re: Issue 144053 in chromium: Don't add version and codec attributes for
disabled channels in session configuration.
Re: Issue 143292 in chromium: Add a disable sleep setting for Desktops
Re: Issue 144299 in chromium: [chrome] - stl_tree.h:1582]
content::VaapiH264Decoder::FillVAPicture
Issue 144454 in chromium: Keyboard focus outline too large for navigation
buttons on the settings page.
Re: Issue 140019 in chromium: OS X high CPU usage when Chrome not running
and AirPort off
--
Automated mail from issue updates at http://crbug.com/
Subscription options: http://groups.google.com/a/chromium.org/group/chromium-bugs
c***@googlecode.com
2012-08-24 22:12:10 UTC
Permalink
Your project notifications generated too many emails to send
individually. Here are the subject lines of the emails you would have
received:

Issue 144736 in chromium: HQP: Should Cull Redirects
Re: Issue 136828 in chromium: Severe memory leak over time when reloading a
tab containing a HTML5 game
Re: Issue 142092 in chromium: Artifacts left behind when moving/animating
elements
Re: Issue 137910 in chromium: Regression: Directional text, two whitespaces
and <span dir="auto">..</span> cause the following text to disappear
Re: Issue 143735 in chromium: Perf_av: scrubbing regression on linux
Re: Issue 137910 in chromium: Regression: Directional text, two whitespaces
and <span dir="auto">..</span> cause the following text to disappear
Re: Issue 144736 in chromium: HQP: Should Cull Redirects
Re: Issue 138730 in chromium: The scrollHeight property of a textarea
depends on the zoom level
Re: Issue 144083 in chromium: Leak of SchemeWhiteList in Unit Tests
Re: Issue 144082 in chromium: Leak of Task Reply Object in Unit Tests
Re: Issue 144432 in chromium: Bitstream conversion incorrectly applied to
SW-decoded video
Re: Issue 144081 in chromium: Leak of std::set Node Downstream of
URLIndexPrivateData::AddWordToIndex in Unit Tests
Re: Issue 144432 in chromium: Bitstream conversion incorrectly applied to
SW-decoded video
Issue 144737 in chromium: Black screen displays when we lock the screen
Re: Issue 144702 in chromium: Adjust when non-touch tabstrip is triggered
Re: Issue 142507 in chromium: Creating a new pp::ImageData right after a
ReplaceContents should be able to reuse an old DIB
Re: Issue 144581 in chromium: Cloud print service does not work on Windows
Server 2008
Re: Issue 136310 in chromium: Disable falling tests after r121912
(multipart/x-mixed-replace) of WebKit.
Re: Issue 138730 in chromium: The scrollHeight property of a textarea
depends on the zoom level
Re: Issue 142507 in chromium: Creating a new pp::ImageData right after a
ReplaceContents should be able to reuse an old DIB
Re: Issue 144726 in chromium: Remove tegra2 bots from waterfall
Re: Issue 144451 in chromium: Object tag for rendering videos fail to show
when viewed.
Re: Issue 137910 in chromium: Regression: Directional text, two whitespaces
and <span dir="auto">..</span> cause the following text to disappear
Re: Issue 139962 in chromium: "Shockwave is not responding" infobars with
Mac Flapper enabled
Re: Issue 143733 in chromium: Labels in MapsGL are much more bold in Dev /
Canary than Stable.
Issue 144739 in chromium: "Open as" NTP menu options don't make sense for
packaged apps
Re: Issue 136012 in chromium: Avoid expensive calls to acquireLayerTextures
on RWHVA updates with threaded UI compositor
Re: Issue 144401 in chromium: Chrome:
extensions::PushMessagingEventRouter::Shutdown()
Re: Issue 108223 in chromium: Implement IDBOpenDBRequest.onupgradeneeded
Re: Issue 143733 in chromium: Labels in MapsGL are much more bold in Dev /
Canary than Stable.
Re: Issue 139502 in chromium: REGRESSION: Rendering difference in Chrome 21
and 22 that affected on Persian Wikipedia
Issue 144741 in chromium: Enable remote debugging and port via about:flag
Re: Issue 144726 in chromium: Remove tegra2 bots from waterfall
Re: Issue 129033 in chromium: Cannot delete this in an
ImplicitAnimationObserver subclass
Re: Issue 140399 in chromium: Listbox rendering problem
Re: Issue 143735 in chromium: Perf_av: scrubbing regression on linux
Re: Issue 142348 in chromium: Upstream X509Util.java
Re: Issue 142455 in chromium: REGRESSION: Unexpected rendering line split
Re: Issue 130797 in chromium: POST does not seem to invalidate cache
Re: Issue 141768 in chromium: Certificate Authorities aren't honored across
re-logins
Re: Issue 144528 in chromium: Unable to set Wallpaper
Re: Issue 144310 in chromium: Searchbox is not in middle of NTP page on ESC.
Re: Issue 144718 in chromium: ZGB,Mario and Alex::White flash displays at
login screen after logout the user
Re: Issue 144741 in chromium: Enable remote debugging and port via
about:flag
Re: Issue 143443 in chromium: Chrome crashes when importing spreadsheet
Re: Issue 130797 in chromium: POST does not seem to invalidate cache
Re: Issue 144737 in chromium: Black screen displays when we lock the screen
Re: Issue 144723 in chromium: Add assets for notifications area
Re: Issue 144310 in chromium: Searchbox is not in middle of NTP page on ESC.
Re: Issue 143484 in chromium: After downloading xls file, black box appears
covering gmail
Re: Issue 143348 in chromium: Regression: While opening a new tab,
extension-action-button shows a puzzle
Re: Issue 133963 in chromium: Chrome_ChromeOS: Crash Report - Stack
Signature: ui::Layer::ConvertPointToLayer-616c838a_bfa...
Re: Issue 144551 in chromium: X Error detected with nvidia hardware (in
VMWare virtual machine?)
Re: Issue 142154 in chromium: text-overflow ellipsis broken with fractional
padding
Re: Issue 142945 in chromium: Refactoring: Clean up the way URLRequestJobs
are created
Re: Issue 142962 in chromium: Extract HWNDy bits from NativeWidgetWin
Re: Issue 143397 in chromium: PDF randomly closes
Re: Issue 141343 in chromium: Translation crashed
Re: Issue 144000 in chromium: 1 minutes left on battery status
Issue 144742 in chromium: 0.10% regression in Mac Chromium.app size
somewhere in 153259: 153270
Re: Issue 113288 in chromium: Share options overlap in the CNN vidoes
Re: Issue 138586 in chromium: Profile Avatar UI Glitch on Mac OS
Re: Issue 141229 in chromium: SystemInfo.Storage API support
Re: Issue 139160 in chromium: Maximize Icon is not aligned back to same
place once all the profile are removed.
Re: Issue 141159 in chromium: Win8, Metro mode - taskbar notification not
visible after allowing access to media devices
Re: Issue 141379 in chromium: VBR MP4 video won't play, no error message,
should drop down to next available video source when unsupported
Re: Issue 123755 in chromium: login_utils uses OffTheRecord profile in a
inconsistent way
Re: Issue 141159 in chromium: Win8, Metro mode - taskbar notification not
visible after allowing access to media devices
Re: Issue 126755 in chromium: Dividers are missing in network dropdown on
error screen.
Re: Issue 141704 in chromium: Infinite redirect on
http://wifi.google.com/prefs
Issue 144745 in chromium: Zoom bubble doesn't update
Re: Issue 143484 in chromium: After downloading xls file, black box appears
covering gmail
Re: Issue 143750 in chromium: SystemInfo should handle multiple monitors
Re: Issue 139004 in chromium: Chrome_Mac: Crash Report - Stack
Signature: media::ConvertRGB32ToYUV_SSE2-a7efef70_7357...
Re: Issue 136519 in chromium: SystemInfo API support in Chrome
Re: Issue 134799 in chromium: Chrome 20 Freezes Briefly every few seconds
Re: Issue 143829 in chromium: Communicate over the proper vsync timebase
and interval before starting the compositor thread
Re: Issue 144731 in chromium: Possible race causing deadlock with lost
contexts with --enable-threaded-compositing
Re: Issue 129222 in chromium: GAIA screen on reboot after Auto Update
Re: Issue 143397 in chromium: PDF randomly closes
Re: Issue 144731 in chromium: Possible race causing deadlock with lost
contexts with --enable-threaded-compositing
Issue 144746 in chromium: Applications should be able to ignore gDrive in
available Galleries
Re: Issue 136320 in chromium: HTTP DELETE request loaded from Cache
Re: Issue 129629 in chromium: Add gesture support from the the touchpad
Re: Issue 141525 in chromium: UI issues - http://www.ryze.com
Re: Issue 124890 in chromium: Distorted audio when switching sources when
using MediaElementAudioSourceNode.
Re: Issue 144206 in chromium: Mouse pointer doesn't get hidden when Netflix
app is opened in a normal or maximized window
Re: Issue 131523 in chromium: FR: Tighten requirements which result in
window pane resizer to appear
Re: Issue 124396 in chromium: Move PluginGroup out of webkit/plugins/
Re: Issue 144742 in chromium: 0.10% regression in Mac Chromium.app size
somewhere in 153259: 153270
Re: Issue 129033 in chromium: Cannot delete this in an
ImplicitAnimationObserver subclass
Re: Issue 137086 in chromium: C2P needs a way to know when a user starts
and stops sync
Re: Issue 144589 in chromium: Crash: ChromeToMobileService check failed
Re: Issue 142475 in chromium: Should be a way for SyncNotifierObservers to
know the initial invalidation enabled/disabled state
Re: Issue 143413 in chromium: Breakpad tests are flaky on 32-bit
Windows "NaCl Tests" bot
Re: Issue 132862 in chromium: RootWindowHostLinux shouldn't have ash
specific cursor mutation
Re: Issue 144731 in chromium: Possible race causing deadlock with lost
contexts with --enable-threaded-compositing
Issue 144747 in chromium: Pinning a file stooped when there is not enough
space
Re: Issue 124926 in chromium: Loading Ogg with BlobBuilder fails silently
Re: Issue 144719 in chromium: v8 roll caused perf regression
Re: Issue 135291 in chromium: Webaudio decodes mp3 and aac sources with
codec delay and remainder frames included.
--
Automated mail from issue updates at http://crbug.com/
Subscription options: http://groups.google.com/a/chromium.org/group/chromium-bugs
c***@googlecode.com
2012-08-27 18:05:56 UTC
Permalink
Your project notifications generated too many emails to send
individually. Here are the subject lines of the emails you would have
received:

Re: Issue 133061 in chromium: Add support for mocking/faking the sync
scheduler in SyncManager
Issue 145007 in chromium: Not applying "Never Save Password" preference on
www.navyfederal.org
Re: Issue 144663 in chromium: Append output from about:sanbox to the
about:gpu page
12 issues changed in chromium
Re: Issue 144467 in chromium: TransportClientSocketTest IsConnected flaky
on mac
Re: Issue 129665 in chromium: Add support for keystore based encryption keys
Re: Issue 144923 in chromium: Zoom bubble interferes with keyboard
shortcuts and activation
Re: Issue 141868 in chromium: REGRESSION: With zoom bubble, zooming can no
longer be performed quickly using the keyboard
Re: Issue 138420 in chromium: Add HiDPI asset for
media_stream_capture_indicator.cc bitmap for Mac
Re: Issue 144785 in chromium: Aura crash when scrolling with the mouse wheel
Re: Issue 144923 in chromium: Zoom bubble interferes with keyboard
shortcuts and activation
Re: Issue 141868 in chromium: REGRESSION: With zoom bubble, zooming can no
longer be performed quickly using the keyboard
Re: Issue 144425 in chromium: Tab strip context menu not working
Issue 145008 in chromium: [Mac][Flash Player][Pepper] - Applications/Games
don't recognize loss of focus when apple+tabbing or clicking outside browser
Re: Issue 144742 in chromium: 0.10% regression in Mac Chromium.app size
somewhere in 153259: 153270
Re: Issue 144991 in chromium: chrome.webstore bindings are not injected
into hosted apps
Issue 145009 in chromium: it's not a bug, but it's a real problem with
close button.
Re: Issue 115629 in chromium: downloads.download(), save image, and HTTP
auth
Issue 145010 in chromium: Incorrect behavior of scale3d with negative
parameters in animations.
Re: Issue 144960 in chromium: Chrome crashes while capturing multiple heap
shots(Developer tools_Profiles)
Re: Issue 144048 in chromium: Last-used cloud printer treated as local
printer
Re: Issue 144493 in chromium: Unable to print any pages
Re: Issue 144425 in chromium: Tab strip context menu not working
Re: Issue 83642 in chromium: "report a bug" for apps/extensions
Issue 145011 in chromium: Some figures/values are not displayed
Re: Issue 144401 in chromium: Chrome:
extensions::PushMessagingEventRouter::Shutdown()
Re: Issue 144365 in chromium: Prerender history takes lot of time to load
pages.
Re: Issue 141736 in chromium: Reloading Chrome does not preserve which
space (desktop) windows were in
Re: Issue 145002 in chromium: Flash video doesn't receive Authentication
Prompt from Proxy Server (Ironport)
Re: Issue 144742 in chromium: 0.10% regression in Mac Chromium.app size
somewhere in 153259: 153270
Re: Issue 83642 in chromium: "report a bug" for apps/extensions
Re: Issue 144048 in chromium: Last-used cloud printer treated as local
printer
Re: Issue 144493 in chromium: Unable to print any pages
Re: Issue 144940 in chromium: Strange performance issue
Re: Issue 142962 in chromium: Extract HWNDy bits from NativeWidgetWin
Re: Issue 123739 in chromium: make screenshot ctrl+f5 instead of ctrl+fn+f5
for mac keyboards
Issue 145012 in chromium: Fix Omnibox related assets' sizes
Re: Issue 138745 in chromium: Ash: Support "Next Song", "Previous
Song", "Play/Pause" multimedia buttons
Re: Issue 144347 in chromium: Unable to load any pages; stuck at resolving
proxy
Re: Issue 144365 in chromium: net-internals:#prerender history takes lot of
time to update
Re: Issue 144469 in chromium: Don't run nacl_integration on linux_clang
Re: Issue 144940 in chromium: Strange performance issue
Re: Issue 144940 in chromium: Strange performance issue
Re: Issue 144317 in chromium: Assertion failure and browser crash in
VisitedLinkMaster in debug build
Re: Issue 144035 in chromium: Error 324
Re: Issue 143193 in chromium: Re-evaluate 2*MSS SPDY write buffer sizes
Re: Issue 144796 in chromium: black boxes on youtube
Re: Issue 142769 in chromium: [net] Record RTT/BW in histograms as reported
by OS
Re: Issue 144808 in chromium: Green & pink blocks on youtube Flash video
Re: Issue 141173 in chromium: after submitting a search request to my
vendors website @ clarksecurity.com, I receive a 324 error message code.
Been using Chrome to browse this for years, and it still works on other
browsers. Please help.
Re: Issue 125607 in chromium: Canvas Bezier curves broken in ChromeOS 18,
19, 20 (when ctx.lineWidth = 1)
Re: Issue 144982 in chromium: Occasionally can't click on avatars in OOBE
avatar selection screen
Re: Issue 138745 in chromium: Ash: Support "Next Song", "Previous
Song", "Play/Pause" multimedia buttons
Re: Issue 144663 in chromium: Append output from about:sanbox to the
about:gpu page
Re: Issue 144940 in chromium: Strange performance issue
Re: Issue 144621 in chromium: Chrome Flash Issue with Youtube API uploader
Re: Issue 10506 in chromium: New window not in focus with -start-maximized
flag
Re: Issue 144742 in chromium: 0.10% regression in Mac Chromium.app size
somewhere in 153259: 153270
Re: Issue 19373 in chromium: Launching browser window is not getting focus,
if App window is opened.
Re: Issue 144896 in chromium: Mountain Lion: In the PDF plugin, placing 2
fingers on the trackpad does not show the overlay scrollbar
Issue 145013 in chromium: [chrome] - ui/compositor/layer_animator.cc:303]
ui::LayerAnimator::Step
Re: Issue 54069 in chromium: Crash reporter doesn't work with proxy
Re: Issue 141768 in chromium: Certificate Authorities aren't honored across
re-logins
Re: Issue 143014 in chromium: Hebrew Spellchecker doesn't work?
Re: Issue 144069 in chromium: Chrome tab freezes when playing streaming
video
Issue 145014 in chromium: Improve frame tree updates handling to avoid
delaying updates for page loads with multiple subframes.
Re: Issue 144973 in chromium: Gamepad API not working properly
Re: Issue 145013 in chromium: [chrome] -
ui/compositor/layer_animator.cc:303] ui::LayerAnimator::Step
Re: Issue 144249 in chromium: Unable to open google+ after created an event
Re: Issue 143339 in chromium: Lags And Slows Down When In Full Screen Mode
Re: Issue 136447 in chromium: Re-enable Flash 3D on XP
Re: Issue 144241 in chromium: Already pined page sometimes shows an option
to "Pin to Start Screen".
Re: Issue 143339 in chromium: Lags And Slows Down When In Full Screen Mode
Re: Issue 142897 in chromium: Incorrect rendering with HTML5 video,
scrolling, and position:fixed elements.
Re: Issue 144241 in chromium: Already pined page sometimes shows an option
to "Pin to Start Screen".
Re: Issue 144241 in chromium: Already pined page sometimes shows an option
to "Pin to Start Screen".
Re: Issue 141055 in chromium: Frequent "Could not load Shockwave Flash"
error on Mac
Issue 145015 in chromium: Error(Google Drive): "Object HTML Object Element"
appears while editing.
Re: Issue 113401 in chromium: Third-party iFrames can no longer read their
own cookies when "Block third-party cookies and site data" is enabled
Re: Issue 144954 in chromium: Chrome is not displaying in proper language
Re: Issue 144533 in chromium: Storage API developer-friendly improvements
Issue 145016 in chromium: New reports of "bookmarks duplicated and renamed
to encrypted".
Re: Issue 144533 in chromium: Storage API developer-friendly improvements
Re: Issue 144347 in chromium: Unable to load any pages; stuck at resolving
proxy
Re: Issue 144533 in chromium: Storage API developer-friendly improvements
Re: Issue 140218 in chromium: Remove "All files" filter from the wallpaper
image picker
Re: Issue 145008 in chromium: [Mac][Flash Player][Pepper] -
Applications/Games don't recognize loss of focus when apple+tabbing or
clicking outside browser
Re: Issue 145007 in chromium: Not applying "Never Save Password" preference
on www.navyfederal.org
Re: Issue 144940 in chromium: Strange performance issue
Re: Issue 141868 in chromium: REGRESSION: With zoom bubble, zooming can no
longer be performed quickly using the keyboard
Re: Issue 144988 in chromium: [Dev Tools] Long filenames in Call Stack
panel get ellipsis when they don't need to.
Re: Issue 145013 in chromium: [chrome] -
ui/compositor/layer_animator.cc:303] ui::LayerAnimator::Step
Re: Issue 110013 in chromium: Support DirectInput for gamepad inputs
Re: Issue 144973 in chromium: Gamepad API not working properly
Re: Issue 143442 in chromium: ctrl + w (close tab) doesnt work on going
full screen
Re: Issue 144936 in chromium: Task manager improperly handled packaged app
window resource
Re: Issue 117154 in chromium: Create sample for sandboxed `eval` with
manifest v2.
Re: Issue 114912 in chromium: Bookmarks duplicated as well as renamed
to "encrypted"
Re: Issue 144890 in chromium: Min/Max Window Broken Windows 7 x64
Re: Issue 122770 in chromium: Add User button is active even in restricted
sign in phase
Re: Issue 144241 in chromium: Already pined page sometimes shows an option
to "Pin to Start Screen".
--
Automated mail from issue updates at http://crbug.com/
Subscription options: http://groups.google.com/a/chromium.org/group/chromium-bugs
c***@googlecode.com
2012-08-27 20:14:56 UTC
Permalink
Your project notifications generated too many emails to send
individually. Here are the subject lines of the emails you would have
received:

Re: Issue 143947 in chromium: Mac: Website settings - Use different bubble
on Chrome-internal pages
Re: Issue 144056 in chromium: Print-preview loops forever if last used
printer was a local printer and it was renamed
Re: Issue 144048 in chromium: Last-used cloud printer treated as local
printer
Re: Issue 144056 in chromium: Print-preview loops forever if last used
printer was a local printer and it was renamed
Re: Issue 144990 in chromium: chromeos valgrind/heapchecker bots should run
aura_unittests and ash_unittests
Re: Issue 144048 in chromium: Last-used cloud printer treated as local
printer
Re: Issue 144056 in chromium: Print-preview loops forever if last used
printer was a local printer and it was renamed
Re: Issue 144856 in chromium: 'New Tab' page missing visible way to clear
most visited blacklist
Re: Issue 143338 in chromium: Shortcuts for Chrome breaking on Windows 8
Release Preview
Re: Issue 144821 in chromium: canary chrome standalone installer does not
update windows registry correctly
Re: Issue 144295 in chromium: XF86XK_PowerOff keysym should be mapped to a
KeyboardCode value
Re: Issue 135468 in chromium: Layout of PDF is incorrect when printing from
print preview
Re: Issue 144084 in chromium: Unable to load flash games via Flash Version
11.3.31.230 on Chrome
Re: Issue 141400 in chromium: Web Intents UI Launch Bug
Issue 145028 in chromium: Hebrew Spellchecker ignore numbers inside words
Re: Issue 143014 in chromium: Hebrew Spellchecker doesn't work?
Re: Issue 144479 in chromium: Launching Chrome from the command-line with a
relative path makes it not load plugins
Re: Issue 141964 in chromium: unable to upload files
Re: Issue 2995 in chromium: Unable to upload a DOC / XLS file through the
Chrome File Window for some websites
Re: Issue 144328 in chromium: Media Device Attach Intent on Chrome OS
should be visible even if no windows are open.
Re: Issue 144954 in chromium: Settings (advanced) / Languages / Language
Settings…
Re: Issue 145020 in chromium: Make webkit text sub-pixel positioning
configurable in about:flags
Re: Issue 145007 in chromium: Not applying "Never Save Password" preference
on www.navyfederal.org
Re: Issue 124572 in chromium: printing to PDF results in "The
font 'ArialMT' contains a bad /BBox."
Re: Issue 142038 in chromium: Rendering issue - black artefacts/blocks on
page
Re: Issue 145020 in chromium: Make webkit text sub-pixel positioning
configurable in about:flags
Re: Issue 144442 in chromium: [Windows 8] UI issue with download scanning
protection
Re: Issue 144838 in chromium:
ContentSettingsExceptionAreaWebUITest.testOpenContentSettingsExceptionArea
times out on CrOS
Issue 145030 in chromium: Migrate fullscreen and mouse lock pyauto tests to
browser_tests
Re: Issue 113127 in chromium: Windows classic theme caption buttons
artifact on WM_SETCURSOR.
Re: Issue 145007 in chromium: Not applying "Never Save Password" preference
on www.navyfederal.org
Re: Issue 144328 in chromium: Media Device Attach Intent on Chrome OS
should be visible even if no windows are open.
Re: Issue 142721 in chromium: <browser> tag cannot be sized using
percentage values
Re: Issue 145020 in chromium: Make webkit text sub-pixel positioning
configurable in about:flags
Re: Issue 140460 in chromium: WebKit revision 124535 removed the
nagivator.webkitPointer API and broke pyauto test
Re: Issue 143003 in chromium: content-security-policy applied to chrome://
URLs missing a frame-src directive.
Re: Issue 145030 in chromium: Migrate fullscreen and mouse lock pyauto
tests to browser_tests
Re: Issue 135282 in chromium: GoogleTalkPlugin with Chrome loop error when
mail.google.com active on a tab
Re: Issue 141629 in chromium: Error 101 (net::ERR_CONNECTION_RESET) if IIS
requests client certificates.
Re: Issue 120676 in chromium: Mouse Lock 'Allow' doesn't always lock mouse
on Mac
Re: Issue 142575 in chromium: Flash SharedObject Cookie doesn't work
Issue 145031 in chromium: Unable to render Chromeframe for system-level or
User-level.
Re: Issue 55071 in chromium: dataTransfer setData multiple formats does not
work in Chrome for Windows if one of the types is "DownloadURL"
Issue 145032 in chromium: Tooltips and context menu clashing in "Other
bookmarks"
Re: Issue 141629 in chromium: Error 101 (net::ERR_CONNECTION_RESET) if IIS
requests client certificates.
Re: Issue 143344 in chromium: Garbled text on ted.com video thumbnails
Re: Issue 145031 in chromium: Unable to render Chromeframe for system-level
or User-level.
Re: Issue 144847 in chromium: A problem with Pepper Flash causes it to use
100% CPU, making the system almost unusable
Re: Issue 144107 in chromium: pepperflash root.loaderInfo.bytes is null
Re: Issue 145033 in chromium: ChromeOS window manager should provide
virtual desktops/workspaces/spaces/etc..
Re: Issue 145033 in chromium: ChromeOS window manager should provide
virtual desktops/workspaces/spaces/etc..
Issue 145034 in chromium: extensions.ExtensionsTest.testTriggerPageAction
test failing on WinXP QA bot.
Re: Issue 142038 in chromium: Rendering issue - black artefacts/blocks on
page
Issue 145035 in chromium: Remember scroll position and selection when
navigating inside folders
Re: Issue 141629 in chromium: Error 101 (net::ERR_CONNECTION_RESET) if IIS
requests client certificates.
Re: Issue 145008 in chromium: [Mac][Flash Player][Pepper] -
Applications/Games don't recognize loss of focus when apple+tabbing or
clicking outside browser
Re: Issue 144809 in chromium: 22.0.1229.14 has broken font rendering
Re: Issue 143292 in chromium: Add a disable sleep setting for Desktops
Re: Issue 144326 in chromium: Media Device Attach Intent should be disabled
in M22
Re: Issue 144782 in chromium: Explicit intent dispatch leaves source tab
in "hung" state
Re: Issue 142930 in chromium: Remove AsImage, AsBitmap etc images from
ui/gfx/image/image.h
Re: Issue 144809 in chromium: 22.0.1229.14 has broken font rendering
Re: Issue 144789 in chromium: Tabs Switching Issue
Issue 145036 in chromium:
media.media_basic_playback.MediaConstrainedNetworkPerfTest.testBasicPlaybackMatrix
test fail on Mac10.7QA/Mac10.6 QA beta/Ubuntu QA bots
Issue 145037 in chromium: md5 build error with clang
Re: Issue 144033 in chromium: Drag a tab to 2nd display and crash
Re: Issue 143292 in chromium: Add a disable sleep setting for Desktops
Re: Issue 144640 in chromium: Shield icon (indicating blocked insecure
content) disappears
Re: Issue 145031 in chromium: Unable to render Chromeframe for system-level
or User-level.
Issue 145038 in chromium: Respect video orientation metadata
Re: Issue 145038 in chromium: Respect video orientation metadata
Re: Issue 142902 in chromium: TraceEventWin* and Etw* tests are flaky on
bots
Re: Issue 143292 in chromium: Add a disable sleep setting for Desktops
Re: Issue 142902 in chromium: TraceEventWin* and Etw* tests are flaky on
bots
Issue 145040 in chromium: Custom wallpaper shared across multiple accounts
when disk full
Re: Issue 144789 in chromium: Tabs Switching Issue
Re: Issue 144768 in chromium: When selecting "Find more services by
visiting the Chrome Web Store" installing a new service does not update
Picker
Re: Issue 142479 in chromium: Flash audio output choppy when using speex
codec
Re: Issue 144809 in chromium: 22.0.1229.14 has broken font rendering
Issue 145041 in chromium: input type=date display the calendar on the wrong
screen if you have dual monitor
Re: Issue 143003 in chromium: content-security-policy applied to chrome://
URLs missing a frame-src directive.
Re: Issue 144782 in chromium: Explicit intent dispatch leaves source tab
in "hung" state
Re: Issue 145038 in chromium: Respect video orientation metadata
Re: Issue 143292 in chromium: Add a disable sleep setting for Desktops
Re: Issue 145038 in chromium: Respect video orientation metadata
Re: Issue 141425 in chromium: Starting with 22.0.1229.0 fonts look fuzzy
Issue 145042 in chromium: Remove blue underline in thumbnail view.
Re: Issue 144702 in chromium: Adjust when non-touch tabstrip is triggered
Issue 145043 in chromium: Types in API documentation are not listed in order
Issue 145044 in chromium: Add hover state to buttons.
Re: Issue 107201 in chromium: TabContents should not exist
Re: Issue 143692 in chromium: Remove promotion-type-specific JSON handling
from NotificationPromo and align desktop- and mobile NTP- parsing
Re: Issue 137717 in chromium: ash: Improved spacing around "pop-up blocked"
message in location bar
Issue 145045 in chromium: Magnify image, then shrink down in photo viewer
Re: Issue 143423 in chromium: Animated gifs that are "scrolled out" when a
tab becomes visible do not start playing when they scroll into the frame --
switching tabs and back again works
Re: Issue 92086 in chromium: Clean up remoting/base/codec_test.cc
Issue 145047 in chromium: Colored rectangles
Re: Issue 47554 in chromium: iphone4 front facing video plays upside down
in chrome
Re: Issue 145038 in chromium: Respect video orientation metadata
Issue 145048 in chromium: Disable 4/5 finger gestures by default
Re: Issue 47554 in chromium: Respect video orientation metadata
--
Automated mail from issue updates at http://crbug.com/
Subscription options: http://groups.google.com/a/chromium.org/group/chromium-bugs
c***@googlecode.com
2012-08-30 18:08:39 UTC
Permalink
Your project notifications generated too many emails to send
individually. Here are the subject lines of the emails you would have
received:

Issue 145733 in chromium: Leak in
ExtensionInstallUIDefault::GetNewThemeInstalledInfoBarDelegate
Issue 145734 in chromium: OutOfProcessPPAPITest.TCPSocketPrivate failing on
win_rel tryservers
Re: Issue 145659 in chromium: Security: Chrome X-Frame-Options Duplication
Vulnerability
Re: Issue 145734 in chromium: OutOfProcessPPAPITest.TCPSocketPrivate
failing on win_rel tryservers
Issue 145735 in chromium: Leak in InotifyReaderCallback
Re: Issue 107201 in chromium: TabContents should not exist
Re: Issue 143733 in chromium: Labels in MapsGL are much more bold in Dev /
Canary than Stable.
Re: Issue 134609 in chromium: Chrome: Crash Report - Stack
Signature: v8::internal::JSReceiver::Lookup(v8::intern...
Re: Issue 145546 in chromium: Guest Mode icon in Chrome and Login screen
don't match
Re: Issue 136602 in chromium: Predictor db load shouldn't impact startup
time
Issue 145737 in chromium: Crash in location bar animation when committing
suggestion query before animations complete.
Issue 145738 in chromium: Leak in cupsGetDests2
Re: Issue 145729 in chromium: Continuous builds gone?
Re: Issue 145729 in chromium: Continuous builds gone?
Re: Issue 145349 in chromium: Visual artifacts on tab switch
Re: Issue 143733 in chromium: Labels in MapsGL are much more bold in Dev /
Canary than Stable.
Issue 145739 in chromium: Flapper hangs renderer upon waking machine up
from sleep
Re: Issue 145256 in chromium: Feature "not allowed for specified package
type" message could be more helpful
Issue 145740 in chromium: Several interactive_ui_tests are flaky on Linux
Re: Issue 130854 in chromium: homepage not loading
Re: Issue 145323 in chromium: Include experiment tuples in Linux crash
reports
Re: Issue 145659 in chromium: Security: Chrome X-Frame-Options Duplication
Vulnerability
Re: Issue 145740 in chromium: Several interactive_ui_tests panels tests are
flaky on Linux
Re: Issue 140239 in chromium: An additional scroll bar appears at the right
on many sites
Re: Issue 145729 in chromium: Continuous builds gone?
Issue 145742 in chromium: Leak in ExtensionWebstoreGetWebGLStatusTest
Issue 145744 in chromium: Resizing browser window should clip middle search
box.
Re: Issue 145737 in chromium: Crash in location bar animation when
committing suggestion query before animations complete.
Re: Issue 145744 in chromium: Resizing browser window should clip middle
search box.
Re: Issue 140014 in chromium: Proxy exception list in settings overlay
dialog is not correctly initialized
Re: Issue 142173 in chromium: crypto should be available for Workers
Re: Issue 78859 in chromium: Application Cache Resource fetch failing over
HTTPS
Issue 145745 in chromium: кирилл
Re: Issue 145734 in chromium: OutOfProcessPPAPITest.TCPSocketPrivate
failing on win_rel tryservers
Issue 145747 in chromium: Leak in
TranslateInfoBarDelegate::CreateErrorDelegate
Re: Issue 144975 in chromium: Reduce tap highlight fade time
Re: Issue 145700 in chromium: Multiple leaks in content::DevToolsAgentHost
Re: Issue 145483 in chromium: [Web Inspector feature request] Group
selectors to highlight matched selector in the Styles pane of Elements Panel
Re: Issue 145083 in chromium: Omnibox result list shows not installed app
(cloud printing)
Re: Issue 144415 in chromium: link highlighting way too eager
Re: Issue 144415 in chromium: link highlighting way too eager
Re: Issue 145616 in chromium: updates to media galleries dialog (mac)
Re: Issue 91551 in chromium: Add X-Frame-Options to WEB UI pages
Re: Issue 145720 in chromium: Chrome in Linux emits clicking sound with
Flash content loaded
Re: Issue 143003 in chromium: content-security-policy applied to chrome://
URLs missing a frame-src directive.
Issue 145748 in chromium: Chrome Scroll Bar Error - nested div
Re: Issue 144631 in chromium: DevTools - display full path in the Go to
file dialog.
Re: Issue 132441 in chromium: Extend link highlighting mechanism to
highlight buttons as well
Re: Issue 132438 in chromium: Support CSS link highlight colour preference
Re: Issue 132438 in chromium: Support CSS link highlight colour preference
Re: Issue 100749 in chromium: Preview link following - tap highlighting
Re: Issue 100749 in chromium: Preview link following - tap highlighting
Re: Issue 145725 in chromium: Handle leaks in waveOutXXX API call
Re: Issue 145679 in chromium: Flash Live Video Increasing Delay
Re: Issue 145616 in chromium: updates to media galleries dialog (mac)
Re: Issue 145118 in chromium: Grit should support <else/>
Re: Issue 144328 in chromium: Media Device Attach Intent on Chrome OS
should be visible even if no windows are open.
Re: Issue 145728 in chromium: Leak in MigratePreferences
Re: Issue 145723 in chromium: Leak inside
ExtensionFunctionRegistry::NewFunction
Re: Issue 145706 in chromium: Leak in
PlatformAppBrowserTest::AppWithContextMenu
Re: Issue 145733 in chromium: Leak in
ExtensionInstallUIDefault::GetNewThemeInstalledInfoBarDelegate
Re: Issue 144702 in chromium: Adjust when non-touch tabstrip is triggered
Re: Issue 145742 in chromium: Leak in ExtensionWebstoreGetWebGLStatusTest
Re: Issue 112155 in chromium: Implement a declarative web request API for
extensions
Re: Issue 145735 in chromium: Leak in InotifyReaderCallback
Re: Issue 145738 in chromium: Leak in cupsGetDests2
Re: Issue 145747 in chromium: Leak in
TranslateInfoBarDelegate::CreateErrorDelegate
Re: Issue 144844 in chromium: Exiting incognito mode on iOS Chrome browser
clears all saved passwords over Google Sync
Re: Issue 125981 in chromium: The fundamental error in the icon of
cheeseburger
Issue 145750 in chromium: startup tabs resolution problem
Re: Issue 144328 in chromium: Media Device Attach Intent on Chrome OS
should be visible even if no windows are open.
Re: Issue 145729 in chromium: Continuous builds gone?
Re: Issue 139403 in chromium: Packaged apps link in app section on manifest
page is broken
Re: Issue 145629 in chromium: update media galleries dialog on views
Re: Issue 141082 in chromium: Pepper Flash: Issue when printing from flash
file
Re: Issue 144415 in chromium: link highlighting way too eager
Re: Issue 139403 in chromium: Packaged apps link in app section on manifest
page is broken
Re: Issue 145672 in chromium: DefaultAppsTest failing on Android
Re: Issue 144714 in chromium: Triggering the Media Device Attach Intent
multiple times clear the old intent picker
Re: Issue 144844 in chromium: Exiting incognito mode on iOS Chrome browser
clears all saved passwords over Google Sync
Re: Issue 144844 in chromium: Exiting incognito mode on iOS Chrome browser
clears all saved passwords over Google Sync
Re: Issue 139004 in chromium: Chrome_Mac: Crash Report - Stack
Signature: media::ConvertRGB32ToYUV_SSE2-a7efef70_7357...
Re: Issue 145675 in chromium: White screen displayed when sharing the
website through mail.
Re: Issue 95931 in chromium: Leak in ChromeMainTest.SecondLaunch
Re: Issue 144844 in chromium: Exiting incognito mode on iOS Chrome browser
clears all saved passwords over Google Sync
Re: Issue 144844 in chromium: Exiting incognito mode on iOS Chrome browser
clears all saved passwords over Google Sync
Re: Issue 144844 in chromium: Exiting incognito mode on iOS Chrome browser
clears all saved passwords over Google Sync
Re: Issue 145717 in chromium: Window maximize tab strip animation looks
wacky
Re: Issue 141904 in chromium: Chrome: Crash Report - Stack
Signature: media_stream::StreamDeviceInfo::IsEqual(med...
Re: Issue 141723 in chromium: Add privacy message in Settings page
Re: Issue 145740 in chromium: Several interactive_ui_tests panels tests are
flaky on Linux
Re: Issue 75137 in chromium: NewTabObserver::Observe leaks memory
Re: Issue 145686 in chromium: Create profile dialogue box is not opening
when we click on "Add new user"
Re: Issue 136817 in chromium: Drag & Drop across displays
Re: Issue 125329 in chromium: different target_arch naming scheme confused
in chromium/android
Re: Issue 145539 in chromium: Not able to play Mini Ninjas on Windows 7 or
MacOS
Re: Issue 145740 in chromium: Several interactive_ui_tests panels tests are
flaky on Linux
Re: Issue 143831 in chromium: Plumb proper SwapBuffersAck to compositor
thread for Windows and Mac
Issue 145752 in chromium: platform app windows should be made sure to
always fit on screen
Re: Issue 145668 in chromium:
http://commondatastorage.googleapis.com/chromium-browser-snapshots/index.html
is not displaying the os specific folders
Re: Issue 144676 in chromium: [HiDPI] Occasional scaling problems when
switching between HiDPI native display and an external Normal DPI display
--
Automated mail from issue updates at http://crbug.com/
Subscription options: http://groups.google.com/a/chromium.org/group/chromium-bugs
c***@googlecode.com
2012-08-30 19:29:39 UTC
Permalink
Your project notifications generated too many emails to send
individually. Here are the subject lines of the emails you would have
received:

Re: Issue 145539 in chromium: Not able to play Mini Ninjas on Windows 7 or
MacOS
Issue 145761 in chromium: Optimized 2d painting path doesn't work correctly
in Pepper Flash fullscreen mode.
Re: Issue 145747 in chromium: Leak in
TranslateInfoBarDelegate::CreateErrorDelegate
Re: Issue 137836 in chromium: RSS handler has multiple close buttons
Re: Issue 145761 in chromium: Optimized 2d painting path doesn't work
correctly in Pepper Flash fullscreen mode.
Re: Issue 139918 in chromium: Upstream sqlite_cursor
Re: Issue 143668 in chromium: Drag and dropping a video clipping into
browser plays the video, but it can't be unmuted.
Re: Issue 145666 in chromium:
***@WebCore::HistoryItem::shouldDoSameDocumentNavigationTo-494BD31
Re: Issue 144558 in chromium: Tracing / Timeline should have network
traffic (sent/received) information
Issue 145763 in chromium: Closing tab with touch delays resize layout
indefinately
Re: Issue 90135 in chromium: Print preview: no "Current page" option, nor
any way to inspect page numbers = print fail
Re: Issue 144701 in chromium: Show non-touch tabstrip longer
Re: Issue 145754 in chromium: InstantTest.OnCancelEvent failing on win_rel
tryservers
Re: Issue 107201 in chromium: TabContents should not exist
Re: Issue 110636 in chromium: Make last picked service the default for the
requested type/action combo.
Re: Issue 123305 in chromium: Crash after dragging tab group between windows
Re: Issue 145116 in chromium: Guest login broken on ToT
Re: Issue 121214 in chromium: Jank when loading Web Store suggestions for
an empty picker
Re: Issue 141723 in chromium: Add privacy message in Settings page
Re: Issue 145671 in chromium: While Pre rendering a crash happened
Re: Issue 143675 in chromium: Add UMA metric to see how often users go into
snap mode on metro
Issue 145765 in chromium: obtain a good answer to "what fraction of pages
scroll on impl"
Re: Issue 144161 in chromium: PasswordStoreTest.IgnoreOldWwwGoogleLogins is
crashing on Android.
Re: Issue 127953 in chromium: Leak in safe_browsing_tests in
PrerenderDispatcher
Re: Issue 137717 in chromium: ash: Improved spacing around "pop-up blocked"
message in location bar
Re: Issue 145765 in chromium: obtain a good answer to "what fraction of
pages scroll on impl"
Re: Issue 145719 in chromium: Launcher should present open app windows
differently than browser window
Re: Issue 145557 in chromium: Esc does not dismiss web intents picker after
clicking on text in picker
Re: Issue 142181 in chromium: <Esc> doesn't dismiss web intents dialog
Re: Issue 145757 in chromium: Memory Leak at or near
DriveResourceMetadata::CreateDriveDirectory
Re: Issue 145151 in chromium: No wifi indicator when wifi not connected
Re: Issue 145557 in chromium: Esc does not dismiss web intents picker after
clicking on text in picker
Re: Issue 145151 in chromium: No wifi indicator when wifi not connected
Re: Issue 131154 in chromium: WebRTCAudioDeviceTest.FullDuplexAudioWithAGC
fails under Valgrind/Mac
Re: Issue 145548 in chromium: Can't select text on Google Fiber website
Re: Issue 139028 in chromium: "Use Another Service" button in Omnibox for
Quick Office
Issue 145768 in chromium: adjust starting parameters for fling scroll
Re: Issue 145693 in chromium: Leak in
extensions::PermissionsUpdater::RecordOAuth2Grant
Re: Issue 145706 in chromium: Leak in
PlatformAppBrowserTest::AppWithContextMenu
Re: Issue 145609 in chromium: No Build Files
Re: Issue 144765 in chromium: Closing a web intent service should bring a
user back to the client page
Re: Issue 145637 in chromium: Aggressive resizing of service content in
inline disposition
Re: Issue 137065 in chromium: Video from Youtube.com fails to resume after
device (Galaxy Nexus) is in idle state
Re: Issue 144413 in chromium: scale3d breaks fixed positioning
Re: Issue 122770 in chromium: Add User button is active even in restricted
sign in phase
Issue 145769 in chromium: User should't able to modify n/w settings on lock
screen
Re: Issue 137717 in chromium: ash: Improved spacing around "pop-up blocked"
message in location bar
Issue 145770 in chromium: 3% performance regression in
linux-release/intl2/times in 150052:150104
Issue 145771 in chromium: [Accessibility] Focus is not visible after F6 +
single tab
Issue 145772 in chromium: CSS filter causes color changes and text
flickering with :hover transition
Re: Issue 108012 in chromium: IndexedDB should support storing File/Blob
objects
Issue 145773 in chromium: debounce while scrolling
Re: Issue 145770 in chromium: 3% performance regression in
linux-release/intl2/times in 150052:150104
Re: Issue 145399 in chromium: "Add user" icon is missing from startscreen
Re: Issue 145621 in chromium: [extensions] doc server 2: supposed to
redirect from root ("/") to developer.google.com/chrome
Re: Issue 88489 in chromium: Implement UI refresh for Chromium media
controls
Re: Issue 110171 in chromium: There is no way to return to the login screen
once on the OTP screen
Re: Issue 145770 in chromium: 3% performance regression in
linux-release/intl2/times in 150052:150104
Re: Issue 145773 in chromium: debounce while scrolling
Issue 145774 in chromium: Document a spellcheck dictionary update/add
procedure and update them on a regular basis
Re: Issue 145774 in chromium: Document a spellcheck dictionary update/add
procedure and update them on a regular basis
Issue 145775 in chromium: Uber tray size shrinking at login screen
Re: Issue 65115 in chromium: Update Dutch dictionary
Issue 145776 in chromium: Resize issues: Fonts, Scrollbars, 'document size'
corrupted
Re: Issue 136503 in chromium: Add more languages to spellcheck
Re: Issue 145776 in chromium: Resize issues: Fonts, Scrollbars, 'document
size' corrupted
Re: Issue 143434 in chromium: Black bar appearing next to scroll bar
Re: Issue 141918 in chromium: Create a sample extension that uses event
pages to open a set of optionally pinned tabs on startup
Re: Issue 134499 in chromium: Track time spent in image decode inside
WebRenderingStats API
Re: Issue 145774 in chromium: Document a spellcheck dictionary update/add
procedure and update them on a regular basis
Re: Issue 20083 in chromium: Update Latvian spellchecking to new version
0.81
Re: Issue 14756 in chromium: update hunspell to the latest stable version
to use the latest dictionary format
Re: Issue 145695 in chromium: Leak in NaClDescImcBoundDescAcceptConn
Re: Issue 129606 in chromium: Spinner on sign in screen uses too much cpu
Re: Issue 144389 in chromium: 'Manage search engines" is user-unfriendly
Re: Issue 145425 in chromium: Plugin runs without approval by user
Issue 145777 in chromium: Youtube videos don't play in 240p mode
Re: Issue 20011 in chromium: Bookmark positions don't sync correctly if
bookmarks are re-positioned many times under the same parent
Re: Issue 141918 in chromium: Create a sample extension that uses event
pages to open a set of optionally pinned tabs on startup
Re: Issue 139181 in chromium: Networks jump while connecting to a network
and trying to scroll
Re: Issue 143670 in chromium: Incognito windows without tabstrip don't show
the incognito spy
Re: Issue 98679 in chromium: Full screen flash in new window makes cursor
disappear in other windows
Issue 145778 in chromium: Cookies not saved properly even went set to save
when chrome closes
Re: Issue 144389 in chromium: 'Manage search engines" is user-unfriendly
Re: Issue 141020 in chromium: VideoBearFlac fails new seek test.
Re: Issue 95931 in chromium: Leak in ChromeMainTest.SecondLaunch
Re: Issue 140077 in chromium: Volume slider is pixely in 2x
Re: Issue 95931 in chromium: Leak in ChromeMainTest.SecondLaunch
Re: Issue 7826 in chromium: Problem with html links with international
chars on Chrome 2beta
Issue 145779 in chromium: Merge multiple windows into the main window on
session restore
Issue 145780 in chromium: FA videos don't play
Re: Issue 144377 in chromium: page opens in middle if it includes video
iframe
Re: Issue 143756 in chromium: Some custom fonts are rendering broken up
Re: Issue 145757 in chromium: Memory Leak at or near
DriveResourceMetadata::CreateDriveDirectory
Re: Issue 143814 in chromium: simple WebGL RAF-based site seems to have 4.5
frames of input latency with the compositor thread
Re: Issue 128920 in chromium: Add DNSChanged events to NetLog/net-internals.
Re: Issue 19170 in chromium: Windows Font Linking function is ignored by
chrome
Re: Issue 145770 in chromium: 3% performance regression in
linux-release/intl2/times in 150052:150104
Re: Issue 139403 in chromium: Packaged apps link in app section on manifest
page is broken
Re: Issue 139403 in chromium: Packaged apps link in app section on manifest
page is broken
Re: Issue 143756 in chromium: Some custom fonts are rendering broken up
--
Automated mail from issue updates at http://crbug.com/
Subscription options: http://groups.google.com/a/chromium.org/group/chromium-bugs
Continue reading on narkive:
Loading...