Discussion:
102 messages from Google Code
(too old to reply)
c***@googlecode.com
2015-10-14 15:43:41 UTC
Permalink
Your project notifications generated too many emails to send
individually. Here are the subject lines of the emails you would have
received:

Re: Issue 543139 in chromium: Implement exta test runs for confirming
culprit in Bisect recipe.
Re: Issue 393671 in chromium: Bing - "Thumbnail removed.Undo Restore all X"
button is not Disappearing
Re: Issue 543129 in chromium: Correct the required initial confidence for
recipe bisect. It should be 80, not 95.
Issue 543140 in chromium: Implement stub of Blink API to check for enabled
experiments
Issue 543141 in chromium: Add runtime feature/flag for Experimental
Framework
Re: Issue 492806 in chromium: Chrome Remote Desktop No Audio
Re: Issue 536193 in chromium: Window height/width incorrect for popup
windows
Re: Issue 350736 in chromium: chrome.usb does not include "Serial number
string" along with vendorId and productId.
Issue 543142 in chromium: New entries appear on the bookmark bar in
opposite order on Android/desktop
Re: Issue 542873 in chromium: Pages do not render on VMware Fusion VM
images OS X 10.9 or later
Re: Issue 542437 in chromium: Spec update: Wait for active service worker
registration
Re: Issue 542437 in chromium: Spec update: Wait for active service worker
registration
Re: Issue 542873 in chromium: Pages do not render on VMware Fusion VM
images OS X 10.9 or later
Re: Issue 539208 in chromium: Mouse movement should change the underlying
menu item in Bookmark bar folders
Re: Issue 542171 in chromium: Failure to run android unittests built from gn
Issue 543143 in chromium: Implement embedding of API keys in meta tags
Re: Issue 454664 in chromium: I can't update the chrome remote desktop host
Re: Issue 522654 in chromium: Use callback interface for
web_modal::WebContentsModalDialogManager::CreateNativeWebModalManager
Re: Issue 531887 in chromium: Very slow when using Chrome on Ubuntu
Re: Issue 359315 in chromium: Offer password saving on change password forms
Re: Issue 181565 in chromium: VAVDA: Handle gaps in frame_num
Re: Issue 529451 in chromium: MemoryInfra: Get graphics information for
Android from dumpsys-meminfo
Re: Issue 517251 in chromium: Profile data wiped after autoupdate (running
out of disk space)
Re: Issue 414758 in chromium: Remove HpackHuffmanAggregator once HTTP/2
standard is finalized
Re: Issue 505226 in chromium: toDataURL('image/jpeg') doesn't work
Re: Issue 542986 in chromium: Chrome 45 unable to act as server for DHE
cipher suites
Re: Issue 543006 in chromium: password_form_conversion_utils: Do not filter
out not autofillable fields if not necessary
Re: Issue 535322 in chromium: host_forwarder target fails to run on Android
GN
Issue 543146 in chromium: Implement parsing of API keys
Issue 543147 in chromium: telemetry with --profiler=trace did not terminate
after 1hour
Re: Issue 414758 in chromium: Remove HpackHuffmanAggregator once HTTP/2
standard is finalized
Re: Issue 432990 in chromium: [rAc] Non US shipping address form field
errors handled badly by chrome
Re: Issue 543147 in chromium: telemetry with --profiler=trace did not
terminate after 1hour
Re: Issue 534839 in chromium: Webview rendering issues with
allowtransparency
Re: Issue 497742 in chromium: chrome://settings/autofill should not show
autofill suggestions
Issue 543149 in chromium: Enable Skia tracing in browser process
Re: Issue 411350 in chromium: Add clearHitRegions API to
canvasRenderingContext2D
Re: Issue 535322 in chromium: host_forwarder target fails to run on Android
GN
Re: Issue 543138 in chromium:
NewTabPageTest#testOpenMostVisitedItemInNewTab flake on linux_android_rel_ng
Re: Issue 460486 in chromium: SVG performance regression w/threaded GPU
rasterization and MSAA
Re: Issue 537836 in chromium: gfx::Rect::Union
Re: Issue 520252 in chromium: External perf builder pages should link to
internal stdio logs (not broken links)
Re: Issue 537836 in chromium: gfx::Rect::Union
Re: Issue 506603 in chromium: make sure Android WebView L (dbg) bot is green
Re: Issue 542819 in chromium: Can't compile chromium 46.0.2490.71
Re: Issue 537836 in chromium: gfx::Rect::Union
Re: Issue 487717 in chromium: CQ: Read builds from BuildBucket only
Re: Issue 536808 in chromium: The latest version of Chrome is unstable on
the latest version of iOS.
Issue 543153 in chromium:
BindingManagerIntegrationTest#testCrashInBackground flake on
linux_android_rel_ng
Re: Issue 537836 in chromium: gfx::Rect::Union
Re: Issue 542986 in chromium: Chrome 45 unable to act as server for DHE
cipher suites
Issue 543154 in chromium: SpellcheckHunspellDictionary downloads a ~4 MB
file into browser process memory.
Re: Issue 542864 in chromium: cursor dragger is behin suggestion drop down
Re: Issue 541225 in chromium: [LBS] Legacy Browser Support does not
evaluate URLs correctly
Re: Issue 535680 in chromium: Expansion logic for DEPS should be a separate
step.
Re: Issue 517089 in chromium: Make FaviconHandler own its state
Issue 543156 in chromium: Deployment and Default Browser Windows 10
Issue 543157 in chromium: Need monitoring for perf dashboard failures to
update bisect jobs
Re: Issue 539876 in chromium: Regression: Rendering glitch in Chrome
45.0.2454.101 for Mac OS X
Re: Issue 537836 in chromium: gfx::Rect::Union
Re: Issue 542773 in chromium: Splashscreen regression: theme_color is no
longer used for status bar color during splash
Re: Issue 533188 in chromium: Instrumentation test ChromePublicTest flaky
on linux_android_rel_ng
Re: Issue 543153 in chromium:
BindingManagerIntegrationTest#testCrashInBackground flake on
linux_android_rel_ng
Issue 543159 in chromium: Wildcards with partial username in local part of
domain not working for restricted device login
Re: Issue 542371 in chromium: Offline hosts in Android app list an offline
time in the future
Issue 543160 in chromium:
FeatureUtilitiesTest#testHasNoGoogleAccountCorrectlyDetected flake on
linux_android_rel_ng
Re: Issue 543124 in chromium: Change default menu row highlight color in
material design
Re: Issue 527519 in chromium: Bisect results text doesn't have bot it ran
on.
Re: Issue 20416 in chromium: Sometimes Application folder doesn't get
removed while we uninstall Chrome and make other browser as default
Issue 543161 in chromium: Replace safe browsing DB and update protocol with
Pver4
Re: Issue 483964 in chromium: [Memory Management] Create
RendererMemoryCoordinator
Re: Issue 356090 in chromium: mouseout on element triggered on mouseup
after entering the element with the mouse button pressed
Re: Issue 537696 in chromium: Bisect: Wiggle commits to reuse builds.
Issue 543162 in chromium: download
Re: Issue 538143 in chromium: memory.memory_health_webview failing at
http_baidu_com
Re: Issue 537227 in chromium: Auto updating Chrome for Business in a Citrix
server environment
Re: Issue 350736 in chromium: chrome.usb does not include "Serial number
string" along with vendorId and productId.
Re: Issue 512468 in chromium: Componentize
chrome/browser/sync/glue/synced_session_util
Re: Issue 496513 in chromium: chrome.hid should have serial number, product
and manufacturer strings on the Device class
Re: Issue 523216 in chromium: Black screen is seen on selecting "cinema or
tilt shaft" toggle filters in camera app
Re: Issue 508316 in chromium: Remove UIEvent.charCode/keyCode (leaving them
only on KeyboardEvent)
Re: Issue 523216 in chromium: Black screen is seen on selecting "cinema or
tilt shaft" toggle filters in camera app
Re: Issue 476923 in chromium: Distinguish between warm and cold starts to
split startup UMA metrics
Re: Issue 542437 in chromium: Spec update: Wait for active service worker
registration
Re: Issue 539572 in chromium: Libfuzzer infrastructure cover issue
Re: Issue 538614 in chromium: Roll Clang past 247874
Re: Issue 543147 in chromium: telemetry with --profiler=trace did not
terminate after 1hour
Re: Issue 508316 in chromium: Remove UIEvent.charCode/keyCode (leaving them
only on KeyboardEvent)
Re: Issue 537807 in chromium: currentColor css value for SVG `fill`
property doesn't animate when changing `color` property
Re: Issue 538614 in chromium: Roll Clang past 247874
Re: Issue 535449 in chromium: unused(?) strings in managed profile sign-in
dialog
Re: Issue 538614 in chromium: Roll Clang past 247874
Re: Issue 538731 in chromium: chromium-try-flakes slow to file bugs
Re: Issue 460204 in chromium: Enhanced SyzyASAN crash reporting via Kasko
Re: Issue 543018 in chromium: Opening a PDF shows only empty content pages.
Re: Issue 543043 in chromium: MemoryInfra: memory.top_10_mobile reports no
memory data on Win and Mac perf bots
Re: Issue 543043 in chromium: MemoryInfra: memory.top_10_mobile reports no
memory data on Win and Mac perf bots
Re: Issue 499314 in chromium: CQ Not Running New Telemetry Tests
Re: Issue 531363 in chromium: Some tabs are blank upon refocus (and reload
won't reload)
Re: Issue 535685 in chromium: Display meaningful error messages for
Gathering reference value step failures.
Re: Issue 539642 in chromium: Janky scrolling while loading gizmodo page
Re: Issue 522661 in chromium: Extract hardcoded values from
chrome/renderer/media/cast_rtp_stream.cc
--
--
Automated mail from issue updates at http://crbug.com/
Subscription options: http://groups.google.com/a/chromium.org/group/chromium-bugs

To unsubscribe from this group and stop receiving emails from it, send an email to chromium-bugs+***@chromium.org.
c***@googlecode.com
2015-10-15 13:29:29 UTC
Permalink
Your project notifications generated too many emails to send
individually. Here are the subject lines of the emails you would have
received:

Re: Issue 529979 in chromium: gmail calling stopped working
Issue 543553 in chromium: Bug: crash in case Chrome is
disabled/removed/old, in case the app used it shortly before
Re: Issue 352606 in chromium: Throbber missing while recording a snapshot
on Devtools>> Profiles.
Re: Issue 541646 in chromium: OOPIF: Scrollbars don't move
Issue 543555 in chromium: Files/Gallery.app: circle ripple effect should
burst out.
Re: Issue 542897 in chromium: Page renders in dotted repeating streaks on
external monitor
Re: Issue 464624 in chromium: Overlord: whale fixture integration
Re: Issue 464624 in chromium: Overlord: whale fixture integration
Re: Issue 543485 in chromium: JavaScript code is not executed in a jsfiddle
Re: Issue 280743 in chromium: Implement TimeTicks::ThreadNow on Windows
Re: Issue 280743 in chromium: Implement TimeTicks::ThreadNow on Windows
Re: Issue 539549 in chromium: Queues on Android trybots, and 7 machines are
offline
Re: Issue 542616 in chromium: 2.6% regression in performance_browser_tests
at 353086:353130
Re: Issue 543501 in chromium: 1.1% regression in page_cycler.intl_hi_ru at
353948:353955
Re: Issue 543495 in chromium: 2.2% regression in
thread_times.simple_mobile_sites at 354015:354048
Re: Issue 512451 in chromium: Componentize
chrome/browser/sync/glue/typed_url_change_processor
Re: Issue 543505 in chromium: 2.7% regression in
page_cycler_site_isolation.basic_oopif at 354095:354120
Re: Issue 543553 in chromium: Bug: crash in case Chrome is
disabled/removed/old, in case the app used it shortly before
Re: Issue 543397 in chromium: Remove SVG glyph-orientation-horizontal and
glyph-orientation-vertical
Re: Issue 540782 in chromium: SVGTextLayoutEngine::layoutTextOnLineOrPath()
should use HarfBuzzShaper better
Re: Issue 541190 in chromium: Permission Bubble shows out of the page it
emitted
Re: Issue 387120 in chromium: Showing saved passwords prompts for the wrong
account password: asks for admin password, should use user password
Re: Issue 524474 in chromium: Add a notification settings button to Web
Notifications
Re: Issue 543320 in chromium: Date.parse incorrectly parses time strings
like '2015-10-14' starting with Chrome 46
Re: Issue 529451 in chromium: MemoryInfra: Get graphics information for
Android from dumpsys-meminfo
Issue 543558 in chromium: Regression: Wierd overlapping of close button/
New Tab text on tab is seen after resizing the window.
Re: Issue 387120 in chromium: Showing saved passwords prompts for the wrong
account password: asks for admin password, should use user password
Re: Issue 543546 in chromium: customtabs: Is it possible to know if
Chrome-tabs is available?
Re: Issue 451967 in chromium: Debugger: StepInto doesn't work for new
Promise(f)
Re: Issue 530747 in chromium: chromium continuously shows up and will not
let me uninstall it
Re: Issue 532831 in chromium: TabModel data isn't saved out when undoing
tab closure
Re: Issue 542616 in chromium: 2.6% regression in performance_browser_tests
at 353086:353130
Re: Issue 543501 in chromium: 1.1% regression in page_cycler.intl_hi_ru at
353948:353955
Re: Issue 543505 in chromium: 2.7% regression in
page_cycler_site_isolation.basic_oopif at 354095:354120
Re: Issue 543495 in chromium: 2.2% regression in
thread_times.simple_mobile_sites at 354015:354048
Re: Issue 541646 in chromium: OOPIF: Scrollbars don't move
Re: Issue 543509 in chromium: 2.5% regression in memory.top_7_stress at
354092:354126
Re: Issue 530703 in chromium: New Tabs aren't ranked in the correct order
Re: Issue 530703 in chromium: New Tabs aren't ranked in the correct order
Re: Issue 543509 in chromium: 2.5% regression in memory.top_7_stress at
354092:354126
Re: Issue 24690 in chromium: All incognito windows share the same cookie jar
Re: Issue 542369 in chromium: Blink reports ERR_ABORTED for downloads.
Intended behavior?
Re: Issue 419354 in chromium: Feature Request: DevTools HTML Validation
/ "Strict Mode"
Re: Issue 521255 in chromium: DevTools: Include HTML validation/error log
17 issues changed in chromium
Re: Issue 488229 in chromium: Material Redesign of Media Players
Re: Issue 524438 in chromium: White flash when loading webapps after
initial load
Re: Issue 531363 in chromium: Some tabs are blank upon refocus (and reload
won't reload)
Re: Issue 530182 in chromium: Developer tools & web page become
unresponsive (and unclosable) when page is experiencing a race condition
Re: Issue 531519 in chromium: Webapp splash screen is not removed if first
paint is missed
Re: Issue 542144 in chromium: Confusing "adb ls -l" failed on the device
exception
Re: Issue 543533 in chromium: Regression: On 'View site information'
overlay 'Allowed by you' text is vanish after clicking on it.
Re: Issue 541646 in chromium: OOPIF: Scrollbars don't move
Re: Issue 541552 in chromium: PCSC API extension not resolving all calls
properly
Re: Issue 526238 in chromium: Intents with huge URLs can cause
TransactionTooLarge exceptions
Re: Issue 525785 in chromium: StrictMode policy violation in
WebappLauncherActivity.onCreate
Re: Issue 525781 in chromium: StrictMode policy violation in
WebappDirectoryManager
Re: Issue 539815 in chromium: [Regression]:Unable to turn off chrome book
on clicking Shut Down button
Re: Issue 521269 in chromium: Add Optional<> to base/, similar to C++
experimental::optional<>
Re: Issue 508181 in chromium: Can't reload Chrome Android Web Apps if
started while offline
Re: Issue 543273 in chromium: DevTools glitch
Re: Issue 458606 in chromium: Coalescing UI for mobile infobars
Re: Issue 428934 in chromium: Add optional<T> to base/ and convert existing
code to use it
Issue 543564 in chromium: Create timeline base V8 memory metrics
Re: Issue 522525 in chromium: New version of Webview content flickering
when resizing webview and crashes after certain time
Re: Issue 542527 in chromium: [Regression]:Page doesn't navigate to Sign-in
page after clicking on it
Re: Issue 517409 in chromium: Focus does not transverse to 'Learn more'
link of the link data overlay.
Re: Issue 542191 in chromium: Can't fullscreen videos in Canary
Issue 543565 in chromium: timeline (overview) keeps growing but
toggle "preserve log" is unchecked
Re: Issue 533863 in chromium: chrome.tabs.insertCSS and
chrome.tabs.executeScript fail to trigger the callback when some frame
replies HTTP 204 with "allFrames" set
Re: Issue 534839 in chromium: Webview rendering issues with
allowtransparency
Re: Issue 542144 in chromium: Confusing "adb ls -l" failed on the device
exception
Re: Issue 541179 in chromium: 7.4%-18.3% regression in
thread_times.key_silk_cases at 352869:352929
Re: Issue 543512 in chromium: 2.3% regression in webrtc.webrtc_cases at
354097:354130
Re: Issue 543324 in chromium: Lots of flickering browsing sites using
Chrome version 46.0.2490.71
Re: Issue 527770 in chromium: 18.6% regression in
thread_times.tough_scrolling_cases at 346670:346742
Re: Issue 537746 in chromium: chrome://flags/#enable-smooth-scrolling
breaks scrolling
Re: Issue 527766 in chromium: 2.7% regression in page_cycler.intl_ar_fa_he
at 346650:346668
Re: Issue 527597 in chromium: sharing my themes
Re: Issue 539896 in chromium: Chrome should finish input connection when
text field loses focus
Re: Issue 542702 in chromium: Add ability to dump add global data to the
trace log
Re: Issue 519961 in chromium: 22.6%-57% regression in
session_restore.cold.typical_25 at 342796:342800
Re: Issue 67348 in chromium: MSI DisplayVersion to match Chrome version
Re: Issue 106283 in chromium: SVG SVGZ files not opening in Chrome
Re: Issue 540512 in chromium: Webview display a black screen
Re: Issue 542169 in chromium: chameleon: bluetooth reconnect in a loop on
peach_pi
Re: Issue 543512 in chromium: 2.3% regression in webrtc.webrtc_cases at
354097:354130
Issue 543571 in chromium: srcset Rounding down behaviour
Re: Issue 67348 in chromium: MSI DisplayVersion to match Chrome version
Re: Issue 540512 in chromium: Webview display a black screen
Issue 543572 in chromium: 9% regression in page_cycler.intl_hi_ru at
354213:354215
Re: Issue 543572 in chromium: 9% regression in page_cycler.intl_hi_ru at
354213:354215
Re: Issue 543573 in chromium: 4.7% regression in
thread_times.key_mobile_sites_smooth at 353768:353794
Issue 543573 in chromium: 4.7% regression in
thread_times.key_mobile_sites_smooth at 353768:353794
Re: Issue 543574 in chromium: 10.7% regression in blink_perf.bindings at
354066:354089
Issue 543574 in chromium: 10.7% regression in blink_perf.bindings at
354066:354089
Re: Issue 542616 in chromium: 2.6% regression in performance_browser_tests
at 353086:353130
Issue 543576 in chromium: 8.1% regression in
page_cycler_site_isolation.basic_oopif at 354164:354187
Re: Issue 543576 in chromium: 8.1% regression in
page_cycler_site_isolation.basic_oopif at 354164:354187
Re: Issue 543577 in chromium: 1.2% regression in sunspider at 354073:354094
Issue 543577 in chromium: 1.2% regression in sunspider at 354073:354094
Issue 543578 in chromium: In bisect results, display std dev and sample
size instead of std err
--
--
Automated mail from issue updates at http://crbug.com/
Subscription options: http://groups.google.com/a/chromium.org/group/chromium-bugs

To unsubscribe from this group and stop receiving emails from it, send an email to chromium-bugs+***@chromium.org.
c***@googlecode.com
2015-10-16 21:27:14 UTC
Permalink
Your project notifications generated too many emails to send
individually. Here are the subject lines of the emails you would have
received:

Re: Issue 534895 in chromium: tracing for mandoline
Re: Issue 544093 in chromium: precise32 beta builder fails to compile,
complaining about gfx::VectorIconId::AUTOFILL not defined
Re: Issue 543775 in chromium: [Auron_Paine / Pi]
audio_AudioBasicHDMI&builds failed with "['USB'] rather than HDMI is
selected on Cros device"
Re: Issue 505226 in chromium: toDataURL('image/jpeg') doesn't work
Re: Issue 349833 in chromium: [Mac] Regression: Text in media bubble is not
aligned as per size of bubble
Re: Issue 510090 in chromium: Data Saver appears to work (but is broken) on
Chrome copycat browsers
Re: Issue 543572 in chromium: 9% regression in page_cycler.intl_hi_ru at
354213:354215
Re: Issue 505226 in chromium: toDataURL('image/jpeg') doesn't work
Re: Issue 489242 in chromium: API documentation: some links not rewritten
for dot-to-underscore rewitre
Re: Issue 540807 in chromium: Missing 'Reload frame' menu item in iframe
context menu
Re: Issue 544244 in chromium: HTTP basic auth credentials prompt should
make the origin stand out more
Re: Issue 543368 in chromium: printer no working with chrome browser
Re: Issue 543646 in chromium: security_OpenFDs failing on all veyron boards
Re: Issue 518238 in chromium: Printer continues stating "offline for more
than a week"!
Re: Issue 404597 in chromium: Unify simple and complex font code paths
Re: Issue 537836 in chromium: gfx::Rect::Union
Re: Issue 544244 in chromium: HTTP basic auth credentials prompt should
make the origin stand out more
Re: Issue 535161 in chromium: Regression: 'Apps overlay' gets cut at the
bottom, on 'Chrome web store' page
Re: Issue 541658 in chromium: [Pi]] audio test failed with Unhandled
ValueError: ('Recorded RMS %f is too small to be meaningful
Re: Issue 543366 in chromium: Alt-svc response header processor is missing
QUIC protocol support in Cronet
Re: Issue 469517 in chromium: inlineInstallPrivate gives userCancelled
error when clicking View Details
Re: Issue 393371 in chromium: Can't search from omnibox for a string
starting with one of my search shortcuts
Re: Issue 537314 in chromium: Omnibox "Press tab to search X" affordance is
wrong
Re: Issue 399416 in chromium: Show negative security indicator for
non-secure origins that operate on PII, credentials, et c.
Re: Issue 86655 in chromium: Feature request: Warn of submitting
unencrypted form.
Re: Issue 399416 in chromium: Show negative security indicator for
non-secure origins that operate on PII, credentials, et c.
Re: Issue 534857 in chromium: ASSERT(!needsLayout()) in
blink::PendingSelection::commitAlgorithm.
Re: Issue 543293 in chromium: Set up Android Aura infrastructure
Re: Issue 509249 in chromium: "Always Allow" checkboxes are shown on OS X
even when overridden by enterprise policy
Re: Issue 543572 in chromium: 9% regression in page_cycler.intl_hi_ru at
354213:354215
Re: Issue 543366 in chromium: Alt-svc response header processor is missing
QUIC protocol support in Cronet
Re: Issue 536999 in chromium: Implement synchronized painting for Slimming
Paint phase 1
Re: Issue 509249 in chromium: "Always Allow" checkboxes are shown on OS X
even when overridden by enterprise policy
Re: Issue 507834 in chromium: Support FFmpeg and the desktop media pipeline
on Android.
Issue 544268 in chromium: Determine whether MPEG-2 variants of AAC can be
supported on Android
Re: Issue 499321 in chromium: Create Layout API
Re: Issue 542638 in chromium: In security section "View certificate"
overlay does not get closed after clicking on "OK" button in full screen
mode
Re: Issue 543470 in chromium: Regression: [DevTools]Weird behavior of 'More
tools' menu list is seen when it operates using keyboard.
Re: Issue 471738 in chromium: add policy to disable dinosaur game on the
network error screen on desktop/mobile platforms
Re: Issue 537836 in chromium: gfx::Rect::Union
Re: Issue 376682 in chromium: " Video reszier for YT "extension is not
working for youtube videos.
Re: Issue 440194 in chromium: Provide an idiomatic way to control arbitrary
Extension features
Re: Issue 531296 in chromium: CQ doesn't build all targets
Re: Issue 530624 in chromium: Setup.exe wants a new handler
Re: Issue 532654 in chromium: Improve the process for selecting the stable
build for a board
Re: Issue 406406 in chromium: chrome.storage.sync quota is too restrictive
Re: Issue 541430 in chromium: AOPEN hardware lockup while running signage
app
Re: Issue 544002 in chromium: Removing un-necessary converion from
std::string to base::string16
Re: Issue 390723 in chromium: test bug
Re: Issue 543267 in chromium: Build Blimp client, engine and unit-tests on
buildbots
Re: Issue 404597 in chromium: Unify simple and complex font code paths
Re: Issue 544131 in chromium: Precise async events on startup
Re: Issue 544148 in chromium: Linux perf bot: failure with
--enable-multiprocess
Re: Issue 544267 in chromium: HTTP Basic authentication credential prompt
obscures address box
Issue 544270 in chromium: Update harfbuzz to 1.0.6
Re: Issue 544094 in chromium: For Same return value of the switch
cases "fall through" should be used.
Re: Issue 301733 in chromium: developer.chrome.com/extensions missing CSS -
looks bad
Issue 544271 in chromium: Reusing RenderViewHost in crashed process results
in incorrect state with swapped out disabled
Re: Issue 543367 in chromium: PDF rendering stops when content changes
Re: Issue 543310 in chromium: Custom PNG cursor with transparency is shown
pixelated
Re: Issue 544270 in chromium: Update harfbuzz to 1.0.6
Re: Issue 178870 in chromium: Remove the "Hide Button" feature of extensions
Re: Issue 542681 in chromium: Allow uncontrolled clients to register
Re: Issue 21939 in chromium: There should be a shared base class or an
interface for ExtensionView
Re: Issue 544271 in chromium: Reusing RenderViewHost in crashed process
results in incorrect state with swapped out disabled
Re: Issue 539572 in chromium: Libfuzzer infrastructure cover issue
Re: Issue 134153 in chromium: Extension API CHECK failure
Re: Issue 544271 in chromium: Reusing RenderViewHost in crashed process
results in incorrect state with swapped out disabled
Re: Issue 539536 in chromium: Omnibox Doesn't Inline Autocomplete with LG
Keyboard
Re: Issue 534839 in chromium: Webview rendering issues with
allowtransparency
Re: Issue 492204 in chromium: WebUSB API
Re: Issue 539536 in chromium: Omnibox Doesn't Inline Autocomplete with LG
Keyboard
Re: Issue 393371 in chromium: Can't search from omnibox for a string
starting with one of my search shortcuts
Re: Issue 544270 in chromium: Update harfbuzz to 1.0.6
Re: Issue 404597 in chromium: Unify simple and complex font code paths
Re: Issue 543367 in chromium: PDF rendering stops when content changes
Re: Issue 543367 in chromium: PDF rendering stops when content changes
Re: Issue 126802 in chromium: Add UI for setting hostname that Chrome OS
will request via DHCP
Re: Issue 543386 in chromium: Autofill: Reconsider checkable elements when
parsing forms
Re: Issue 541647 in chromium: shill: fatal error when PowerManager proxy
appeared callback invoke twice in a row
Re: Issue 543884 in chromium: bluetooth: The mock adapter should be able to
call characteristicvaluechanged on it's observers
Re: Issue 533012 in chromium: Unable to log into device using google
credentials behind a Proxy
Re: Issue 543678 in chromium: CSS border not rendering as expected when
inside a element with transform: translate
Re: Issue 531783 in chromium: DIV with flex:1 inside a container that has
flex-direction:column overlap.
Re: Issue 539536 in chromium: Omnibox Doesn't Inline Autocomplete with LG
Keyboard
Issue 544272 in chromium: On screen keyboard causes HTTP auth dialog to
obstruct the omnibox
Re: Issue 543309 in chromium: Newline selections are two spaces instead of
one
Re: Issue 542668 in chromium: InvalidAccessError when recreating old caches
Re: Issue 527039 in chromium: Nesting two elements set to display: flexbox
prevents recalculation of outer flexbox height on browser window resize
Re: Issue 544244 in chromium: HTTP basic auth credentials prompt should
make the origin stand out more
Re: Issue 543615 in chromium: Multi-Screen Set up: Chrome loads with
hundreds of vertical lines on Display 2
Re: Issue 516988 in chromium: No half pixels on retina displays
Re: Issue 485650 in chromium: Use page zoom logic to implement device scale
Re: Issue 542971 in chromium: IAccessibleHyperlink::startIndex not
implemented
Re: Issue 542668 in chromium: InvalidAccessError when recreating old caches
Re: Issue 516709 in chromium: erratic line wrapping with after
pseudo-element
Re: Issue 541647 in chromium: shill: fatal error when PowerManager proxy
appeared callback invoke twice in a row
Re: Issue 544267 in chromium: HTTP Basic authentication credential prompt
obscures address box
Re: Issue 544272 in chromium: On screen keyboard causes HTTP auth dialog to
obstruct the omnibox
Re: Issue 481514 in chromium: Relpos with insane 'left' inside another
relpos causes assertion failure in LayoutGeometryMap::mapToContainer()
Re: Issue 393371 in chromium: Can't search from omnibox for a string
starting with one of my search shortcuts
Re: Issue 544267 in chromium: HTTP Basic authentication credential prompt
obscures address box
--
--
Automated mail from issue updates at http://crbug.com/
Subscription options: http://groups.google.com/a/chromium.org/group/chromium-bugs

To unsubscribe from this group and stop receiving emails from it, send an email to chromium-bugs+***@chromium.org.
c***@googlecode.com
2015-10-21 16:37:13 UTC
Permalink
Your project notifications generated too many emails to send
individually. Here are the subject lines of the emails you would have
received:

Re: Issue 141907 in chromium: Canvas memory consumption profiling test
Re: Issue 546006 in chromium: RuntimeEnabled in IDL dictionaries should
either throw error or discard the key
Re: Issue 537794 in chromium: Bisect: Function bisect fails on purple builds
Re: Issue 545756 in chromium: Performance Dashboard can no longer Display
Unmonitored Tets
Re: Issue 498136 in chromium: File "not commonly downloaded and could be
dangerous"; was working a few days ago
Re: Issue 543478 in chromium: CDM ppapi code limits subsamples count to 16
Re: Issue 537836 in chromium: gfx::Rect::Union
Re: Issue 545664 in chromium: Repeatedly having pages jump to very high or
very low magnification (on initial navigation or tab switch)
Re: Issue 514360 in chromium: Plumb Android stylus devices into Pointer
Events
Re: Issue 527231 in chromium: DevTools: [security] Overview: Green bullet
point for connection status
Re: Issue 545635 in chromium: File inputs using webkitdirectory provide no
interface for detecting new files in the directory
Re: Issue 537794 in chromium: Bisect: Function bisect fails on purple builds
Re: Issue 542189 in chromium: Tooltip is not displayed for long text Urls
in security section of devtools.
Issue 546011 in chromium: Unable to put Chrome window into presentation
mode from Chrome extension when window is maximized
Re: Issue 508283 in chromium: Unifying WebTouchPoint and WebMouseEvent for
stylus input
Re: Issue 544236 in chromium: Candy: Legacy boot does not work - Freezes
with CTRL-L
Re: Issue 510398 in chromium: Tracking Bug for spatial scheduling of task
queues
Re: Issue 544185 in chromium: Fix first_gesture_scroll_update_latency
regressions caused by the better idle time estimator.
Re: Issue 545988 in chromium: Web app splash screen: opening Manifest with
non-opaque "theme_color" crashes.
Re: Issue 545394 in chromium: Crash at
chrome/browser/supervised_user/supervised_user_interstitial.cc:82
Re: Issue 545223 in chromium: Caps Lock gets enabled for Russian keyboard
when type in address bar
Re: Issue 540777 in chromium: Icon for Network File Share extension
Re: Issue 510485 in chromium: GN: Fix unittests not passing on Android
Re: Issue 507260 in chromium: Creating application shortcuts on the taskbar
doesn't work on the latest Windows 10 builds
Re: Issue 519585 in chromium: Componentize gcm_profile_service
Re: Issue 545988 in chromium: Web app splash screen: opening Manifest with
non-opaque "theme_color" crashes.
Re: Issue 545988 in chromium: Web app splash screen: opening Manifest with
non-opaque "theme_color" crashes.
Re: Issue 527231 in chromium: DevTools: [security] Overview: Green bullet
point for connection status
Re: Issue 544245 in chromium: bind implementation is broken
Re: Issue 545664 in chromium: Repeatedly having pages jump to very high or
very low magnification (on initial navigation or tab switch)
Re: Issue 545992 in chromium: Audio Output Devices API
Re: Issue 545979 in chromium: SkBitmapOperations::CreateMaskedBitmap()
returns wrong byte ordering in some platforms.
Issue 546016 in chromium: GetRendererScheduler::OnNavigationStarted is
called for irames as well as the main frame
Re: Issue 480516 in chromium: Supporting serviceURI param to
SpeechRecognition
Re: Issue 538763 in chromium: Misleading 'Stale bisect job cancelled'
quicklog entry on successful jobs.
Re: Issue 544766 in chromium: global composition operations issue
Re: Issue 539744 in chromium: Regression: Overlapping of "Chevron (>>)"
icon is seen on dragging extensions.
Re: Issue 544890 in chromium: Change the title while download is paused
Re: Issue 458655 in chromium: Browser action popup not dismissible by
clicking on browser action again.
Re: Issue 427785 in chromium: Remove chrome://imageburner completely after
2015-10-31
Re: Issue 544245 in chromium: bind implementation is broken
Re: Issue 539744 in chromium: Regression: Overlapping of "Chevron (>>)"
icon is seen on dragging extensions.
Issue 546017 in chromium: Flash 19.0.0.226 Not Working - 'Couldn't Load
Plugin' Error
Re: Issue 545757 in chromium: Support AES-256-GCM in HTTP/2
Issue 546019 in chromium: Allow collected histogram data to live across
task boundaries.
Re: Issue 511300 in chromium: Create policy setting to enable forced
restart to finish updating Chrome
Issue 546020 in chromium: An empty filter primitive subregion should make
the filter primitive produce transparent black
Re: Issue 545756 in chromium: Performance Dashboard can no longer Display
Unmonitored Tets
Re: Issue 546020 in chromium: An empty filter primitive subregion should
make the filter primitive produce transparent black
Re: Issue 525873 in chromium: Move Android testing to Swarming.
Issue 546021 in chromium: Implement frame/domain attribution for scheduler
tasks
Re: Issue 544890 in chromium: Change the title while download is paused
Re: Issue 543478 in chromium: CDM ppapi code limits subsamples count to 16
Re: Issue 543660 in chromium: 9.8% regression in page_cycler.intl_hi_ru at
354213:354215
Re: Issue 543572 in chromium: 9% regression in page_cycler.intl_hi_ru at
354213:354215
Re: Issue 514873 in chromium: Improved video renderer accuracy for WebRTC
Re: Issue 524631 in chromium: MemoryInfra: Introduce a heap profiler to get
information on allocation sites
Issue 546023 in chromium: veyron_rialto canary failing to build
rialto-services
Re: Issue 534814 in chromium: angle_unittests should run on android
Re: Issue 538763 in chromium: Misleading 'Stale bisect job cancelled'
quicklog entry on successful jobs.
Issue 546027 in chromium: Could not load Chrome PDF Viewer
Issue 546028 in chromium: Merged CLs are still listed being in review state
Re: Issue 545664 in chromium: Repeatedly having pages jump to very high or
very low magnification (on initial navigation or tab switch)
Re: Issue 546027 in chromium: Could not load Chrome PDF Viewer
Re: Issue 543060 in chromium: bluetooth: chooser: Start scanning after
Bluetooth is turned on
Re: Issue 546023 in chromium: veyron_rialto canary failing to build
rialto-services
Re: Issue 545867 in chromium: bluetooth: Handle Android Location Service off
Re: Issue 436280 in chromium: bluetooth: Implement Bluetooth Device
Selection User Interface
Re: Issue 545867 in chromium: bluetooth: Handle Android Location Service off
Re: Issue 545631 in chromium: facebook does not display properly
Re: Issue 544690 in chromium: ASSERTION FAILED: !m_fetchFollowingCORS in
blink::LinkStyle::setFetchFollowingCORS
Re: Issue 545781 in chromium: WebRTC TURN DTLS connection specification is
ignored and TLS connection established instead
Issue 546031 in chromium: With many tabs open, incorrect responses to
keypresses
Issue 546033 in chromium: quawks canary failing paygen
Issue 546034 in chromium: Chrome incorrectly disregards "min-width:auto" on
flex items that have explicit "flex-basis" values
Re: Issue 546034 in chromium: Chrome incorrectly
disregards "min-width:auto" on flex items that have explicit "flex-basis"
values
Re: Issue 542852 in chromium: wtf_unittests HashSetTest.ReserveCapacity
failing in ASan builds
Re: Issue 426898 in chromium: Implement "min-width: auto" / "min-height:
auto" for flex and grid items
Re: Issue 546034 in chromium: Chrome incorrectly
disregards "min-width:auto" on flex items that have explicit "flex-basis"
values
Re: Issue 546028 in chromium: Merged CLs are still listed being in review
state
Re: Issue 546031 in chromium: With many tabs open, incorrect responses to
keypresses
Re: Issue 534780 in chromium: Webview with visibility:hidden receives focus
Re: Issue 541150 in chromium: chameleon: bluetooth test failure on squawks
Re: Issue 525835 in chromium: Eliminate WebMouseWheelEvent wheelTicksX and
wheelTicksY
Re: Issue 538654 in chromium: 1.6%-9.6% regression in various
screenshare_slides_vp9_2tl graphs at 10101:10101
Re: Issue 517670 in chromium: border-radius is not clipping non-statically
positioned children correctly
Re: Issue 157218 in chromium: border-radius clipping does not apply to
composited children
Re: Issue 538656 in chromium: 2.7% regression in screenshare_slides_vp9_2tl
at 10129:10129
Re: Issue 544303 in chromium: Security panel: Origin list icons should show
as white on blue when highlighted
Re: Issue 543572 in chromium: 9% regression in page_cycler.intl_hi_ru at
354213:354215
Re: Issue 255482 in chromium: DOM4: prepend, append, before, after & replace
Re: Issue 545161 in chromium: 80.3% regression in
power.pps_control_disabled at 354676:354677
Re: Issue 157218 in chromium: border-radius clipping does not apply to
composited children
Re: Issue 263662 in chromium: <video> tags do not properly clip to a
container's border radius
Re: Issue 543227 in chromium: Race condition when autotest creates a job
Re: Issue 513671 in chromium: Implement Notification action buttons
Re: Issue 444700 in chromium: overflow-border-radius-composited.html is
broken
Re: Issue 157218 in chromium: border-radius clipping does not apply to
composited children
Re: Issue 546028 in chromium: Merged CLs are still listed being in review
state
Re: Issue 478881 in chromium: OOPIF: Navigating opener window tries to use
the wrong swapped out RenderFrame instead of the proxy
Re: Issue 538554 in chromium: Enabling 2-factor authentication on my
chromium account failed
Re: Issue 368518 in chromium: Remove FrameView::repaintRectsAsText
--
--
Automated mail from issue updates at http://crbug.com/
Subscription options: http://groups.google.com/a/chromium.org/group/chromium-bugs

To unsubscribe from this group and stop receiving emails from it, send an email to chromium-bugs+***@chromium.org.
c***@googlecode.com
2015-10-21 19:05:30 UTC
Permalink
Your project notifications generated too many emails to send
individually. Here are the subject lines of the emails you would have
received:

Re: Issue 523796 in chromium: Chrome PDF viewer doesn't display text in
some cases
Re: Issue 431501 in chromium: Resizer and scroll corner code is an odd fit
in RenderLayerScrollableArea
Re: Issue 546097 in chromium: send the enrollment edition information from
the server to Chrome OS
Re: Issue 514154 in chromium: [Google+] Page doesn't get loaded when opener
is set to null on child window
Re: Issue 546073 in chromium: Link device @ chromeos2-row6-rack4-host4
fails with "unable to find phy for frequency" error
Re: Issue 321978 in chromium: mousemove events returning false delay child
drags from starting
Re: Issue 371423 in chromium: Feature Request: A way to make console source
links use previous stack frame
Re: Issue 543354 in chromium: Plugin Power Saver: Posters cause play button
to be in top-left corner
Re: Issue 546068 in chromium: [BRCM4354]
network_WiFi_ChromeEndToEnd.transitionWiFiNetworks and
network_RoamWifiEndToEnd failure
Re: Issue 261596 in chromium: Click to Play does not work in Chrome 28 on
Mac OSX 10.7
Issue 546100 in chromium: daisy paladins failed fetching manifest config
Re: Issue 173140 in chromium: Print dialog does not show if there is a
long-polling request
Re: Issue 67052 in chromium: Chrome_Linux: Crash Report - Stack Signature:
WebCore::InspectorFrontend::addConsoleMessage-d8eb4ddb_8c2f7ca8_7c661652_25e4a353_0dd7d318
Re: Issue 545786 in chromium: Cannot submit password at web forms
correctly, using Japanese IME.
Issue 546101 in chromium: Autofill heuristics issue on macys.com
Re: Issue 231607 in chromium: mousedown + mousemove causes click event to
fire on SVG element
Re: Issue 546017 in chromium: Flash 19.0.0.226 Not Working - 'Couldn't Load
Plugin' Error
Re: Issue 466006 in chromium:
inspector/sources/debugger/skip-pauses-until-reload.html is flaky
Re: Issue 537725 in chromium: Chrome fails to play particular MP3 (used to
work)
Re: Issue 517661 in chromium: Chromium Mojo Windows flaky apptests hangs
Re: Issue 345141 in chromium: Pod selection sequence when pressing Tab key
omits Kiosk Apps on second cycle.
Re: Issue 415014 in chromium: event onmouseclick.clientX/Y incorrectly has
scroll offset added
Re: Issue 24468 in chromium: Tune V8 instance in ProxyResolver to use as
little memory as possible
Re: Issue 415014 in chromium: event onmouseclick.clientX/Y incorrectly has
scroll offset added
Re: Issue 545545 in chromium: Consider getting rid of touch highlight rect
Re: Issue 545632 in chromium: Dynamic PDF generated using iTextSharp.dll
fails to load in chrome for the last few days
Re: Issue 419493 in chromium: RequestPointerLock should fire a
PointerLockError if not initiated by user-gesture.
Re: Issue 509749 in chromium: Chrome window fails to accept focus when
specific PDF is opened
Re: Issue 543808 in chromium: HTML5 audio element not working with data-uri
after page is reloaded
Re: Issue 455462 in chromium: DCHECK failure in
base::IsValueInRangeForNumericType computing visible rect in tiling space
Re: Issue 536582 in chromium: Scrolling is noticeably slower
Re: Issue 546068 in chromium: [BRCM4354]
network_WiFi_ChromeEndToEnd.transitionWiFiNetworks and
network_RoamWifiEndToEnd failure
Re: Issue 529359 in chromium: Implement per-origin time quota for syncs
between controlled page loads
Re: Issue 546043 in chromium: Unnecessarily insecure URL
Re: Issue 508614 in chromium: Elements panel should scroll when necessary
Re: Issue 542897 in chromium: Page renders in dotted repeating streaks on
external monitor
5 issues changed in chromium
Re: Issue 527556 in chromium: Window visually corrupt on DisplayLink
monitor w/ Hardware Acceleration enabled
Re: Issue 546097 in chromium: send the enrollment edition information from
the server to Chrome OS
Re: Issue 509587 in chromium: 1.5%-68.3% regression in
page_cycler.intl_ar_fa_he at 337351:337961
Re: Issue 546085 in chromium: 1526.7% regression in load_library_perf_tests
at 352110:352157
Issue 546103 in chromium: Chrome refuses to run when using SSH's X11
security extensions
Re: Issue 545545 in chromium: Consider getting rid of touch highlight rect
Re: Issue 525835 in chromium: Eliminate WebMouseWheelEvent wheelTicksX and
wheelTicksY
Re: Issue 506977 in chromium: Mousemove event not triggered at the
beginning of every digital pen stroke - disable "flicks"?
Re: Issue 546101 in chromium: Autofill heuristics issue on macys.com
Re: Issue 337606 in chromium: Hardware decoded video is "Choppy" & Jerky
Re: Issue 546043 in chromium: Unnecessarily insecure URL
Re: Issue 544113 in chromium: Decide what to do if a background sync is
registered in a browser without play services
Re: Issue 419493 in chromium: RequestPointerLock should fire a
PointerLockError if not initiated by user-gesture.
Re: Issue 98561 in chromium: :target pseudo-selector does not apply to
elements that do not exist at hashchange time
Re: Issue 491137 in chromium: Consider using JobScheduler on Android
Re: Issue 342848 in chromium: Avoid converting ints to floats when not
needed
Re: Issue 546103 in chromium: Chrome refuses to run when using SSH's X11
security extensions
Re: Issue 488855 in chromium: "Tab.active" is always "false" at creation
time
Re: Issue 471181 in chromium: Manipulation of SVGPathSegList results in
list corruption
Issue 546104 in chromium: Automate creation of heat maps and add
functionality to crosperf
Re: Issue 545914 in chromium: Incorrectly seeks to wrong part of mp3
encoded audio
Re: Issue 535711 in chromium: Hook up attachment brokering on Mac for
Chrome IPC.
Re: Issue 337606 in chromium: Hardware decoded video is "Choppy" & Jerky
Re: Issue 536140 in chromium: Recipe bisect doesn't generate profiles
Re: Issue 546073 in chromium: Link device @ chromeos2-row6-rack4-host4
fails with "unable to find phy for frequency" error
Re: Issue 501838 in chromium: One-shots need to retry (with exponential
backoff) on failure
Re: Issue 517566 in chromium: Window shadow causing mis-coloring for very
bright colors on Mac
Re: Issue 545589 in chromium: Add SyncEvent.lastChance attribute
Re: Issue 478337 in chromium: Canvas does not stroke lines correctly at
high scales
Re: Issue 491600 in chromium: Open page in new tab with target="_new" -
mouse (sometimes) stops working
Re: Issue 486302 in chromium: omnibox tab search completion doesn't work
for youtube.com
Re: Issue 521010 in chromium: componentize chrome/renderer/searchbox
Re: Issue 545109 in chromium: Bisect not descending into skia roll
Re: Issue 538649 in chromium: 2.2%-168.8% regression in various ramp-up
Nexus tests at 10086:10096
Re: Issue 543473 in chromium: Regression: Unneccessary Blue underline is
switch on 'Element' section after clicking on 'Select an Element in the
page to inspect it' icon.
Re: Issue 546073 in chromium: Link device @ chromeos2-row6-rack4-host4
fails with "unable to find phy for frequency" error
Re: Issue 382667 in chromium: Security: Integer overflow from "offset +
size" everywhere
Re: Issue 537128 in chromium: HWTest: 8+ canary build trees failing on
Autotest timeouts
Re: Issue 491600 in chromium: Open page in new tab with target="_new" -
mouse (sometimes) stops working
Re: Issue 375878 in chromium: Chrome crashes when printing from web
Re: Issue 537128 in chromium: HWTest: 8+ canary build trees failing on
Autotest timeouts
Re: Issue 545383 in chromium: query param in href is normalized (Unicode
NFC) before converted to the character encoding of a page (non-UTF-8)
Re: Issue 546092 in chromium: MediaDrmBridge: Move HTTP request to native
code.
Issue 546105 in chromium: Cannot sign in to chrome
Re: Issue 521759 in chromium: Support MediaDrmBridge in MojoCdmService in
GPU process.
Re: Issue 539815 in chromium: [Regression]:Unable to turn off chrome book
on clicking Shut Down button
Re: Issue 530015 in chromium: CSS font-display
Re: Issue 514274 in chromium: Aw Snap error for pages
Re: Issue 27637 in chromium: Chrome Extension pages (like options) cannot
use the link tag to have a tab icon
Re: Issue 305219 in chromium: In chrome extension that overrides newtab
page there's no favicon on newtab.html
Re: Issue 337606 in chromium: Hardware decoded video is "Choppy" & Jerky
Re: Issue 70598 in chromium: Copying URL : unescape path part and convert
punycode in hostname to unicode subject to spoofing test
Re: Issue 546103 in chromium: Chrome refuses to run when using SSH's X11
security extensions
Re: Issue 499146 in chromium: Can't use Flash extension in chromium
Re: Issue 545986 in chromium: Mac10.9 Tests doesn't complete browser_tests
Re: Issue 545683 in chromium: PageSerializer uses normalizeAndEncode
Re: Issue 538759 in chromium: Get CWP collection parameters from Finch
Issue 546106 in chromium: CSP: Chrome complains the style-src hashes
mismatch even though it shows them to be the same
Re: Issue 506977 in chromium: Windows stylus "flicks" support can interfere
with pen use in Chrome
Re: Issue 546092 in chromium: MediaDrmBridge: Move HTTP request to native
code.
Re: Issue 303728 in chromium: media print css rule for footers not
repeating the footer
Re: Issue 545757 in chromium: Support AES-256-GCM in HTTP/2
Re: Issue 506977 in chromium: Windows stylus "flicks" support can interfere
with pen use in Chrome
Re: Issue 546103 in chromium: Chrome refuses to run when using SSH's X11
security extensions
Re: Issue 545998 in chromium: Mac 10.10 Tests is hung
--
--
Automated mail from issue updates at http://crbug.com/
Subscription options: http://groups.google.com/a/chromium.org/group/chromium-bugs

To unsubscribe from this group and stop receiving emails from it, send an email to chromium-bugs+***@chromium.org.
c***@googlecode.com
2015-10-22 20:34:09 UTC
Permalink
Your project notifications generated too many emails to send
individually. Here are the subject lines of the emails you would have
received:

Re: Issue 541859 in chromium: Button connexion on "google page" doessn't
work
Re: Issue 519943 in chromium: Clarify uses of is_chromeos
Re: Issue 543397 in chromium: Remove SVG glyph-orientation-horizontal and
glyph-orientation-vertical
Re: Issue 546688 in chromium: Any camera is not recognized in the Device
Tricky
Re: Issue 520928 in chromium: Make showing of 'Paste' option on text fields
align with Chrome for Android
Re: Issue 542574 in chromium: Mouse movement events don't fire if
pointerLock is invoked while mouse is outside browser
Re: Issue 546688 in chromium: Any camera is not recognized in the Device
Tricky
Re: Issue 521791 in chromium: Add support for policy managed settings to
md-settings
Re: Issue 546170 in chromium: Touchbot: Add an option to specify device
number on command line
Issue 546700 in chromium: Print Preview - very slow content scrolling when
zoomed
Re: Issue 546170 in chromium: Touchbot: Add an option to specify device
number on command line
Re: Issue 546597 in chromium: telemetry's run_benchmark creates browser
windows
Re: Issue 470451 in chromium: DevTools: inspect element should go to the
right frame
Re: Issue 515711 in chromium: Expose renderer scroll status via
CompositorFrameMetadata
Re: Issue 542986 in chromium: Chrome 45 unable to act as server for DHE
cipher suites
Issue 546701 in chromium: Chrome Linux download page warns about the
download
Re: Issue 399381 in chromium: Investigate MotionEvent resamping under
unfavorable frequency and phase alignment
Re: Issue 529883 in chromium: Right Alt ignored in omnibox
Re: Issue 546688 in chromium: Any camera is not recognized in the Device
Tricky
Re: Issue 544751 in chromium: Archive stage failed in glados
Re: Issue 538951 in chromium: iOS Chrome Cloud Print "(NSURLErrorDomain
error -1008.)"
Re: Issue 546139 in chromium: Enable Incident Reporting for Extended
Reporting population
Re: Issue 544560 in chromium: Favicon not updated as a result of Javascript
Issue 546702 in chromium: Guest mode shouldn't have "Show Google Now cards
in the launcher"
Re: Issue 487013 in chromium: Flesh out test coverage of Tab and
WebContents state during activity transitions
Re: Issue 535711 in chromium: Hook up attachment brokering on Mac for
Chrome IPC.
Re: Issue 546378 in chromium: Android Chromoting: Implement
runtime-permissions model.
Re: Issue 471762 in chromium: Omnibox appearance can hide focused editable
region
Re: Issue 527464 in chromium: Successful WebRTC calls sometimes don't
trigger an ICEConnectionStateCompleted event
Re: Issue 489712 in chromium: Measure frequency of wakeups due
to "cancelled" callbacks
Issue 546705 in chromium: Info bar not triggered in WKWebView for
scenarioGoogleMapsNotInstalledInfobar
Re: Issue 415014 in chromium: event onmouseclick.clientX/Y incorrectly has
scroll offset added
Re: Issue 537446 in chromium:
nexus5/smoothness.key_mobile_sites_smooth/first_gesture_scroll_update_latency
noisy on amazon
Re: Issue 546625 in chromium: SSH Into DUTs from Telemetry fails with DNS
failure in a small but not insignificant % of attempts.
Re: Issue 215923 in chromium: Add a configure buttton to give Colemak users
the choice of using the overriden meaning of the Search key instead of
Colemak's default backspace
Issue 546706 in chromium: There is no command line flags to enable
notifications permissions
Re: Issue 540817 in chromium: Security: Graphics memory exhaustion DoS
Re: Issue 504904 in chromium: Consider alternative UX for unresponsive sites
Re: Issue 540548 in chromium: No autofocus on WebRTC video on some android
devices
Re: Issue 438646 in chromium: Consider throttling
ThreadProxy::DidCompleteSwapBuffers notifications
Re: Issue 543678 in chromium: CSS border not rendering as expected when
inside a element with transform: translate
Re: Issue 490176 in chromium: Pepper plugin doesn't copy large clipboard
areas.
Re: Issue 528407 in chromium: OOPIF: Implement pageScaleFactor/zoom-level
for RemoteFrames
Re: Issue 546705 in chromium: Info bar not triggered in WKWebView for
scenarioGoogleMapsNotInstalledInfobar
Re: Issue 541352 in chromium: ChromeOS no longer correctly shows vertically
configured Chrome Sign Builder content correctly in kiosk mode
Re: Issue 543678 in chromium: CSS border not rendering as expected when
inside a element with transform: translate
Re: Issue 444114 in chromium: Suppress tap acks after all observers removed
Re: Issue 538863 in chromium: When pinch-zoomed in, the time line in a
youtube video doesn't represent where your mouse is hovering over..
Re: Issue 517149 in chromium: Consider dimming the web content area when
the renderer is unresponsive
Re: Issue 540852 in chromium: "High Contrast" extension has trouble with
embedded pages
Re: Issue 534154 in chromium: long press after word selects preceding
punctuation, pasting deletes punctuation
Re: Issue 176718 in chromium: Input events can arrive at WebKit thread
before scroll/scale updates
Re: Issue 516719 in chromium: HTMLMediaElement::startProgressEventTimer
fires too frequently for hidden web content
Re: Issue 546103 in chromium: Chrome refuses to run when using SSH's X11
security extensions
Re: Issue 540817 in chromium: Security: Graphics memory exhaustion DoS
Re: Issue 545790 in chromium: install google-api-python-client (version
1.3.1) on CrOS builders
Re: Issue 546109 in chromium: Android Galaxy S5 Perf test failures
Re: Issue 335735 in chromium: On screen keyboard triggered even when
keyboard is attached
Re: Issue 514815 in chromium: Implement a light-weight synchronization
primitive for streams
Re: Issue 546255 in chromium: OOPIF: Youtube videos don't play
Re: Issue 546204 in chromium: zip downloads 100% but fails to complete
Re: Issue 546701 in chromium: Chrome Linux download page warns about the
download
Re: Issue 542225 in chromium: Make GpuMemoryBuffer Map interface easier to
use.
Issue 546707 in chromium: mus: Accelerators and event-observers
Re: Issue 533648 in chromium: Memory leak on Unity game
Re: Issue 546701 in chromium: "Discard" button is elided in download UI
Re: Issue 545130 in chromium: nacl_io html5 filesystem_resource mount with
chrome.fileSystem.restoreEntry in chrome app
Re: Issue 546698 in chromium: Will not Uninstall
Re: Issue 546597 in chromium: telemetry's run_benchmark creates browser
windows
Re: Issue 541352 in chromium: ChromeOS no longer correctly shows vertically
configured Chrome Sign Builder content correctly in kiosk mode
Re: Issue 541352 in chromium: ChromeOS no longer correctly shows vertically
configured Chrome Sign Builder content correctly in kiosk mode
Re: Issue 37457 in chromium: The SSL certificate error interstitial page
does not go away if the resource results in a download
Re: Issue 510485 in chromium: GN: Fix unittests not passing on Android
Re: Issue 535283 in chromium: adding the flag --whitelisted-extension-id
does not work
Issue 546710 in chromium: Create a variant of WebContents::Replace that
re-selects the replaced text
Re: Issue 490176 in chromium: Pepper plugin doesn't copy large clipboard
areas.
Re: Issue 545790 in chromium: install google-api-python-client (version
1.3.1) on CrOS builders
Re: Issue 532476 in chromium: Screen distortion when used on a DisplayLink
monitor
Re: Issue 526883 in chromium: WebRTC: screensharing windowpicker doesn't
show preview of some non-browser windows in Windows 10
Re: Issue 425878 in chromium: Server-Sent Events connection is not
reestablished after waking from sleep
Re: Issue 544751 in chromium: chromeos-kernel 3.18: iwlwifi driver is
duplicated and broken
Re: Issue 386213 in chromium: Pending Network requests after calling http
OPTIONS followed by GET on same resource
Re: Issue 530507 in chromium: Cannot use getUserMedia in a
chrome-extension: frame in a http: document.
Re: Issue 543214 in chromium: Deprecation warnings in Sync code
Re: Issue 517697 in chromium: Change all calls to
AccountManagerHelper#getGoogleAccounts() to be async
Re: Issue 538663 in chromium: 54.9%-62% regression in
AbsSendTimeSingleStreamWithHighStartBitrate on Mac at 10089:10089
Re: Issue 512950 in chromium: Establishing secure connection hangs but
eventually loads
Re: Issue 526883 in chromium: WebRTC: screensharing windowpicker doesn't
show preview of some non-browser windows in Windows 10
Re: Issue 485217 in chromium: [Tabbed mode] Chrome loses Tabs because it
fails to save out data
Re: Issue 546103 in chromium: Chrome refuses to run when using SSH's X11
security extensions
Re: Issue 546106 in chromium: CSP: Chrome complains the style-src hashes
mismatch even though it shows them to be the same
Re: Issue 546106 in chromium: CSP: Chrome complains the style-src hashes
mismatch even though it shows them to be the same
Re: Issue 240396 in chromium: Drive SQLite errors for thumbnail_database.cc
to zero.
Re: Issue 543321 in chromium: Port the thumbnail database diagnostic tools
into sql::Connection.
Re: Issue 545964 in chromium: Sign in label text is seen misaligned when
sign out of hangouts for gmail.com
Issue 546712 in chromium: FR: API to set seekable range for streaming media
Re: Issue 485217 in chromium: [Tabbed mode] Chrome loses Tabs because it
fails to save out data
Re: Issue 526883 in chromium: WebRTC: screensharing windowpicker doesn't
show preview of some non-browser windows in Windows 10
Re: Issue 546706 in chromium: There is no command line flags to enable
notifications permissions
Re: Issue 546651 in chromium: [Pit/Pi/Daisy] autotest failed with kernel
crash for suspend/resume, unplug/plug related cases (chameleon suites)
Re: Issue 544751 in chromium: chromeos-kernel 3.18: iwlwifi driver is
duplicated and broken
Re: Issue 546109 in chromium: Android Galaxy S5 Perf test failures
--
--
Automated mail from issue updates at http://crbug.com/
Subscription options: http://groups.google.com/a/chromium.org/group/chromium-bugs

To unsubscribe from this group and stop receiving emails from it, send an email to chromium-bugs+***@chromium.org.
c***@googlecode.com
2015-10-26 20:31:51 UTC
Permalink
Your project notifications generated too many emails to send
individually. Here are the subject lines of the emails you would have
received:

Re: Issue 547912 in chromium: 16.5%-197.7% regression in blink_perf.parser
at 355785:355812
Issue 547912 in chromium: 16.5%-197.7% regression in blink_perf.parser at
355785:355812
Re: Issue 547583 in chromium: Forced Re-enrollment Not Consistent / Allows
for Engagement in Developer Mode
Re: Issue 546193 in chromium: Support enabling web features from background
tracing scenarios
Re: Issue 509004 in chromium: DCHECK(editor != nil) is fired when clicking
on the password bubble icon
Re: Issue 241065 in chromium: Problems with Yahoo Mail since I've installed
Chrome
Re: Issue 467917 in chromium: [svg2] Make width and height presentation
attributes on nested <svg> elements
Re: Issue 547545 in chromium: Enterprise Enrollment Hardware bypass
Re: Issue 435382 in chromium: Quantitatively measure difference between
telemetry tests and real browser performance.
Re: Issue 546996 in chromium: Regression : Text overlapping is seen when
console is resized and dragged upwards to tab strip in dev tools.
Re: Issue 507964 in chromium: omnibox remove some Thai vowel then mis-spell
word
Re: Issue 426656 in chromium: Support multi monitor dpi awareness
Re: Issue 523152 in chromium:
WebRtcGetUserMediaBrowserTest.RenderVideoTrackInMultipleTagsAndPause flaky
on linux_chromium_asan_rel_ng
Issue 547914 in chromium: Wire up physical monitor dimensions on Windows
Re: Issue 547914 in chromium: Wire up physical monitor dimensions on Windows
Re: Issue 544377 in chromium: User can't switch profile with
--disable-new-avatar-menu flag
Re: Issue 435382 in chromium: Quantitatively measure difference between
telemetry tests and real browser performance.
Re: Issue 537836 in chromium: gfx::Rect::Union
Re: Issue 379378 in chromium: Telemetry android cycle time is too slow
Re: Issue 415950 in chromium: "transform: none" isn't respected on svg
elements
Re: Issue 521087 in chromium: fast/dom/shadow/gc-after-body-removed.html is
flaky
Re: Issue 520739 in chromium:
http/tests/websocket/close-code-and-reason.html is flaky
Re: Issue 520736 in chromium:
media/W3C/video/networkState/networkState_during_progress.html is flaky
Re: Issue 476082 in chromium: discover.DiscoverModule shouldn't ignore
import errors when trying to discover modules
Re: Issue 520617 in chromium: webaudio/audiochannelmerger-disconnect.html
is flaky
Re: Issue 506353 in chromium: discover is really fragile.
Re: Issue 520200 in chromium: svg/batik/text/smallFonts.svg is flaky
Re: Issue 520191 in chromium:
http/tests/security/mixedContent/strict-mode-via-pref-image-blocked.https.html
is flaky
Re: Issue 520189 in chromium: http/tests/misc/submit-post-keygen.html is
flaky
Re: Issue 542548 in chromium: Can not launch a new tab with
rel="noreferrer" attribute in AndroieWebView
Re: Issue 520178 in chromium: fast/loader/form-submit-aborts-parsing.html
is flaky
Re: Issue 399646 in chromium: ASSERTION FAILED: textRenderer->parent() in
blink::SVGTextLayoutEngineBaseline::dominantBaselineToAlignmentBaseline
Re: Issue 506112 in chromium: Crash in the omnibox on Mac when trying to
rapidly copy text and navigating
Re: Issue 484381 in chromium: miket is in extensions OWNERS, rockot is not
in DEPS OWNERS
Re: Issue 506977 in chromium: Windows stylus "flicks" support can interfere
with pen use in Chrome
Re: Issue 547427 in chromium: Include policy hooks to GAIA login
Re: Issue 399627 in chromium: ASSERTION FAILED:
fallbackGlyphData.fontData != fontData in
blink::SVGTextRunRenderingContext::glyphDataForCharacter
Re: Issue 428046 in chromium: Omnibox refuses to allow navigation to 0.0.0.0
Re: Issue 230692 in chromium: SVG animations of references (e.g.,
url(#foo)) do not work.
Re: Issue 513866 in chromium: Attribute for Restricting IFrame Permissions
Re: Issue 435723 in chromium: Telemetry --device
Re: Issue 231512 in chromium: SVG image drawing methods do not perform the
same
Re: Issue 444705 in chromium: Move thread times benchmark to
TimelineBasedMeasurement
Re: Issue 435179 in chromium: Add support to Telemetry for running tests
against an exact Android APK
Re: Issue 457853 in chromium: Telemetry --device flag for Clank bots
Re: Issue 545466 in chromium: [Regression]: Camera LED is seen turned on
even after selecting any other profile picture.
Re: Issue 231544 in chromium: SVG image is pixelated when viewports are used
Re: Issue 435723 in chromium: Telemetry --device
Re: Issue 459450 in chromium: Send improvement_direction to perf dashboard
in chartjson instead of using unit-info.json
Re: Issue 164030 in chromium: Add flying images to
page_sets/tough_resizing_cases.json
Issue 547918 in chromium: Optimize AudioEncoder
Re: Issue 388643 in chromium: feBlend produces invalid output
Re: Issue 457853 in chromium: Telemetry --device flag for Clank bots
Issue 547917 in chromium: 10%-234.2% regression in blink_perf.layout at
355776:355946
Re: Issue 528519 in chromium: Implement MediaStreamRecorder for Audio
Re: Issue 547917 in chromium: 10%-234.2% regression in blink_perf.layout at
355776:355946
Issue 547919 in chromium: ART VMs m89-m7, vm90-m7, vm91-m7, vm92-m7 don't
have all credentials.
Re: Issue 544918 in chromium: [Regression]: Unable to scroll freely under
dropdown options using mouse wheel
Re: Issue 547919 in chromium: ART VMs m89-m7, vm90-m7, vm91-m7, vm92-m7
don't have all credentials.
Re: Issue 546715 in chromium: Black line artifacts on Retina display
Re: Issue 435179 in chromium: Add support to Telemetry for running tests
against an exact Android APK
Re: Issue 503976 in chromium: !HTMLMediaElement.canPlayType() shouldn't
imply !MediaSource.isTypeSupported()
Re: Issue 508270 in chromium: Source maps cache not refreshed
Re: Issue 467917 in chromium: [svg2] Make width and height presentation
attributes on nested <svg> elements
Re: Issue 369944 in chromium: [SVG2] width and height on SVGSVGElement
should always be presentation attributes
Re: Issue 501292 in chromium: 'unload' event doesn't fire when moving to
another domain
Re: Issue 462729 in chromium: Add support for specifying Enabled/Disabled
for GPU machines
Re: Issue 360315 in chromium: [SVG] Incorrect alignment of incrementally
shifted tspan elements when RTL direction is set
Re: Issue 375342 in chromium: Drop RC4 Support
Re: Issue 547868 in chromium: Crash due to cache directory migration
Re: Issue 360314 in chromium: [SVG] Incorrect alignment of the first tspan
in text element when RTL direction is set
Re: Issue 463681 in chromium: Add unit tests for benchmark_runner
Re: Issue 360314 in chromium: [SVG] Incorrect alignment of the first tspan
in text element when RTL direction is set
Re: Issue 465485 in chromium: Port everything to argparse
Issue 547922 in chromium: Missing option of loading original image when
pressing on compressed image
Re: Issue 487225 in chromium: Form HTTP Extensions
Re: Issue 518850 in chromium: Move ontouch* definitions to
GlobalEventHandlers.idl
Re: Issue 464464 in chromium: Port chromium.perf.fyi slaves to be triggered
by Buildbucket
Re: Issue 468462 in chromium: height on table-row element is ignored
Re: Issue 547888 in chromium: Reproducible crash loading video at
mirror.co.uk
Re: Issue 347126 in chromium: SVGTextElement.getStartPositionOfChar and
getCharNumAtPosition disagree
Re: Issue 473435 in chromium: Fix 'help' to be a SubcommandCommand
Re: Issue 464905 in chromium: Ebay UK, invoice printing issues with Chrome
(Grey line, vertically down the left)
Re: Issue 545466 in chromium: [Regression]: Camera LED is seen turned on
even after selecting any other profile picture.
Re: Issue 475203 in chromium: SVG Text non-scaling-stroke doesn't work
Re: Issue 450506 in chromium: Text box typing lag is unbearable
Issue 547924 in chromium: Implement data use tab model
Re: Issue 459056 in chromium: Chrome for Windows (7 and 8.1) unable to show
unicode char. #10095.
Re: Issue 466767 in chromium: Website shown as Mobil on desktop.
Re: Issue 538325 in chromium: Add ability to create GpuMemoryBuffers from
foreign handles
Re: Issue 462689 in chromium: Use bundled harfbuzz on linux
Re: Issue 542548 in chromium: Can not launch a new tab with
rel="noreferrer" attribute in AndroieWebView
Re: Issue 506663 in chromium: Compilation fails with several occurrences of
uninitialized const typed objects
Re: Issue 311469 in chromium: svg/custom/font-face-cascade-order.svg and
svg/custom/getSubStringLength.html are flaky
Re: Issue 508270 in chromium: Source maps cache not refreshed
Re: Issue 547538 in chromium: Bad hardware on guado_moblab device
Issue 547925 in chromium: 1-2 sec. freezing on videos
Re: Issue 315277 in chromium: blink uses skia for drawing round rects,
custom code for clipping them
Re: Issue 506112 in chromium: Crash in the omnibox on Mac when trying to
rapidly copy text and navigating
Re: Issue 547872 in chromium: 19.9%-3377.3% regression in
blink_perf.pywebsocket at 355965:355969
Re: Issue 547911 in chromium: Chrome Feature Request: Download Directly to
Google Drive
Re: Issue 538927 in chromium: Flexbox column wrap container width doesn't
grow
--
--
Automated mail from issue updates at http://crbug.com/
Subscription options: http://groups.google.com/a/chromium.org/group/chromium-bugs

To unsubscribe from this group and stop receiving emails from it, send an email to chromium-bugs+***@chromium.org.
c***@googlecode.com
2015-10-26 22:40:18 UTC
Permalink
Your project notifications generated too many emails to send
individually. Here are the subject lines of the emails you would have
received:

Re: Issue 528180 in chromium: WebGL Code refactoring in Blink for
validations
Re: Issue 497352 in chromium: Implement image data conversion for WebGL 2
with new formats and types
Re: Issue 436568 in chromium: Making GPU resource initialization optional
in command buffer
Re: Issue 436569 in chromium: Making command buffer validation optional
Re: Issue 431177 in chromium: GN: Make Mac build work
Re: Issue 462729 in chromium: Add support for specifying Enabled/Disabled
for GPU machines
Re: Issue 542668 in chromium: InvalidAccessError when recreating old caches
Re: Issue 402206 in chromium: Simplify resource tracking in WebGL
implementation
Re: Issue 522525 in chromium: New version of Webview content flickering
when resizing webview and crashes after certain time
Re: Issue 419915 in chromium: Better handling of WebGL binary shader caching
Re: Issue 103089 in chromium: Add WebGL Profiling
Re: Issue 547866 in chromium: Popups within both incognito and normal chrome
Re: Issue 507964 in chromium: omnibox remove some Thai vowel then mis-spell
word
Re: Issue 471903 in chromium: make khronos_glcts_tests work fully in a GN
build
Re: Issue 547965 in chromium: Check failed: item.length() !=
std::numeric_limits<uint64>::max()
Re: Issue 163161 in chromium: Implement WEBGL_color_buffer_float extension
Re: Issue 235718 in chromium: Implement WebGL Shared Resources
Re: Issue 546481 in chromium: SyntaxError when trying to use Pretty Print
Re: Issue 547658 in chromium: [Devtools]Regression:Permission bubbles
remain even after clicking on allow option
Re: Issue 235724 in chromium: Make WebGLShareGroup and objects based off
WebGLSharedObject copyable for postMessage
Re: Issue 166460 in chromium: Hook up glLoseContextCHROMIUM to
WebGL_lose_context extension
Issue 547968 in chromium: 4.2%-6.4% regression in page_cycler.intl_ar_fa_he
at 355626:355820
Re: Issue 547968 in chromium: 4.2%-6.4% regression in
page_cycler.intl_ar_fa_he at 355626:355820
Re: Issue 359613 in chromium: WebGL vertex attrib array enabled states
inconsistent with underlying graphics driver
Re: Issue 547538 in chromium: Bad hardware on guado_moblab device
Re: Issue 547520 in chromium: Window loses shadow on return from full-screen
Re: Issue 547424 in chromium: console.time does not return sub-millisecond
values
Re: Issue 547425 in chromium: Telemetry test Kraken hangs indefinitely with
LLVM image (on daisy)
Re: Issue 541372 in chromium: Implement P1 UMA metrics for Media Router
Re: Issue 445857 in chromium: SVG <use> isn't updated when the referenced
<path> is modified using JavaScript
Re: Issue 547313 in chromium: Can't change keyboard layout on login screen
Re: Issue 284730 in chromium: ASSERTION FAILED: frame().view() == this
closing a page with SVG or video
Re: Issue 327115 in chromium: Unconditionally include unencumbered media
containers
Re: Issue 545591 in chromium: Stabilize chromeOS
Re: Issue 545591 in chromium: Stabilize chromeOS
Re: Issue 545591 in chromium: Stabilize chromeOS
Re: Issue 545591 in chromium: Stabilize chromeOS
Re: Issue 545591 in chromium: Stabilize chromeOS
Issue 547970 in chromium: cronet: Only deprecate things after there are 0
clients left in Chromium
Re: Issue 545591 in chromium: Stabilize chromeOS
Re: Issue 545591 in chromium: Stabilize chromeOS
Re: Issue 545591 in chromium: Stabilize chromeOS
Re: Issue 545591 in chromium: Stabilize chromeOS
Re: Issue 546065 in chromium: Kernel crashes ~40s after disconnecting from
LE device
Re: Issue 545591 in chromium: Stabilize chromeOS
Re: Issue 545591 in chromium: Stabilize chromeOS
Re: Issue 545591 in chromium: Stabilize chromeOS
Re: Issue 545591 in chromium: Stabilize chromeOS
Re: Issue 546065 in chromium: Kernel crashes ~40s after disconnecting from
LE device
Re: Issue 545591 in chromium: Stabilize chromeOS
Re: Issue 483646 in chromium: Telemetry value system cleanup
Re: Issue 547559 in chromium: memory leak when streaming playlist from
Google Play
Re: Issue 429551 in chromium: [Meta] A <line> renderer should not be 160
bytes
Re: Issue 429551 in chromium: [Meta] A <line> renderer should not be 160
bytes
Issue 547971 in chromium: Resource fetch failed for a big file (>32mb)
Re: Issue 358430 in chromium: Update OSX 10.9 Mavericks Retina baselines
Re: Issue 546065 in chromium: Kernel crashes ~40s after disconnecting from
LE device
Re: Issue 429301 in chromium: SVG SMIL Animation doesn't run if semicolon
included after last value in d attribute
Issue 547972 in chromium: Consider supporting page-break-inside: avoid
inside tr, td and tbody elements
Re: Issue 547538 in chromium: Bad hardware on guado_moblab device
Issue 547973 in chromium: Convert AccountManagerDelegate.Callback to
base.Callback
Re: Issue 515709 in chromium: REGRESSION: New tab page redirects to Google
upon startup after starting to type in the omnibox
Issue 547974 in chromium: html.css dependencies aren't understood by trybots
Re: Issue 531562 in chromium: Add unittest to test follow-module behavior
of find_dependencies.py
Re: Issue 547971 in chromium: Resource fetch failed for a big file (>32mb)
Re: Issue 454729 in chromium: Layout Test
svg/animations/dynamic-modify-transform-without-baseval.html is flaky
Re: Issue 544891 in chromium: MSE_ExternalClearKeyDecryptOnly is flaky on
Mac-10.9
Re: Issue 547440 in chromium: background-position broken for body
Re: Issue 484004 in chromium: The image cache can skew UseCounter numbers
Re: Issue 273150 in chromium: Sync custom avatar image blob
Re: Issue 547271 in chromium: User avatar does not sync to other devices
when avatar is from local filesystem
Re: Issue 547970 in chromium: cronet: Only deprecate things after there are
0 clients left in Chromium
Re: Issue 399585 in chromium: REGRESSION: Table style changing does not
work in iCloud document
Re: Issue 547424 in chromium: console.time does not return sub-millisecond
values
Re: Issue 369984 in chromium: width/height on SVGSVGElement should allow
global css values
Re: Issue 541372 in chromium: Implement P1 UMA metrics for Media Router
Re: Issue 547966 in chromium: Restart kiosk if unresponsive Flash instances
are detected
Re: Issue 334258 in chromium: Cleanup svg <animateColor> tests that aren't
needed after bug=332839
Issue 547977 in chromium: Implement P2 UMA metrics for Media Router
Issue 547978 in chromium: 10.8% regression in blink_perf.css at
355713:355740
Re: Issue 547978 in chromium: 10.8% regression in blink_perf.css at
355713:355740
Re: Issue 429551 in chromium: [Meta] A <line> renderer should not be 160
bytes
Re: Issue 535489 in chromium: Inconsistent formatting of histograms and
actions
Re: Issue 258638 in chromium: Consider plumbing "reasons we did not
composite" to the compositor
Re: Issue 547881 in chromium: Auto-link BUG=pdfium:NNN
Issue 547981 in chromium: Crash in
chromeos::SystemTrayDelegateChromeOS::ShowUserLogin
Issue 547982 in chromium: Can't open OIB if the original page was blocked
from navigation
Issue 547983 in chromium: 11.1% regression in blink_perf.layout at
355800:355826
Re: Issue 547983 in chromium: 11.1% regression in blink_perf.layout at
355800:355826
Re: Issue 534479 in chromium: [Chaos]All these routers failed due
to "RuntimeError: Unable to load admin page"
Re: Issue 538397 in chromium: crosperf: unit tests failing due to cache
handling change
Re: Issue 547937 in chromium: backdrop-filter does not respect border-radius
Re: Issue 547986 in chromium: 10.1%-10.7% regression in
blink_perf.shadow_dom at 355903:355967
Re: Issue 547981 in chromium: Crash in
chromeos::SystemTrayDelegateChromeOS::ShowUserLogin
Issue 547986 in chromium: 10.1%-10.7% regression in blink_perf.shadow_dom
at 355903:355967
Issue 547987 in chromium: Rietveld JS tests aren't run on infra.git trybots
Re: Issue 547379 in chromium: "save password" prompt fails to appear since
password previously saved for that site (gmail) was deleted in password
manager
Re: Issue 342848 in chromium: Avoid converting ints to floats when not
needed
Re: Issue 401331 in chromium: Unified BeginFrame scheduling for chrome
Re: Issue 545587 in chromium: Add LayerTreeSetting and command-line flag
for compositor property trees
Re: Issue 493861 in chromium: GPU Raster uses too many threads
Issue 547988 in chromium: DEPS changes other than revisions values skips
culprit identification logic
--
--
Automated mail from issue updates at http://crbug.com/
Subscription options: http://groups.google.com/a/chromium.org/group/chromium-bugs

To unsubscribe from this group and stop receiving emails from it, send an email to chromium-bugs+***@chromium.org.
c***@googlecode.com
2015-10-26 23:15:50 UTC
Permalink
Your project notifications generated too many emails to send
individually. Here are the subject lines of the emails you would have
received:

Re: Issue 547881 in chromium: Auto-link BUG=pdfium:NNN
Re: Issue 512029 in chromium: Find a plan for
chrome/browser/sync/glue/extensions_activity_monitor
Re: Issue 547881 in chromium: Auto-link BUG=pdfium:NNN
Re: Issue 547215 in chromium: Tab restoration always runs to completion
regardless of the memory pressure state (Mac)
Re: Issue 532831 in chromium: TabModel data isn't saved out when undoing
tab closure
Re: Issue 542414 in chromium: Flash - Camera and Microphone Not Enumerated
after M46
Issue 547992 in chromium: 9.8%-37.6% regression in
session_restore.warm.typical_25 at 355188:355215
Re: Issue 547992 in chromium: 9.8%-37.6% regression in
session_restore.warm.typical_25 at 355188:355215
Re: Issue 500041 in chromium: New tab closes during typing an address (with
Google Art Project extension)
Re: Issue 3911 in chromium: Dragging the new tab button should create a new
tab that is being dragged
Re: Issue 532831 in chromium: TabModel data isn't saved out when undoing
tab closure
Re: Issue 460698 in chromium: text-decoration color style not applied on
mouse hover
Re: Issue 3911 in chromium: Dragging the new tab button should create a new
tab that is being dragged
Re: Issue 90550 in chromium: Let New Tab Button be dragged
Re: Issue 547215 in chromium: Tab restoration always runs to completion
regardless of the memory pressure state (Mac)
Re: Issue 547878 in chromium: getComputedStyle for transparent colors
difference
Re: Issue 3911 in chromium: Dragging the new tab button should create a new
tab that is being dragged
Re: Issue 145596 in chromium: Drag New Tab button to create a New Tab
Issue 547993 in chromium: 10.2%-12.1% regression in
v8.key_mobile_sites_smooth at 355767:355788
Re: Issue 547993 in chromium: 10.2%-12.1% regression in
v8.key_mobile_sites_smooth at 355767:355788
Re: Issue 3911 in chromium: Dragging the new tab button should create a new
tab that is being dragged
Re: Issue 370723 in chromium: [Feature Request] Drag 'New tab' button to
create a new window
Re: Issue 514106 in chromium: SPDY_PROTOCOL_ERROR randomly occurs.
Re: Issue 500030 in chromium: datalist failures with slimming paint and
strict cullrects
Re: Issue 535755 in chromium: Omnibox sometimes refuses to accept valid
URLs, will only allow a search
Re: Issue 547163 in chromium: text bar cursor in CrOS is hard to see
Re: Issue 504535 in chromium: Layout Test svg/wicd/rightsizing-grid.xhtml
is flaky
Re: Issue 541618 in chromium: <Replace this with a summary. This form is
for audio/video issue (HTML5).>
Re: Issue 526842 in chromium: cross-process synchronous compositing
Issue 547994 in chromium: [OS X El Capitan]: 'Extension Directory' is too
big than expected?
Re: Issue 535755 in chromium: Omnibox sometimes refuses to accept valid
URLs, will only allow a search
Issue 547995 in chromium: Email ID need to be typed twice for the first
login
Re: Issue 547869 in chromium: Computing pseudo-selectors - ::-webkit-*
looks to be always considered as not invalid
Re: Issue 547987 in chromium: Rietveld JS tests aren't run on infra.git
trybots
Re: Issue 420708 in chromium: Make Omnibox Ranking Smoother
Re: Issue 547987 in chromium: Rietveld JS tests aren't run on infra.git
trybots
Re: Issue 528145 in chromium: Nvidia: glReadPixels fails on FBO binding
cube map texture.
Issue 547996 in chromium: Make Ryu Launch Control library available in
Chromite.
Re: Issue 527130 in chromium: Address bar becomes unresponsive when css or
javascript animations are running
Issue 547997 in chromium: chrome-golo-presubmit fails pylint
Re: Issue 547869 in chromium: Computing pseudo-selectors - ::-webkit-*
looks to be always considered as not invalid
Re: Issue 547824 in chromium: Group of CSS selectors should be invalid if
any selector in the group is invalid
Re: Issue 547192 in chromium: 1%-2.3% regression in
page_cycler.intl_ar_fa_he at 353964:354682
Re: Issue 547925 in chromium: 1-2 sec. freezing on videos
Re: Issue 512029 in chromium: Find a plan for
chrome/browser/sync/glue/extensions_activity_monitor
Re: Issue 541430 in chromium: AOPEN hardware lockup while running signage
app
Re: Issue 341314 in chromium: WebFrameTest.FindInPageMatchRects failing on
Android
Re: Issue 506662 in chromium: Refactor DrawingRecorder to not require a
rect when cached
Issue 547999 in chromium: graphics_KhronosGLCTSChrome: Fail to locate
khronos_glcts_test_expectations.txt
Re: Issue 547999 in chromium: graphics_KhronosGLCTSChrome: Fail to locate
khronos_glcts_test_expectations.txt
Re: Issue 528069 in chromium: Settings window is included in "current
pages" when setting startup page(s) for ChromeOS
Re: Issue 547869 in chromium: Computing pseudo-selectors - ::-webkit-*
looks to be always considered as not invalid
Re: Issue 516805 in chromium: CSS transform transition causes flicker (when
filters are present?)
Re: Issue 229160 in chromium:
radial-gradient-with-outstanding-focalPoint.svg baseline is different on
WebKit and Chromium platforms
Issue 548000 in chromium: Race condition in timeline start/stop code
Re: Issue 442526 in chromium: Stability.ExitFunnel.* histograms must die in
fire
Re: Issue 459070 in chromium: fast/layers/normal-flow-hit-test.html fails
when elementsFromPoint[0] is used instead of elementFromPoint
Re: Issue 527130 in chromium: Address bar becomes unresponsive when css or
javascript animations are running
Re: Issue 464187 in chromium: Android NTP (phone) makes it easy to mis-tap
on it's #3 & #4 most visited
Re: Issue 547424 in chromium: console.time does not return sub-millisecond
values
Re: Issue 547987 in chromium: Rietveld JS tests aren't run on infra.git
trybots
Re: Issue 463400 in chromium: DCHECK fail at stress test on quic_server_bin
Re: Issue 546491 in chromium: MemoryInfra: malloc dump provider reports
only allocated objects for tcmalloc
Re: Issue 547987 in chromium: Rietveld JS tests aren't run on infra.git
trybots
Re: Issue 547999 in chromium: graphics_KhronosGLCTSChrome: Fail to locate
khronos_glcts_test_expectations.txt
Re: Issue 461257 in chromium: css transitions of elements in a container
with overflow auto and border radius not working
Re: Issue 547999 in chromium: graphics_KhronosGLCTSChrome: Fail to locate
khronos_glcts_test_expectations.txt
Re: Issue 543918 in chromium: "Styles" can't be selected if any child node
is being modified (sometimes not even modified)
Re: Issue 547635 in chromium: V8_USE_EXTERNAL_STARTUP_DATA not defined in
content/public/common/content_descriptors.h on GN
Re: Issue 541493 in chromium: Text shifting when using word-break:
break-all or keep-all on RTL Arabic text
Re: Issue 500934 in chromium:
__v8_run_mksnapshot___build_toolchain_win_clang_x64__rule fails on
win/clang/gn bot after v8 roll
Re: Issue 546481 in chromium: SyntaxError when trying to use Pretty Print
Re: Issue 522554 in chromium: Send Safe Browsing pings for
(extended-reporting || UMA) users
Re: Issue 547824 in chromium: Group of CSS selectors should be invalid if
any selector in the group is invalid
Re: Issue 546535 in chromium: Overlayed Canvas don't draw correctly on
soundcloud.com (only on Windows)
Re: Issue 466879 in chromium: chrome.DesktopCapture 'screen' is very low
performance
Re: Issue 547664 in chromium: Regression : Weird overlapping of long
pattern link text is seen on "Blackbox" text in devtools.
Re: Issue 546882 in chromium: Regression:[DevTools]UI issue is seen
under 'Workspace' section on 'Settings' page.
Re: Issue 543426 in chromium: Regression : Vertical scroll bar is missing
in "Edit file system" overlay of devtools after adding multiple paths.
Re: Issue 547995 in chromium: Email ID need to be typed twice for the
first login
Re: Issue 547995 in chromium: Email ID need to be typed twice for the
first login
Re: Issue 470697 in chromium: content/browser/frame_host/debug_urls.cc bad
use of transition_type
Re: Issue 436161 in chromium: browser_tests failure in linux64_trunk 8011
builder
Re: Issue 484261 in chromium: Proposal: implement
devtoolsConsoleHooks.rewriteEvaluate
Re: Issue 547970 in chromium: cronet: Only deprecate things after there are
0 clients left in Chromium
Issue 548001 in chromium: "process_dumps" is flaky
Re: Issue 546559 in chromium: background-image-interpolation.html and
webkit-mask-image-interpolation.html crashing on oilpan builds
Re: Issue 484812 in chromium: Omnibox - paste a URL into the omnibox and
press go. The transition should be LINK, not typed.
Re: Issue 369490 in chromium: Telemetry should take a screenshot upon
exception
Re: Issue 500736 in chromium: Add dEQP-GLES2 tests to GPU FYI bot
Re: Issue 479990 in chromium: Run drawElements tests on chromium.gpu.fyi
waterfall
Issue 548002 in chromium: UpdateClientImpl::~UpdateClientImpl is not called
when tasks are pending
Re: Issue 516805 in chromium: CSS transform transition causes flicker (when
filters are present?)
Re: Issue 547970 in chromium: cronet: Only deprecate things after there are
0 clients left in Chromium
Re: Issue 229756 in chromium: Look into the performance issues of
http://dashboard.empulso.com
Issue 548003 in chromium: Screen flashes multiple times when
entering/exiting fullscreen mode in Remoting Android client
Re: Issue 547786 in chromium:
MultiThreadedProxyResolverTest.SingleThread_Basic flaky on Android
Issue 548005 in chromium: net_unittests timeouts in EndToEndTests on
chromeos/linux valgrind bots
Re: Issue 534586 in chromium: Opening New Window Makes Chrome Disappear;
Rebooting Only Recourse
Re: Issue 487225 in chromium: Form HTTP Extensions
Re: Issue 519051 in chromium: Black on white text gets a halo/fringe when
selected
Re: Issue 500934 in chromium:
__v8_run_mksnapshot___build_toolchain_win_clang_x64__rule fails on
win/clang/gn bot after v8 roll
--
--
Automated mail from issue updates at http://crbug.com/
Subscription options: http://groups.google.com/a/chromium.org/group/chromium-bugs

To unsubscribe from this group and stop receiving emails from it, send an email to chromium-bugs+***@chromium.org.
c***@googlecode.com
2015-10-27 17:05:02 UTC
Permalink
Your project notifications generated too many emails to send
individually. Here are the subject lines of the emails you would have
received:

Re: Issue 547583 in chromium: Forced Re-enrollment Not Consistent / Allows
for Engagement in Developer Mode
Re: Issue 510819 in chromium: Browser zoom displaces a foreignObject in svg
element
Re: Issue 547959 in chromium: 26%-70.7% regression in
session_restore.cold.typical_25 at 355997:356002
Re: Issue 547912 in chromium: New shaping code exposes slow AAT shaping -
16.5%-197.7% regression in blink_perf.parser at 355785:355812
Re: Issue 547568 in chromium: supervised user loses password on chromebox
Re: Issue 501655 in chromium: When drag-and-dropping, dropEffect not
updated; allowedEffects incorrectly updated
Re: Issue 507827 in chromium: SVG pass-through (mix-blend-mode:normal, not
isolated) renders incorrectly
Re: Issue 503835 in chromium: Chrome+WebRTC support for Capture using
GpuMemoryBuffers in Win
Re: Issue 440463 in chromium: Make ServiceWorker and PlzNavigate play well
together.
Re: Issue 506562 in chromium: Referencing a SVG using <img> and <view>
breaks background-image/-position technique
Re: Issue 538144 in chromium: Unable to sign in again when the existing
session becomes invalid
Issue 548235 in chromium: Intl timezone returning wrong timezones
Re: Issue 476397 in chromium: Feature Request: IPSEC VPN Split Tunnel
Support (Forwarding Routes)
Re: Issue 336734 in chromium: page load hangs with "Waiting for cache..."
message
Re: Issue 505868 in chromium: Printing SVG Images With Transparent
Background Displays All Black
Re: Issue 548022 in chromium: Can't build on OSX (El Cap, XCode
7): "redefinition of enumerator 'NSPressureBehaviorUnknown'"
Re: Issue 548185 in chromium: Build with 10.11 SDK broken after
https://codereview.chromium.org/1426463002
Issue 548236 in chromium: Background page is anactive
Re: Issue 450229 in chromium: Text with empty content causes getBBox of
whole drawing start from 0,0
Issue 548237 in chromium: Html5 Drag and Drop Meta Key not working
Re: Issue 532930 in chromium: bluetooth: getPrimaryService returns null
while service exists
Re: Issue 500934 in chromium:
__v8_run_mksnapshot___build_toolchain_win_clang_x64__rule fails on
win/clang/gn bot after v8 roll
Re: Issue 465719 in chromium: Scrolling breaks when changing visibility
then removing 'pointer-events:none'
Re: Issue 547127 in chromium: update_engine ASAN failures
Re: Issue 500934 in chromium:
__v8_run_mksnapshot___build_toolchain_win_clang_x64__rule fails on
win/clang/gn bot after v8 roll
Re: Issue 498285 in chromium: SVG graph by ExtJS javascript library no more
render at the first time
Re: Issue 548196 in chromium: ANGLE trybots are unable to unapply patches
Re: Issue 490140 in chromium: SVG systemLanguage switch should reflect
user's preferred content languages
Re: Issue 490984 in chromium: Improve GPU test coverage on Android
Re: Issue 546160 in chromium: FileReader.prototype.result returns a new
reference on each access
Re: Issue 543841 in chromium: Crash in
CookieMonster::GetAllCookiesForURLWithOptions
Re: Issue 548189 in chromium: Mac Builder failing every other compile on
chromium.perf
Re: Issue 165854 in chromium: chrome.tabs.onUpdated firing when iframe URL
change
Re: Issue 475966 in chromium: SVG rasterization for arcs and curves changes
when containing iframe enters/leaves compositing mode
Re: Issue 542682 in chromium: Android One and Samsung Galaxy S5 - Exception
creating new tab
Re: Issue 548189 in chromium: Mac Builder failing every other compile on
chromium.perf
Re: Issue 510485 in chromium: GN: Fix unittests not passing on Android
Re: Issue 546686 in chromium: WebGL reports context lost on shader
compilation
Re: Issue 510485 in chromium: GN: Fix unittests not passing on Android
Re: Issue 546464 in chromium: Alt not working for special keyboard
Re: Issue 546686 in chromium: WebGL reports context lost on shader
compilation
Re: Issue 546464 in chromium: Alt not working for special keyboard
Re: Issue 475795 in chromium: [Merge] Minimum font size pref breaks SVG
text very badly
Re: Issue 474523 in chromium: Setting back to default values incase of
invalid SVG<length> units
Re: Issue 546686 in chromium: WebGL reports context lost on shader
compilation
Re: Issue 469196 in chromium: svg animations don't run at 60fps in img and
css background image
Re: Issue 532518 in chromium: 3.2%-3.3% regression in browser_tests at
348644:348663
Re: Issue 546968 in chromium: Unreachable code in src/compiler/verifier.cc
Re: Issue 510002 in chromium: Several storage tests flake on XP
Issue 548245 in chromium: JavaScript can prevent some floating selection
popups, but not all
Issue 548244 in chromium: Intl returning wrong Iana timezones for Mexico
Re: Issue 467308 in chromium: foreignObject transform is not applied for
stacked context
Re: Issue 548189 in chromium: Mac Builder failing every other compile on
chromium.perf
Re: Issue 453722 in chromium: SVG "clip-path" property chooses the wrong
element, when multiple elements have a matching ID
Re: Issue 541145 in chromium: soundcloud widgets displayed in feedly cause
a crash when played
Re: Issue 543909 in chromium: Disconnecting USB audio while HTML5 video is
playing kills the stream
Re: Issue 548198 in chromium: deleting from autocomplete doesn't seem to
work
Re: Issue 545683 in chromium: PageSerializer uses normalizeAndEncode
Issue 548247 in chromium: chrome.hid seems to slow down
Re: Issue 541145 in chromium: soundcloud widgets displayed in feedly cause
a crash when played
Re: Issue 450894 in chromium: SVG in <img> tag not displaying
Re: Issue 548005 in chromium: net_unittests timeouts in EndToEndTests on
chromeos/linux valgrind bots
Re: Issue 466200 in chromium: Avoid repainting when svg image view is not
really changed
Re: Issue 547815 in chromium: sandbox_linux_jni_unittests does not pass
using GYP
Re: Issue 548189 in chromium: Mac Builder failing every other compile on
chromium.perf
Re: Issue 548079 in chromium: display stops updating
Re: Issue 527633 in chromium: Search google for this image
Re: Issue 547959 in chromium: 26%-70.7% regression in
session_restore.cold.typical_25 at 355997:356002
Re: Issue 545466 in chromium: [Regression]: Camera LED is seen turned on
even after selecting any other profile picture.
Re: Issue 529939 in chromium: CQ for the Syzygy bots
Re: Issue 547100 in chromium: [chameleon_audio] peppy
audio_AudioBasicBluetoothPlayback/record suspend failed with "Got 1
unexpected NodesChanged signal"
Re: Issue 530322 in chromium: Renderer crashes while DevTools is open
Re: Issue 545118 in chromium: Add experimental configuration options to
CronetEngine.Builder.
Issue 548248 in chromium: Check failed in renderer_data_memoizing_store.h
Re: Issue 545466 in chromium: [Regression]: Camera LED is seen turned on
even after selecting any other profile picture.
Re: Issue 548028 in chromium: Omnibox autocomplete sometimes loads
www.<text>.com instead of the match for <text>
Re: Issue 546411 in chromium: WebGL2:no 3D texture layer attachment to FBO
Re: Issue 517170 in chromium: Property trees should skip subtrees with
uninvertible screen-space transforms
Re: Issue 546411 in chromium: WebGL2:no 3D texture layer attachment to FBO
Re: Issue 541145 in chromium: soundcloud widgets displayed in feedly cause
a crash when played
Issue 548250 in chromium: Should enable "b" sysrq hotkey, at least on
Chromeboxes
Re: Issue 527772 in chromium: 3.2% regression in
page_cycler.tough_layout_cases at 346657:346733
Re: Issue 541199 in chromium: win_xp_perf_bisect bots fail at 'Gathering
Reference Values' step
Re: Issue 492871 in chromium: [root layer scrolls] Main frame and initial
containing block may differ in size
Issue 548251 in chromium: Html5 Drag and Drop cannot override default
dropEffect for modifier keys.
Issue 548252 in chromium: Flaky infra_internal commit queue test
Re: Issue 500624 in chromium: Improve default tile size to have better
performance
Re: Issue 516787 in chromium: Typing "servername.domain.local" into the
addressbar triggers a search and not a dns lookup
Re: Issue 548189 in chromium: Mac Builder failing every other compile on
chromium.perf
Re: Issue 546654 in chromium: Developer Feature: Add Debug Accelerators to
Toggle Touchscreen/Touchpad On or Off
Re: Issue 547970 in chromium: cronet: Only deprecate things after there are
0 clients left in Chromium
Re: Issue 498439 in chromium: TileManager notifications should handle
reentrancy in a cleaner way
Re: Issue 513048 in chromium: DOMUtils.clickNode and longPressNode can fail
if element is offscreen
Re: Issue 532908 in chromium: Rt.Click doesn't work when composing mail in
MAC Retina
Re: Issue 425102 in chromium: Convert compositor's layer-based tests to
create virtual viewport layers
Re: Issue 147294 in chromium: Enable all aspects of scissoring/partial swap
on Android
Re: Issue 546464 in chromium: Alt not working for special keyboard
Re: Issue 345416 in chromium: Rewrite FPS counter and other visual cc debug
features
Re: Issue 472842 in chromium: Implement layerization in Blink post-paint
Re: Issue 513700 in chromium: Design and implement composited layerization
adjustments in the impl thread
Re: Issue 508976 in chromium: Update Property Trees on Compositor Thread
after Render Surfaces are determined
Re: Issue 545678 in chromium: Audit all uses of normalizeAndEncode()
--
--
Automated mail from issue updates at http://crbug.com/
Subscription options: http://groups.google.com/a/chromium.org/group/chromium-bugs

To unsubscribe from this group and stop receiving emails from it, send an email to chromium-bugs+***@chromium.org.
c***@googlecode.com
2015-10-27 17:25:13 UTC
Permalink
Your project notifications generated too many emails to send
individually. Here are the subject lines of the emails you would have
received:

Re: Issue 539901 in chromium: Could we include the TraceConfig json in the
metadata of the trace?
Re: Issue 420598 in chromium: Regression: The blue highlight gets stuck on
any random month or year of the dropdown list in Windows 8 / Chrome OS mode.
Issue 548257 in chromium: multiple canaries failing paygen stage
Re: Issue 530322 in chromium: Renderer crashes while DevTools is open
Re: Issue 407158 in chromium: Remove --disable-gpu-compositing flag
Re: Issue 350141 in chromium: Remove --enable-software-compositing flag and
--disable-gpu-compositing
Re: Issue 547643 in chromium: HTTP2 is no longer enabled on Chrome Dev for
Android
Re: Issue 489515 in chromium: Display::Draw or Display Scheduler should not
rely on ForceReclaimResources
Issue 548258 in chromium: Default hangouts app is invalid
Re: Issue 487786 in chromium: Increase about:gpu accuracy wrt runtime GL
failures
Re: Issue 486598 in chromium: Implement compositor thread timing and memory
measurements for slimming paint phase 2
Re: Issue 246861 in chromium: Make OutputSurface base class abstract
Re: Issue 484808 in chromium: Add traces to help debug a issues with the
iterators
Re: Issue 529883 in chromium: Right Alt ignored in omnibox
Issue 548259 in chromium: Password manager UI has 2 ways to link to
passwords.google.com
Re: Issue 362164 in chromium: Remove legacy software mode
Re: Issue 518070 in chromium: Files app: Cannot save file by clicking Enter
key, after changing directory
Re: Issue 350204 in chromium: Pepper should use two textures instead of
magic double buffered single texture
Re: Issue 546160 in chromium: FileReader.prototype.result returns a new
reference on each access
Re: Issue 482179 in chromium: Audit LTH ThreadProxy-only tests to see which
ones can work with SingleThreadProxy
Re: Issue 546160 in chromium: FileReader.prototype.result returns a new
reference on each access
Re: Issue 124328 in chromium: Block the UI thread during GetBackingStore
until we receive a properly sized frame
Re: Issue 138886 in chromium: Make frame_rate_tests run with threaded
compositor
Re: Issue 548081 in chromium: Download notification bounces up and down
when the
Re: Issue 545924 in chromium: Failed to decode downloaded font:
(proprietary_font.woff) OTS parsing error: invalid version tag
Issue 548261 in chromium: Fix host to report error to the client when
failing to initialize session.
Re: Issue 547959 in chromium: 26%-70.7% regression in
session_restore.cold.typical_25 at 355997:356002
Re: Issue 547202 in chromium: Chrome no longer works with page heap
Re: Issue 334090 in chromium: Surfaces implementation tracking bug
Re: Issue 548081 in chromium: Download notification bounces up and down
when the
Re: Issue 529883 in chromium: Right Alt ignored in omnibox
Issue 548262 in chromium: Devtools UI: Zoom out breaks search layout
Re: Issue 543334 in chromium: Client doesn't handle the case when the
connection is rejected by the host.
Re: Issue 478763 in chromium: ☂ Port all BCKSF used by iOS to BSKSF
Re: Issue 470272 in chromium: Ensure property trees don't regress
performance.
Re: Issue 529883 in chromium: Right Alt ignored in omnibox
Re: Issue 478727 in chromium: Create a version of the draw_properties
benchmark that always rebuilds property trees
Re: Issue 469175 in chromium: Replace RequiresHighResToDraw with scheduler
WaitForReadyToDraw.
Re: Issue 459786 in chromium: Remove surface checks from transform trees
Re: Issue 547929 in chromium: Chrome crashes (aw snap) intermittently
Re: Issue 260819 in chromium: Window transparency: Restrict window
transparency to at least a minimum level of opacity at composite-time
Re: Issue 536586 in chromium: Distorted video-out on samus when docked to
external monitor
Re: Issue 440790 in chromium: Fragmented identifier in svg sprites don't
works
Re: Issue 548257 in chromium: multiple canaries failing paygen stage
Re: Issue 442480 in chromium: Can we avoid layout when LayoutSVGRoot's 3D
transformation is changed?
Re: Issue 538675 in chromium: remove toolchain major bot from the waterfall
Re: Issue 532771 in chromium: Add 1080p YUV video for HW encoder test
Re: Issue 333619 in chromium: HTML video YV12 decoding is incorrect at HD
resolutions
Re: Issue 504773 in chromium: WebGL video test flakiness on Android
Re: Issue 442480 in chromium: Can we avoid layout when LayoutSVGRoot's 3D
transformation is changed?
Re: Issue 428397 in chromium: Investigate using random delays to weed out
scheduling bugs
Issue 548263 in chromium: Add an entry to the trooper playbook for
deploying infra_python
Re: Issue 548259 in chromium: Password manager UI has 2 ways to link to
passwords.google.com
Re: Issue 547959 in chromium: 26%-70.7% regression in
session_restore.cold.typical_25 at 355997:356002
Re: Issue 548257 in chromium: multiple canaries failing paygen stage
Re: Issue 109587 in chromium: Pasting lots of text to a textarea is slow
Re: Issue 499555 in chromium: WebGL conformance tests failing on new
Android bots
Re: Issue 520638 in chromium:
WebglConformance.conformance_textures_misc_texture_npot_video flaky on
nexus 6 gpu bot
Re: Issue 428395 in chromium: Investigate using random delays to weed out
scheduling bugs
Re: Issue 462107 in chromium: svg in html: using viewBox the Element won't
become smaller in its width than the initial setting was
Re: Issue 504773 in chromium: WebGL video test flakiness on Android
Re: Issue 428397 in chromium: Investigate using random delays to weed out
scheduling bugs
Re: Issue 74209 in chromium: Pepper needs a way to specify that it wants
OpenGL content to be composited as RGB not RGBA even though the backbuffer
is RGBA
Re: Issue 363772 in chromium: Remove ForceCompositingMode and
AcceleratedCompositingEnabled
Re: Issue 231016 in chromium: Save all layer properties that can be mutated
during paint.
Re: Issue 230291 in chromium: Track Compositor CPU statistics in automated
tests
Re: Issue 450368 in chromium: marker-end not correctly rotated when last
segment of path is curved
Re: Issue 229742 in chromium: Commit-less update of renderer contents in
browser compositor
Re: Issue 229744 in chromium: Remove use of SingleThreadProxy in renderers
Re: Issue 229774 in chromium: Move ContentShell to ThreadedCompositor
Re: Issue 119862 in chromium: Remove the flag --disable-threaded-animation
Re: Issue 359249 in chromium: GN: Make Android build work
Re: Issue 376000 in chromium: Change gn gen to run w/ --check on the bots
by default
Re: Issue 367595 in chromium: GN: Clean up errors reported by gn check.
Re: Issue 116204 in chromium: Investigate using EXT_framebuffer_object for
rectangular blits
Re: Issue 547100 in chromium: [chameleon_audio] peppy
audio_AudioBasicBluetoothPlayback/record suspend failed with "Got 1
unexpected NodesChanged signal"
Re: Issue 271209 in chromium: Browser Compositor generates all quads in the
viewport instead of only quads in the partial swap rect
Re: Issue 324971 in chromium: offsetTop is not the best indicator of
prepaint region for js infinite scroll apps
Re: Issue 527026 in chromium: Chrome language selection highlight is
missing.
Re: Issue 521040 in chromium: md-settings internet page
Re: Issue 547100 in chromium: [chameleon_audio] peppy
audio_AudioBasicBluetoothPlayback/record suspend failed with "Got 1
unexpected NodesChanged signal"
Issue 548264 in chromium: 3.4% regression in page_cycler.morejs at
355816:355941
Re: Issue 548264 in chromium: 3.4% regression in page_cycler.morejs at
355816:355941
Re: Issue 543828 in chromium: MediaRecorder.start(int timeslice) needs to
actually implement the timeslice functionality
Re: Issue 322873 in chromium: Clip RenderSurface textures to the viewport
Re: Issue 543838 in chromium: MediaRecorder.requestData() not implemented
in MediaRecorder
Re: Issue 546968 in chromium: Unreachable code in src/compiler/verifier.cc
Re: Issue 530322 in chromium: Renderer crashes while DevTools is open
Re: Issue 548257 in chromium: multiple canaries failing paygen stage
Re: Issue 167765 in chromium: Zoom per tab and window
Re: Issue 547959 in chromium: 26%-70.7% regression in
session_restore.cold.typical_25 at 355997:356002
Re: Issue 547987 in chromium: Rietveld JS tests aren't run on infra.git
trybots
Re: Issue 545939 in chromium: Back navigation is not proper
on 'www.allbankcare.in'
Re: Issue 229744 in chromium: Remove use of SingleThreadProxy in renderers
Re: Issue 229759 in chromium: Enable threaded compositor on linux
Re: Issue 513368 in chromium: 11.6% regression in blink_perf.svg at
338694:338767
Re: Issue 546968 in chromium: Unreachable code in src/compiler/verifier.cc
Re: Issue 229774 in chromium: Move ContentShell to ThreadedCompositor
Re: Issue 548095 in chromium: Regression: Unwanted options is seen for
downloaded page of chrome://downloads.
Re: Issue 501792 in chromium: Regression: "Downloads.html" page looks weird
with few unnecessary contents.
Re: Issue 400091 in chromium: Allow building Chrome on Mac with libc++
Re: Issue 285777 in chromium: Make repaint tests work with threaded
compositor
--
--
Automated mail from issue updates at http://crbug.com/
Subscription options: http://groups.google.com/a/chromium.org/group/chromium-bugs

To unsubscribe from this group and stop receiving emails from it, send an email to chromium-bugs+***@chromium.org.
c***@googlecode.com
2015-10-27 20:12:52 UTC
Permalink
Your project notifications generated too many emails to send
individually. Here are the subject lines of the emails you would have
received:

Re: Issue 524619 in chromium: use throbber_{small,medium}.svg instead of
polymer's paper-spinner?
Issue 548323 in chromium: [BIG]: Asus Monitor is not working with Big
Re: Issue 369490 in chromium: Telemetry should take a screenshot upon
exception
Re: Issue 524619 in chromium: use throbber_{small,medium}.svg instead of
polymer's paper-spinner?
Re: Issue 546625 in chromium: SSH Into DUTs from Telemetry fails with DNS
failure in a small but not insignificant % of attempts.
Re: Issue 546625 in chromium: SSH Into DUTs from Telemetry fails with DNS
failure in a small but not insignificant % of attempts.
Re: Issue 169669 in chromium: Installer clutters start menu with rarely
used uninstaller shortcut
Re: Issue 424969 in chromium: SVG elements dispatched to g elements are
grouping event targets inside g element
Re: Issue 504928 in chromium:
WizardControllerProxyAuthOnSigninSuite/WizardControllerProxyAuthOnSigninTest.ProxyAuthDialogOnSigninScreen/1
flaky
Re: Issue 517502 in chromium: 6.1%-28.8% regression in
smoothness.gpu_rasterization.tough_filters_cases at 341472:341671
Re: Issue 541538 in chromium: Connection info popup overlapped with
cetificate page info
Re: Issue 424273 in chromium: SVG text's transparent box overlaps clickable
shape, disabling click
Re: Issue 487863 in chromium: Changed my secondary accounts picture, and it
hasn't changed on Samus
Re: Issue 491424 in chromium: Update Chrome to Windows 10 SDK
Re: Issue 418968 in chromium: SVG viewBox attribute and events
Re: Issue 489679 in chromium: "Never translate" does not work for pages
that are in a language that is not English or the system language
Re: Issue 128397 in chromium: Promote every fixed-position element to a
composited layer
Re: Issue 489679 in chromium: "Never translate" does not work for pages
that are in a language that is not English or the system language
Re: Issue 427650 in chromium: Customizing SVG viewBox via fragment ID does
not result in new intrinsic ratio
Re: Issue 326105 in chromium: User image picker in settings behaves badly
on manually uploaded pics.
Re: Issue 470272 in chromium: Ensure property trees don't regress
performance.
Re: Issue 544330 in chromium: Compile errors are now several screenfuls
away from the bottom of the compile logs on the bots
Re: Issue 504863 in chromium: Bulk Reports: Dynamically resize the
ringbuffer with the # of processes
Issue 548325 in chromium: Pick clients to port to TBM 2.0
Re: Issue 478237 in chromium: Timeline Based Measurement 2.0 that allows
telemetry to reuse perf insight mappers
Re: Issue 466890 in chromium: Use Crashpad instead of Breakpad in Mac
content_shell, and remove crash_component_breakpad_mac_to_be_deleted
Issue 548326 in chromium: No data received for
smoothness.key_mobile_sites_smooth from android-nexus9 since 354398
Re: Issue 548326 in chromium: No data received for
smoothness.key_mobile_sites_smooth from android-nexus9 since 354398
Re: Issue 163543 in chromium: Plumb "didLoad" state to compositor thread
tile manager and hold eventually bin until didLoad
Re: Issue 548326 in chromium: No data received for
smoothness.key_mobile_sites_smooth from android-nexus9 since 354398
Re: Issue 508270 in chromium: Source maps cache not refreshed
Re: Issue 544988 in chromium: audio tag fails to play audio that was passed
in as src="data:audio/wav;base64,..."
Re: Issue 168575 in chromium: Make vsync (and FRC) a part of OutputSurface
instead of RendererGL specific
Re: Issue 541378 in chromium: Chromium Crash on Update Layout Tree
Re: Issue 466890 in chromium: Use Crashpad instead of Breakpad in Mac
content_shell, and remove crash_component_breakpad_mac_to_be_deleted
Re: Issue 545639 in chromium: Zero copy AVDA hits a DCHECK in
texture_manager and gpu_video_decode_accelerator
Re: Issue 170804 in chromium: Improve compositor handling of tiles when
oom'd
Re: Issue 174081 in chromium: The viewport size should be a part of the
json tree dump
Re: Issue 505318 in chromium: clang/win: Consider building without
-Wno-unused-value
Re: Issue 179410 in chromium: clean up SwapBuffers complete stuff
Re: Issue 538614 in chromium: Roll Clang past 247874
Re: Issue 538614 in chromium: Roll Clang past 247874
Re: Issue 438431 in chromium: Going back to top in g+ or facebook after
opening something (e.g. photo) and using j/k
Re: Issue 547427 in chromium: Include policy hooks to GAIA login
Re: Issue 438431 in chromium: Going back to top in g+ or facebook after
opening something (e.g. photo) and using j/k
Re: Issue 202506 in chromium: Opacity changes in hover selectors should not
trigger invalidation
Re: Issue 170804 in chromium: Improve compositor handling of tiles when
oom'd
Re: Issue 481173 in chromium: Perf bisect job fails to recurse into
third_party repo (angle)
Re: Issue 356832 in chromium: Add unit tests for ThreadProxy and prefers
smoothness mode.
Re: Issue 174081 in chromium: The viewport size should be a part of the
json tree dump
Re: Issue 529658 in chromium: Chrome 45+ running in a VM with RemoteFX has
severe rendering issues
Re: Issue 538079 in chromium: Chrome App Authorization dialog clipped on
low-res or low DPI screens.
Issue 548329 in chromium: The New 'chrome.printerProvider API' Extension
doesn't Work
Re: Issue 179410 in chromium: clean up SwapBuffers complete stuff
Re: Issue 374470 in chromium: Don't always show the HUD when in continuous
repainting mode
Re: Issue 468438 in chromium: UI Paint/Compositor Cleanups
Re: Issue 338790 in chromium: FPS meter should use
BeginFrameArgs::beginTime instead of now()
Re: Issue 472139 in chromium: Windows taskbar does not show when Chrome
window is maximized
Re: Issue 516213 in chromium: Chromebase browser does not compatible with
WebGL demo "Ocean Explorer"
Re: Issue 338790 in chromium: FPS meter should use
BeginFrameArgs::beginTime instead of now()
Re: Issue 428414 in chromium: Revisit whether input handling is rational
when we have two frames in flight
Re: Issue 547210 in chromium: 8% regression in v8.top_25_smooth at
354263:354282
Re: Issue 374470 in chromium: Don't always show the HUD when in continuous
repainting mode
Re: Issue 376086 in chromium: Use BeginFrame+deadline in Pepper Flash
Re: Issue 369579 in chromium: Route input directly instead of through the
compositor thread
Re: Issue 545639 in chromium: Zero copy AVDA hits a DCHECK in
texture_manager and gpu_video_decode_accelerator
Re: Issue 305264 in chromium: Support long deadlines in the deadline
scheduler
Re: Issue 443185 in chromium: Replace FakeExternalBeginFrameSource in
cc/scheduler/scheduler_unittest.cc with FakeBeginFrameSource
Re: Issue 547128 in chromium: Wildcards in AutoSelectCertificateForUrls
broke in 46
Re: Issue 276411 in chromium: Give embedder control over hardware vs
software compositing mode (aka OutputSurface for mode switching)
Re: Issue 539980 in chromium: mac_10_10_perf_bisect "Failure: Login as
facebook failed"
Re: Issue 86394 in chromium: Refactor WebGL canvas and Pepper 3D to use
RendererGLContext::CreateParentTexture
Re: Issue 123941 in chromium: Partial culling of all quad types (except
debug border)
Re: Issue 129805 in chromium: Improve class dependencies in Chrome
Compositor
Re: Issue 312832 in chromium: Long first frame leads to high latency
because of overestimated draw duration.
Issue 548330 in chromium: Rename ui::InitializeInputMethodForTesting
Re: Issue 419768 in chromium: Improve main thread throughput by enabling
main_frame_before_activation
Re: Issue 547933 in chromium: Policy to restrict consumer account sign in
from browser within Chrome OS (X-GoogApps-Allowed-Domains)
Re: Issue 356876 in chromium: Renderer can fallback to software while
browser still in Gpu compositing mode (Allow context creation on compositor
thread)
Re: Issue 537696 in chromium: Bisect: Wiggle commits to reuse builds.
Re: Issue 547419 in chromium: 'Show in folder' option doesn't call file
browser with downloaded file name selected
Re: Issue 369490 in chromium: Telemetry should take a screenshot upon
exception
Re: Issue 356876 in chromium: Renderer can fallback to software while
browser still in Gpu compositing mode (Allow context creation on compositor
thread)
Re: Issue 276411 in chromium: Give embedder control over hardware vs
software compositing mode (aka OutputSurface for mode switching)
Issue 548333 in chromium: Extension reload should not be synced.
Re: Issue 547965 in chromium: Check failed: item.length() !=
std::numeric_limits<uint64>::max()
Re: Issue 129805 in chromium: Improve class dependencies in Chrome
Compositor
Re: Issue 381920 in chromium: MediaGalleries copyTo failing -
InvalidModificationError
Re: Issue 545639 in chromium: Zero copy AVDA hits a DCHECK in
texture_manager and gpu_video_decode_accelerator
Issue 548334 in chromium: "Noisy test" alerts for per-page sheriff rotation
1
Re: Issue 548334 in chromium: "Noisy test" alerts for per-page sheriff
rotation 1
Re: Issue 545639 in chromium: Zero copy AVDA hits a DCHECK in
texture_manager and gpu_video_decode_accelerator
Re: Issue 524142 in chromium: Make sure impl-thread property trees don't
regress performance
Re: Issue 231345 in chromium: reading Blob includes non-existent file
doesn't throw NotFound error
Re: Issue 547995 in chromium: Email ID need to be typed twice for the
first login
Re: Issue 446671 in chromium: requestAnimationFrame not fulfilled when
animated gif on top of large canvas
Re: Issue 547210 in chromium: 8% regression in v8.top_25_smooth at
354263:354282
Re: Issue 547658 in chromium: [Devtools]Regression:Permission bubbles
remain even after clicking on allow option
Re: Issue 547995 in chromium: Email ID need to be typed twice for the
first login
Re: Issue 523794 in chromium: sMenu is smaller on different account
Issue 548335 in chromium: Notify browser process of navigation_start
timestamp as soon as possible
Re: Issue 308507 in chromium: cc::Scheduler and cc::SchedulerStateMachine
unittests need impl-side-painting versions
--
--
Automated mail from issue updates at http://crbug.com/
Subscription options: http://groups.google.com/a/chromium.org/group/chromium-bugs

To unsubscribe from this group and stop receiving emails from it, send an email to chromium-bugs+***@chromium.org.
c***@googlecode.com
2015-10-27 22:16:09 UTC
Permalink
Your project notifications generated too many emails to send
individually. Here are the subject lines of the emails you would have
received:

Re: Issue 478840 in chromium: Extended SSL Interstitial for WWW hostname
mismatches
Re: Issue 548358 in chromium: PDFExtensionTest.Load failing on cros_trunk
Re: Issue 464102 in chromium: PDF table of contents auto-hides at
inopportune moments
Re: Issue 232910 in chromium: First call to animatedPathSegList is incorrect
Re: Issue 470697 in chromium: content/browser/frame_host/debug_urls.cc bad
use of transition_type
Re: Issue 548358 in chromium: PDFExtensionTest.Load failing on cros_trunk
Re: Issue 353180 in chromium: Moblab: Wmatrix
Re: Issue 548358 in chromium: PDFExtensionTest.Load failing on cros_trunk
Re: Issue 541430 in chromium: AOPEN hardware lockup while running signage
app
Re: Issue 548380 in chromium: Task manager: network usage is broken on Mac
Re: Issue 545716 in chromium: reftest.list isn't respected when running
layout tests on the bots
Re: Issue 545716 in chromium: reftest.list isn't respected when running
layout tests on the bots
Re: Issue 465432 in chromium: Android: Intermittently Missing Tab
Strip/Header in Tab-Switcher View on phone
Issue 548390 in chromium: [WP2] network_WiFi_RoamSuspendEndToEnd failure
Re: Issue 542607 in chromium: 23.5% regression in blink_perf.svg at
353086:353130
Re: Issue 527806 in chromium: 5.9% regression in page_cycler.basic_oopif at
346730:346758
Re: Issue 533693 in chromium: 12.4% regression in performance_browser_tests
at 349588:349614
Re: Issue 548390 in chromium: [WP2] network_WiFi_RoamSuspendEndToEnd failure
Re: Issue 548199 in chromium: Chrome canary update spinner never stopped
Re: Issue 232899 in chromium: Stroked patterns paint even when object
bounding box is empty
Re: Issue 484812 in chromium: Omnibox - paste a URL into the omnibox and
press go. The transition should be LINK, not typed.
Re: Issue 543401 in chromium: Sync: DeviceInfo USS initial classes
Re: Issue 547995 in chromium: Email ID need to be typed twice for the
first login
Re: Issue 231613 in chromium: SVG feConvolveMatrix does not implement
kernelUnitLength
Re: Issue 466879 in chromium: chrome.DesktopCapture 'screen' is very low
performance
Re: Issue 508675 in chromium: TouchEvent and Touch should have constructors
Re: Issue 541430 in chromium: AOPEN hardware lockup while running signage
app
Issue 548392 in chromium: Transient windows
Re: Issue 548257 in chromium: multiple canaries failing paygen stage
Re: Issue 502066 in chromium: Revised Firmware UI - Drawing
Re: Issue 337606 in chromium: Hardware decoded video is "Choppy" & Jerky
Re: Issue 548383 in chromium: DXVA decoder using Angle created device may
cause Win8 bot Flakiness
Re: Issue 495396 in chromium: Port clang style plugin tests to run on
Windows as well
Issue 548393 in chromium: Flakiness dashboard success build as failed
Re: Issue 548309 in chromium: Incorrect recursion handling in profiler
bottom up view
Re: Issue 548229 in chromium: DevTools: UA is not overridden (spoofed)
with Service Worker Inspect window open
Re: Issue 548187 in chromium: developer tools are disabled
Re: Issue 548162 in chromium: [DevTools]Unnecessary tool tip is seen
under 'Workspace' section on 'Settings' page.
Re: Issue 543273 in chromium: DevTools: Elements - Using DOM breadcrumbs
causes panel bar to be cut off
Issue 548395 in chromium: STP::LayoutAndUpdateLayers function makes round
trips through STP for no reason.
Re: Issue 533900 in chromium: Full-screen flash content (Netflix, Youtube,
etc.) has flickering playback controls on OS X
Re: Issue 548364 in chromium: Performance Regression: WebGL Performance
across boards in M47
Re: Issue 548371 in chromium: QuotaDatabase transaction handling on schema
upgrade is incorrect.
Issue 548396 in chromium: Window Animations
Re: Issue 548344 in chromium: 'PDFTestFiles_PDFExtensionTest.Load_4' test
is failing on 8011 builder.
Re: Issue 548358 in chromium: PDFExtensionTest.Load failing on cros_trunk
Re: Issue 404385 in chromium: Crash when using Ctrl+Shift+Q from "Are you
shure you want to open ZZZ tabs?" dialog
Re: Issue 548081 in chromium: Download notification bounces up and down
when the
Issue 548399 in chromium: Android Nexus6 Perf (2) purple with "Exception
steps exception gsutil download_build_product"
Re: Issue 473710 in chromium: Don't use so many inner classes for NetLog
Re: Issue 548371 in chromium: QuotaDatabase transaction handling on schema
upgrade is incorrect.
Re: Issue 547859 in chromium: Dropdowns are on wrong place when page is
touch zoomed
Re: Issue 47914 in chromium: Bookmarks for PDFs should have the PDF
document title as the name, not the url
Re: Issue 548352 in chromium: Performance Regression: WebGL Performance on
Intel-based platforms
Re: Issue 548399 in chromium: Android Nexus6 Perf (2) purple
with "Exception steps exception gsutil download_build_product"
Re: Issue 437009 in chromium: Flash ad uses excessive CPU/power, and memory
grows unbounded
Re: Issue 544330 in chromium: Compile errors are now several screenfuls
away from the bottom of the compile logs on the bots
Re: Issue 379175 in chromium: [SVG] Less ad-hoc cycle
checkers/checking/duplicate checking
Re: Issue 534817 in chromium: Possible improvements to SVG resource cycle
solving/detection/breaking
Re: Issue 539368 in chromium: Insight360 App crashes on launch
Re: Issue 548003 in chromium: Screen flashes multiple times when
entering/exiting fullscreen mode in Remoting Android client
Re: Issue 548371 in chromium: QuotaDatabase transaction handling on schema
upgrade is incorrect.
Re: Issue 453102 in chromium: Plugin opened in background tab is black
until tab is foregrounded twice
Re: Issue 544330 in chromium: Compile errors are now several screenfuls
away from the bottom of the compile logs on the bots
Re: Issue 542607 in chromium: 23.5% regression in blink_perf.svg at
353086:353130
Re: Issue 548352 in chromium: Performance Regression: WebGL Performance on
Intel-based platforms
Re: Issue 468906 in chromium: Streamline "block" plugin interface for
click-to-play purposes
Re: Issue 547859 in chromium: Dropdowns are on wrong place when page is
touch zoomed
Issue 548402 in chromium: Modal Windows
Re: Issue 548039 in chromium: Shared memory leak from
WebGraphicsContext3DCommandBufferImpl::CreateContext on drmemory bots
Re: Issue 548392 in chromium: Transient windows
Re: Issue 462986 in chromium: linux_chromeos: "Browse as Guest" crashes due
to missing command-line argument
Re: Issue 548399 in chromium: Android Nexus6 Perf (2) purple
with "Exception steps exception gsutil download_build_product"
Re: Issue 548162 in chromium: [DevTools]Unnecessary tool tip is seen
under 'Workspace' section on 'Settings' page.
Re: Issue 542191 in chromium: Can't fullscreen videos in Canary
Re: Issue 544330 in chromium: Compile errors are now several screenfuls
away from the bottom of the compile logs on the bots
Re: Issue 548399 in chromium: Android Nexus6 Perf (2) purple
with "Exception steps exception gsutil download_build_product"
Re: Issue 422796 in chromium: No screens showing when connecitng to 3
monitors on imac
Re: Issue 547416 in chromium: HBO Go broken
Re: Issue 541232 in chromium: GetUserMedia video capture: crashes when an
unsupported video resolution is requested through Camera2 API
Re: Issue 505953 in chromium: vectorize/refresh for MD all desktop icons
Re: Issue 548371 in chromium: QuotaDatabase transaction handling on schema
upgrade is incorrect.
Re: Issue 231578 in chromium: Refactoring SVG's Path datastructures
Re: Issue 457571 in chromium: Unify enrollment/add user use case to use a
single GAIA screen
Re: Issue 546812 in chromium: UI freeze and audio glitching when using
ScriptProcessorNode
Re: Issue 480043 in chromium: Add a chrome.searchEnginesPrivate API
Re: Issue 479359 in chromium: Add Search Engines settings page
Re: Issue 547416 in chromium: HBO Go broken
Re: Issue 104303 in chromium: NULL PTR crash in PDF viewer.
Re: Issue 542426 in chromium: CFI / LTO linking time for the official
Chrome is > 3 hours
Re: Issue 548364 in chromium: Performance Regression: WebGL Performance
across boards in M47
Re: Issue 424574 in chromium: Add Web Animations and dependent Polymer
components to third_party
Issue 548407 in chromium: Input Methods
Re: Issue 423776 in chromium: Host update should happen on the pairing page
Re: Issue 425627 in chromium: Update Settings to Material Design
Re: Issue 479359 in chromium: Add Search Engines settings page
Re: Issue 423771 in chromium: Make it possible to enroll from the
controller pairing page
Re: Issue 548079 in chromium: display stops updating
Re: Issue 479359 in chromium: Add Search Engines settings page
Re: Issue 120781 in chromium: Divide by zero crash in PDF rendering engine
Re: Issue 548358 in chromium: PDFExtensionTest.Load failing on cros_trunk
Re: Issue 544330 in chromium: Compile errors are now several screenfuls
away from the bottom of the compile logs on the bots
--
--
Automated mail from issue updates at http://crbug.com/
Subscription options: http://groups.google.com/a/chromium.org/group/chromium-bugs

To unsubscribe from this group and stop receiving emails from it, send an email to chromium-bugs+***@chromium.org.
c***@googlecode.com
2015-10-28 17:49:27 UTC
Permalink
Your project notifications generated too many emails to send
individually. Here are the subject lines of the emails you would have
received:

Re: Issue 545643 in chromium: Blurred Images and bad font rendering
Re: Issue 332514 in chromium: border-radius not honored on 3d accelered
child img
Re: Issue 380060 in chromium: base/md5.cc does not compile without
-fno-strict-aliasing
Re: Issue 451656 in chromium: Flag to enable mixed content blocking on
chrome-extension:// origins
Issue 548722 in chromium: Automatically constructed referrer is wrong for
android-app://
Re: Issue 524631 in chromium: MemoryInfra: Introduce a heap profiler to get
information on allocation sites
Re: Issue 469784 in chromium: Changing ChromeOS language doesn't affect
spellcheck (but does affect auto correction)
Re: Issue 411127 in chromium: Remove FFTFrame's duplicated method and
variable from each macros.
Re: Issue 146171 in chromium: Issue with execution of Audio file through
iFrame at Google App Engine
Re: Issue 545284 in chromium: DevTools: Open network requests from Origin
View
Re: Issue 370522 in chromium: CrOS Hardware Overlays
Re: Issue 548452 in chromium: use-of-uninitialized value reported in msan
bots
Re: Issue 547643 in chromium: HTTP2 is no longer enabled on Chrome Dev for
Android
Re: Issue 548693 in chromium: video_ChromeRTCHWDecodeUsed test has been
flaking since Oct 9
Re: Issue 548599 in chromium: Clank cast tests should not depend on the
internals of the support library
Re: Issue 423744 in chromium: CSS Styles Not Computing On <use> Elements
Re: Issue 157218 in chromium: border-radius clipping does not apply to
composited children
Re: Issue 373336 in chromium: Google Cloud Print - classic printer jobs get
stuck in spooler
Issue 548723 in chromium: AUTest timeout on ivybridge and slippy
Re: Issue 373336 in chromium: Google Cloud Print - classic printer jobs get
stuck in spooler
Re: Issue 547973 in chromium: Convert AccountManagerDelegate.Callback to
base.Callback
Re: Issue 507796 in chromium: Isolate and swarm telemetry tests
(telemetry_unittests, telemetry_perf_unittests, etc.)
Re: Issue 421921 in chromium: Implement Push API and Notifications in
WebView
Re: Issue 515328 in chromium: Emojis on OSX: Emojis are not displayed at
all in certain situation
Re: Issue 535212 in chromium: Latest Chrome On Mouse Over sometimes content
disappears until you mouse over on it again
Re: Issue 515328 in chromium: Emojis on OSX: Emojis are not displayed at
all in certain situation
Re: Issue 548053 in chromium: 14.3%-20.1% regression in
smoothness.top_25_smooth at 355649:355747
Re: Issue 548272 in chromium: 1.4% regression in
smoothness.tough_canvas_cases at 355935:355953
Re: Issue 548272 in chromium: 1.4% regression in
smoothness.tough_canvas_cases at 355935:355953
Re: Issue 541430 in chromium: AOPEN hardware lockup while running signage
app
Re: Issue 516805 in chromium: CSS transform transition causes flicker (when
filters are present?)
Re: Issue 547643 in chromium: HTTP2 is no longer enabled on Chrome Dev for
Android
Re: Issue 157218 in chromium: border-radius clipping does not apply to
composited children
Re: Issue 546871 in chromium: panther: git package seems corrupt while
building
Re: Issue 532142 in chromium: Make ImageBitmap Transferable
Re: Issue 359212 in chromium: ASSERTION FAILED: m_status.eor !=
OtherNeutral || m_eor.atEnd() in
WebCore::BidiResolver::checkDirectionInLowerRaiseEmbeddingLevel
Re: Issue 548505 in chromium: Screen recording app for Chrome OS for
developers
Issue 548730 in chromium: Google Music can't be muted with tab indicator
Re: Issue 548452 in chromium: use-of-uninitialized value reported in msan
bots
Re: Issue 410088 in chromium: Need to detect bot out of disk space and fix
it in an automated way
Issue 548731 in chromium: After updating the Webview via Google Play, still
the old version is used
Re: Issue 533762 in chromium: mac_blink_rel failing to compile (old SDK?)
Re: Issue 541435 in chromium: Nexus 5 and 6 continuously fail with "error:
device '<some gobbledygook>' not found"
Re: Issue 548539 in chromium: BoringSSL compile fails on iOS due to change
in range 63fa118..e189c86
Re: Issue 531783 in chromium: DIV with flex:1 inside a container that has
flex-direction:column overlap.
Re: Issue 535504 in chromium: Regression: Alignment of the bell icon is not
proper for some zoom levels.
Re: Issue 548599 in chromium: Clank cast tests should not depend on the
internals of the support library
Issue 548733 in chromium: Device does not recognize owner account
Re: Issue 481241 in chromium: Chrome OS XKB extension process is consuming
260MB of RAM (204MB of which is in JS!)
Re: Issue 475714 in chromium: Enable more pylint coverage for telemetry/ &
perf/
Issue 548734 in chromium: Sync: Conflict resolution code doesn't take into
account implicit permanent folders
Re: Issue 537603 in chromium: 25.4% regression in
session_restore.warm.typical_25 at 351277:351285
Re: Issue 546780 in chromium: my flash player use too much CPU usage
Re: Issue 548197 in chromium: Slaves offline on chromium.perf
Re: Issue 153009 in chromium: Google voice vmail playback regularly stops
working
Re: Issue 548733 in chromium: Device does not recognize owner account
Re: Issue 157993 in chromium: endless canceled http requests when playing
an mp4 in a <video> tag
Re: Issue 528521 in chromium: 1.9%-3.1% regression in
media.tough_video_cases at 345083:345142
Re: Issue 542609 in chromium: 1.4% regression in
smoothness.tough_pinch_zoom_cases at 349430:349844
Re: Issue 547427 in chromium: Include policy hooks to GAIA login
Re: Issue 546068 in chromium: Chrome EndToEnd tests failure : Timed out
going through login screen
Re: Issue 541330 in chromium: Sync min backoff interval is way too long
Re: Issue 541330 in chromium: Sync min backoff interval is way too long
Re: Issue 535755 in chromium: Omnibox sometimes refuses to accept valid
URLs, will only allow a search
Re: Issue 234014 in chromium: Alpha compositing incorrect with small canvas
Re: Issue 545466 in chromium: [Regression]: Camera LED is seen turned on
even after selecting any other profile picture.
Re: Issue 538276 in chromium: Camera icon is not loading after deleting the
existing photo
Re: Issue 545466 in chromium: [Regression]: Camera LED is seen turned on
even after selecting any other profile picture.
Re: Issue 527451 in chromium: 5.4% regression in
session_restore.warm.typical_25 at 346692:346729
Issue 548739 in chromium: split out ADBHost into two classes and create new
test bed class
Re: Issue 536122 in chromium: 1.1%-4.7% regression in
storage.indexeddb_endure at 350148:350201
Re: Issue 421921 in chromium: Implement Push API and Notifications in
WebView
Re: Issue 546116 in chromium: PageLoadMetrics Observer API
Re: Issue 548019 in
chromium: "WebglConformance.conformance_extensions_angle_instanced_arrays"
is flaky
Re: Issue 548684 in chromium: bookmarks with long URLs not syncing across
devices
Re: Issue 547184 in chromium: 10.5%-11.1% regression in
blink_perf.shadow_dom at 355553:355577
Re: Issue 548687 in chromium: Chrome crashes when clicking a link which
opens a new tab
Re: Issue 547184 in chromium: 10.5%-11.1% regression in
blink_perf.shadow_dom at 355553:355577
Re: Issue 547494 in chromium: Credentials not updated on change
Re: Issue 536843 in chromium: Make AudioRendererImpl and Pipeline use the
output device's parameters
Re: Issue 95738 in chromium: Need a system-wide high-resolution timer
Re: Issue 536122 in chromium: 1.1%-4.7% regression in
storage.indexeddb_endure at 350148:350201
Re: Issue 451965 in chromium: Mouse Dissappears. Touch Screen Works
Re: Issue 490876 in chromium: FR: Display System Information on Recovery
Screen
Re: Issue 536843 in chromium: Make AudioRendererImpl and Pipeline use the
output device's parameters
Re: Issue 546920 in chromium: Regression on Chrome & Flash enumerating
webcam & microphone devices - lists are empty
Re: Issue 548700 in chromium: Stopping media playback via the media
notification can make the website unusable
Re: Issue 512071 in chromium: Move synced_session_tracker to the
sync_driver component
Re: Issue 512468 in chromium: Componentize
chrome/browser/sync/glue/synced_session_util
9 issues changed in chromium
Re: Issue 548569 in chromium: Chrome doesn't import search engine shortcuts
properly from Firefox (there known as "keywords")
Issue 548742 in chromium: Android: Implement tab and origin scope joining
for the Cast-based PresentationAPI implementation
Re: Issue 512471 in chromium: Componentize
chrome/browser/sync/glue/synced_tab_delegate
Re: Issue 548688 in chromium: Searching "Google" in the omnibox
suggests "http://google/" which is not a valid URL (Webpage not available)
Re: Issue 548572 in chromium: Regression : Browser Crash is seen On
Clicking any Link after signing into the account
Re: Issue 548688 in chromium: Searching "Google" in the omnibox
suggests "http://google/" which is not a valid URL (Webpage not available)
Issue 548743 in chromium: [Cast, Presentation API, Android] Decouple the
Cast session from Media Routes
Issue 548744 in chromium: Disable Audio Output Devices API on Android
Re: Issue 548744 in chromium: Disable Audio Output Devices API on Android
Re: Issue 547390 in chromium: Several layout tests fail on Win and Mac
after shaping segmentation CL
Re: Issue 543847 in chromium: SIGNED IBTO NY ACCOUNT FROM WORK LAPTOP
Re: Issue 88072 in chromium: Extension TTS API platform implementations
need to support SSML
--
--
Automated mail from issue updates at http://crbug.com/
Subscription options: http://groups.google.com/a/chromium.org/group/chromium-bugs

To unsubscribe from this group and stop receiving emails from it, send an email to chromium-bugs+***@chromium.org.
c***@googlecode.com
2015-10-29 20:56:53 UTC
Permalink
Your project notifications generated too many emails to send
individually. Here are the subject lines of the emails you would have
received:

Re: Issue 547286 in chromium: Do not discard tabs with PDFs that have forms
Re: Issue 548539 in chromium: BoringSSL compile fails on iOS due to change
in range 63fa118..e189c86
Re: Issue 510028 in chromium: Add data volume counters to the "Clear
browsing data" dialog
Re: Issue 549084 in chromium: [Regression]:"IP address and port" is seen
chopped in chrome://inspect page
Re: Issue 545331 in chromium: Regression : [Devtools] Unable to traverse
the focus by hitting tab in settings page.
Re: Issue 546892 in chromium: Regression : [Devtools] Default focus is not
seen on "add custom profile" button in settings page.
Re: Issue 548094 in chromium: Regression : Settings page does not close on
hitting esc key from keyboard.
Re: Issue 549084 in chromium: [Regression]:"IP address and port" is seen
chopped in chrome://inspect page
Re: Issue 546485 in chromium: Admin SDK methods (Directory API) doesn't
cover "Chromebox for meetings"
Re: Issue 148501 in chromium: Threaded scrolling when dragging on scrollbar
Issue 549274 in chromium: HostDiscardableSharedMemoryManager crashes when
calling ThreadTaskRunnerHandle::Get() from worker thread
Re: Issue 406118 in chromium: [Mirror] "You're now signed in to Chrome"
message is not displayed when signed in from the user menu [OSX only]
Re: Issue 546091 in chromium: Secondary Display Does Not Support Bookmark
Drop Downs Properly
Re: Issue 547143 in chromium: make sure all vector icons are theme aware
Re: Issue 548196 in chromium: ANGLE trybots are unable to unapply patches
Re: Issue 408404 in chromium: Unable to load online-voice-recorder with new
flash
Re: Issue 544897 in chromium: Text is seen clipped downwards in some pages
Re: Issue 546861 in chromium: Cannot view half of forge of empires game
Re: Issue 148501 in chromium: Threaded scrolling when dragging on scrollbar
Re: Issue 531974 in chromium: <select> element only partially rendered
Issue 549275 in chromium: Unable to open a link in a specific profile from
the command line (OSX)
Re: Issue 529940 in chromium: IPC::ChannelReader's buffer grows but never
shrinks
Re: Issue 531974 in chromium: <select> element only partially rendered
Re: Issue 547186 in chromium:
LayerTreeHostTimelinesTestSetPotentiallyAnimatingOnLacDestruction is flaky
Re: Issue 548684 in chromium: bookmarks with long URLs not syncing across
devices
Re: Issue 405045 in chromium: Error message:Service unavailable, try again
later
Re: Issue 548094 in chromium: Regression : Settings page does not close on
hitting esc key from keyboard.
Re: Issue 546892 in chromium: Regression : [Devtools] Default focus is not
seen on "add custom profile" button in settings page.
Re: Issue 545331 in chromium: Regression : [Devtools] Unable to traverse
the focus by hitting tab in settings page.
Re: Issue 167404 in chromium: Border collapse with non-integer pixel size
cells misplaces border
Re: Issue 548968 in chromium: "Configure throttling" option is not working
in Emulation section of devtools
Issue 549276 in chromium: WebURLError::domain gets lost in most hooks from
the browser process
Re: Issue 490809 in chromium: Add a "Print friendly" option to the print
preview dialog
Issue 549277 in chromium: Scrollbar repaints on every scroll frame
Re: Issue 148501 in chromium: Threaded scrolling when dragging on scrollbar
Re: Issue 549277 in chromium: Scrollbar repaints on every scroll frame
Re: Issue 404014 in chromium: Sign in for the app and within google
services does not retain session when using 2-step verif.
Re: Issue 549277 in chromium: Scrollbar repaints on every scroll frame
Re: Issue 398971 in chromium: I have to sign in to Google Chrome every
start up
Re: Issue 549265 in chromium: Filetype icons are blurry in
chrome://downloads
Re: Issue 548591 in chromium: option to show full URL or full path in
network tab requests "name" column
Issue 549278 in chromium: QUIC - delete
Net.QuicClientHelloRejectReasons.Insecure histogram
Issue 549279 in chromium: chrome.fileSystem api write warning
Re: Issue 545979 in chromium: SkBitmapOperations::CreateMaskedBitmap()
returns wrong byte ordering in some platforms.
Re: Issue 548965 in chromium: Regression : Browser does not relaunch on
using 'chrome://restart'.
Re: Issue 544153 in chromium: Mandoline perf bot: failure with
--enable-multiprocess
Re: Issue 548196 in chromium: ANGLE trybots are unable to unapply patches
Issue 549280 in chromium: cc ThreadedChannelTestCommit flaky
Re: Issue 548965 in chromium: Regression : Browser does not relaunch on
using 'chrome://restart'.
Re: Issue 548965 in chromium: Regression : Browser does not relaunch on
using 'chrome://restart'.
Re: Issue 548196 in chromium: ANGLE trybots are unable to unapply patches
Re: Issue 546091 in chromium: Secondary Display Does Not Support Bookmark
Drop Downs Properly
Issue 549281 in chromium: Can not install canary
Re: Issue 383178 in chromium: Removing and adding a second account keeps me
signed in to the first account
Re: Issue 167849 in chromium: text-rendering: optimizeLegibility breaks
hard tabs in pre elements
Re: Issue 549029 in chromium: Regression: Video fullscreen is not proper
for any videos in www.youtube.com.
Re: Issue 447898 in chromium: Chrome Garbage Collector never kicks in
Re: Issue 543377 in chromium: Implement Smart Lock sign-in protocol natively
Re: Issue 549029 in chromium: Regression: Video fullscreen is not proper
for any videos in www.youtube.com.
Issue 549283 in chromium: cc
LayerTreeHostTestBeginMainFrameTimeIsAlsoImplTime flaky
Re: Issue 549281 in chromium: Can not install canary
Re: Issue 370522 in chromium: CrOS Hardware Overlays
Re: Issue 341408 in chromium: Refactor use of
SigninManagerBase::GetAuthenticatedAccountId()
Re: Issue 124056 in chromium: Linear gradient repeated for every cell
Re: Issue 493846 in chromium: Remove enable-iframe-based-signin flag
Re: Issue 513693 in chromium: Tooltip freezes on Title-less long URL tab
mouseover
Re: Issue 516349 in chromium: Do not register Chrome's DelegateExecute on
Win10+
Re: Issue 549277 in chromium: Scrollbar repaints on every scroll frame
Issue 549285 in
chromium: "PluginPowerSaverBrowserTest.LargeCrossOriginObscured" is flaky
Issue 549286 in chromium: ec: modify i2c_port_t to take "enum i2c_freq"
rather than "int kbps"
Re: Issue 516349 in chromium: Do not register Chrome's DelegateExecute on
Win10+
Re: Issue 531974 in chromium: <select> element only partially rendered
Re: Issue 548965 in chromium: Regression : Browser does not relaunch on
using 'chrome://restart'.
Issue 549288 in chromium: linux_blink_rel is not running layout tests for
cc changes
Re: Issue 107160 in chromium: Consolidate kGoogleServicesUsername and
SigninManager's authenticated_username_
Re: Issue 549183 in chromium: Ensure Java stacks are dumped to logcat for
unhandled Java exceptions
Re: Issue 140722 in chromium: css box-shadow
Re: Issue 129019 in chromium: No field to add exceptions on
chrome://chrome/settings/content
Re: Issue 548375 in chromium: DCHECK_GE in rand_util.cc:24 fails for
certain inputs
Re: Issue 444839 in chromium: Empty camera names in Flash Player with
Google Chrome
Re: Issue 549172 in chromium: Checkboxes in Settings> Privacy> Clear
Browsing Data don't persist previous state
Re: Issue 549283 in chromium: cc
LayerTreeHostTestBeginMainFrameTimeIsAlsoImplTime flaky
Re: Issue 492544 in chromium: chrome.identity.getAuthToken showing user not
logged in in Chrome OS
Re: Issue 368298 in chromium: Implement native accessibility support for
out-of-process iframes
Re: Issue 514701 in chromium: Chrome Sign In Failure when using secondary
encryption password
Re: Issue 541265 in chromium: need an "official builder" for mandoline
Re: Issue 548026 in chromium: Chromium Mojo Windows fails 'get version'
step.
Re: Issue 548316 in chromium:
WebViewClientTest#testShouldOverrideUrlLoadingOnCreateWindow fails
constantly
Re: Issue 390254 in chromium: Accessibility Developer Tools functionality
should be built into devtools
Re: Issue 508192 in chromium: Extensions shouldn't be able to quit/restart
the browser
Re: Issue 439764 in chromium: Video decoding slow/low fps with d3d11
Re: Issue 548965 in chromium: Regression : Browser does not relaunch on
using 'chrome://restart'.
Re: Issue 141945 in chromium: Monospaced Italic Text Gains Height
Re: Issue 548124 in chromium: OTS table passthru is not working
Re: Issue 549283 in chromium: cc
LayerTreeHostTestBeginMainFrameTimeIsAlsoImplTime flaky
Issue 549289 in chromium: [Media Router] Improve MR dialog launch time
Re: Issue 548965 in chromium: Regression : Browser does not relaunch on
using 'chrome://restart'.
Re: Issue 548965 in chromium: Regression : Browser does not relaunch on
using 'chrome://restart'.
Re: Issue 503040 in chromium: Image shown like pixelated for a moment
Re: Issue 549254 in chromium: The CQ should run gn_unittests
Re: Issue 548336 in chromium: Performance Regression: System resume time on
Veyron
Re: Issue 481563 in chromium: Add network details page to md-settings
--
--
Automated mail from issue updates at http://crbug.com/
Subscription options: http://groups.google.com/a/chromium.org/group/chromium-bugs

To unsubscribe from this group and stop receiving emails from it, send an email to chromium-bugs+***@chromium.org.
c***@googlecode.com
2015-11-02 18:22:52 UTC
Permalink
Your project notifications generated too many emails to send
individually. Here are the subject lines of the emails you would have
received:

Re: Issue 525751 in chromium: Illegal instruction SIGILL on start up
Issue 550475 in chromium: Opening a new tab leaves the tab menu ui in the
OS tabs list
Re: Issue 549143 in chromium: accesskey HTML attribute does not work at all
Re: Issue 540523 in chromium: 1%-11% regression in
thread_times.key_silk_cases at 351537:352432
Re: Issue 545516 in chromium: Some mobile optimized sites not rendering as
mobile optimized in Chrome Dev Tools
Re: Issue 544160 in chromium: Chrome crashes on startup - doesn't open any
windows
Re: Issue 57641 in chromium: Can't scroll PDFs diagonally
Re: Issue 534948 in chromium: Recommended homepage policy value isn't
applied when policy is set
Re: Issue 548755 in chromium: BranchUtil failure on canary master
Re: Issue 550044 in chromium: Large performance regression 185 fps is now
25 fps
Re: Issue 487611 in chromium: Send hardware status update when kiosk/public
session starts if session reporting is enabled
Re: Issue 471061 in chromium: File finder too big -- goes off screen
Re: Issue 549998 in chromium: fread is marked as warn_unused_result on the
linux x64 bot but nowhere else
Re: Issue 549480 in chromium: Rietveld Security: dependent patchsets can
get grandfathered
Re: Issue 550204 in chromium: Chrome HTML5 Forms 2-column ScrollBox with
images
Re: Issue 546633 in chromium: Presubmit warning makes chromium_presubmit
fail
Re: Issue 550064 in chromium: Translated arc's cause visual glitches
Re: Issue 545516 in chromium: Some mobile optimized sites not rendering as
mobile optimized in Chrome Dev Tools
Re: Issue 539331 in chromium: Update password bubble overrides correct
password.
Re: Issue 547810 in chromium: Password Manager Fails to List Actual
Passwords
Re: Issue 550397 in chromium: [Regression]: Gallore app notifications do
not close via mouse click.
Re: Issue 545516 in chromium: Some mobile optimized sites not rendering as
mobile optimized in Chrome Dev Tools
Re: Issue 549149 in chromium: Failed login not recognised on
accounts.google.com
Re: Issue 20574 in chromium: Fixed-position element uses transformed
ancestor as the container
Re: Issue 470452 in chromium: "postiion:fixed" has wrong positioning if
parent element has "transform" or "perspective" css properties
Re: Issue 456535 in chromium: Many seccomp audit messages about
set_robust_list
Re: Issue 545516 in chromium: Some mobile optimized sites not rendering as
mobile optimized in Chrome Dev Tools
Re: Issue 549639 in chromium: Study the relationship between WebRTC ping
internal and the NAT binding creation
Re: Issue 547094 in chromium: rename hostOS to hostOs per the coding
guidelines.
Re: Issue 549944 in chromium: GPU process spin waits if frame takes more
than 16ms
Re: Issue 549639 in chromium: Study the relationship between WebRTC ping
internal and the NAT binding creation
Re: Issue 501048 in chromium: Omnibox won't delete trailing slash on
backspace; inline autocompletes slash.
Re: Issue 542668 in chromium: InvalidAccessError when recreating old caches
Re: Issue 529245 in chromium: Regression :Delay observed while dragging the
element in "sticky-thing" demo
Re: Issue 549059 in chromium: mediaDevices.enumerateDevices() reports one
output device when there are no devices
Re: Issue 438168 in chromium: Print Using System Dialogue option not
available when "save as PDF" chosen...
Re: Issue 478251 in chromium: Enable multi-process by default for
html_viewer
Re: Issue 546644 in chromium: Linux mandoline: the sandbox prevents ICU
working correctly?
Re: Issue 543124 in chromium: Change default menu row highlight color in
material design
Re: Issue 534500 in chromium: ContentVerifierTest.FailOnDone doesn't
actually test the advertised failure mode
Re: Issue 533318 in chromium:
AppViewTest.KillGuestCommunicatingWithWrongAppView flaky
Issue 550479 in chromium: All tabs compressed when click on the left border
of the left most tab
Re: Issue 548692 in chromium: Process backgrounding code on Chrome OS is
fragile
Re: Issue 507940 in chromium:
AppViewTest.KillGuestCommunicatingWithWrongAppView fails under msan
Re: Issue 544980 in chromium: Mobile YouTube plugin is broken
Re: Issue 368298 in chromium: Implement native accessibility support for
out-of-process iframes
Re: Issue 519039 in chromium:
AppViewTest.KillGuestCommunicatingWithWrongAppView times out under DrMemory
Re: Issue 368298 in chromium: Implement native accessibility support for
out-of-process iframes
Re: Issue 550151 in chromium: OOPIF: Extension frames in non-extension tabs
obtain access to extension APIs
Re: Issue 549531 in chromium: Make
Texture::GetLevelSize/ValidForTexture/ValidForTarget correct for GLImage
Re: Issue 534500 in chromium: ContentVerifierTest.FailOnDone doesn't
actually test the advertised failure mode
Re: Issue 469889 in chromium: about:blank connection info is blank (in OIB)
Re: Issue 504657 in chromium: Enable more clang warnings on Windows
Re: Issue 550065 in chromium: Many -Wmicrosoft-cast warnings on the tot win
clang bots
Re: Issue 160361 in chromium: Move WebViewTest's isolation tests to
Javascript
Re: Issue 468512 in chromium: dev installer for all users does not cleanup
older downloaded setup files
Issue 550484 in chromium: Enable Force Touch for links
Re: Issue 541468 in chromium: Escape and Disabled option are not working
for Alt key in keyboard settings.
Re: Issue 539901 in chromium: Could we include the TraceConfig json in the
metadata of the trace?
Re: Issue 541755 in chromium: Set up Linux UBSan vptr ToT builder
Re: Issue 549143 in chromium: accesskey HTML attribute does not work at all
Re: Issue 505296 in chromium: clang/win: Maybe build without -Wno-microsoft
Re: Issue 550151 in chromium: OOPIF: Extension frames in non-extension tabs
obtain access to extension APIs
Re: Issue 550065 in chromium: Many -Wmicrosoft-cast warnings on the tot win
clang bots
Re: Issue 429409 in chromium: Performance issues on
robertsspaceindustries.com
Re: Issue 481890 in chromium: Support for Look Up on Force Touch
Re: Issue 550151 in chromium: OOPIF: Extension frames in non-extension tabs
obtain access to extension APIs
Re: Issue 545891 in chromium: Regression: Border of 'find in page' textbox
is not proper for apps after selecting 'open as window' option.
Re: Issue 529668 in chromium: Show Gamepad as Connected when ANY key is
pressed instead of only A/B/X/Y
Re: Issue 521766 in chromium: ARC: Make non-phone form factor DPI to 1:1
Re: Issue 550272 in chromium: WebApps should have "Save image" item in
context menu
Re: Issue 400429 in chromium: FR: 100% SNI client side support on ChromeOS
Re: Issue 77819 in chromium: Typed url sync model associator / change
processor needs to be easily unit-testable, and existing unit tests
converted
Re: Issue 543932 in chromium: Trying to get object or embed in devtools
throws error
Re: Issue 550449 in chromium: "media_blink_unittests (with patch) crashed
or hung" is flaky
Issue 550487 in chromium: Chromium 46 - WebGL shader fails to initialize
Re: Issue 400429 in chromium: FR: 100% SNI client side support on ChromeOS
Re: Issue 550484 in chromium: Enable Force Touch for links
Re: Issue 548755 in chromium: BranchUtil failure on canary master
Re: Issue 550206 in chromium: Clean up stm32 i2c options
Re: Issue 550151 in chromium: OOPIF: Extension frames in non-extension tabs
obtain access to extension APIs
Re: Issue 549514 in chromium: customtabs: Add a "low confidence" version of
mayLaunchUrl().
Re: Issue 547417 in chromium: Chrome Remote Desktop app will not install
(Dutch)
Re: Issue 548704 in chromium: customtabs: Create a spare renderer in
warmup().
Re: Issue 543879 in chromium: WKWebView Security UI Review
Re: Issue 549752 in chromium: Gallery app closes itself while loading large
image files
Re: Issue 468775 in chromium: Scroll propagation between the frame view and
the pinch viewport differs between main and impl
Re: Issue 548912 in chromium: Stack overflow when updating cursor on a page
with <webview> with --site-per-process
Re: Issue 160361 in chromium: Move WebViewTest's isolation tests to
Javascript
Issue 550491 in chromium: chromite/lib/git.py lacking remove-project
support for Manifest
Issue 550492 in chromium: Change message when the wallpaper is set by a
third party
Re: Issue 548621 in chromium: [Regression]: Distortion is seen while
inverting the picture from preview on change picture overlay.
Re: Issue 547765 in chromium: MemoryInfra: use separate thread for
non-thread bound dump providers
Re: Issue 550151 in chromium: OOPIF: Extension frames in non-extension tabs
obtain access to extension APIs
Re: Issue 543550 in chromium: 2% regression in
smoothness.tough_pinch_zoom_cases at 354049:354086
Issue 550493 in chromium: No tooltip on hovering a required input
Re: Issue 519961 in chromium: 22.6%-57% regression in
session_restore.cold.typical_25 at 342796:342800
Re: Issue 396235 in chromium: Chrome interferes with clipboard
functionality in VMware guests
Re: Issue 510485 in chromium: GN: Fix unittests not passing on Android
Re: Issue 529451 in chromium: MemoryInfra: Get graphics information for
Android from dumpsys-meminfo
Re: Issue 492196 in chromium: Hook Android memtrack module for out of
process process gpu memory not reported by MemInfra dumpers
Re: Issue 550493 in chromium: No tooltip on hovering a required input
--
--
Automated mail from issue updates at http://crbug.com/
Subscription options: http://groups.google.com/a/chromium.org/group/chromium-bugs

To unsubscribe from this group and stop receiving emails from it, send an email to chromium-bugs+***@chromium.org.
c***@googlecode.com
2015-11-02 20:50:27 UTC
Permalink
Your project notifications generated too many emails to send
individually. Here are the subject lines of the emails you would have
received:

Re: Issue 146131 in chromium: Content css property break thead tag for
tables
Re: Issue 316160 in chromium: el sockwawe deja de funcionar
Re: Issue 549274 in chromium: HostDiscardableSharedMemoryManager crashes
when calling ThreadTaskRunnerHandle::Get() from worker thread
Re: Issue 550543 in chromium: getUserMedia seems to fail on file: URLs, but
with no error message
Re: Issue 143139 in chromium: Table tr overflow hidden bug
Re: Issue 297189 in chromium: Rethrowing an error sets the wrong
source/line/col in window.onerror
Re: Issue 543550 in chromium: 2% regression in
smoothness.tough_pinch_zoom_cases at 354049:354086
Issue 550545 in chromium: Timeline: Negative Idle time for the Rasterize
Paint events.
Re: Issue 550269 in chromium: Tryjob failed because all of swarmed tests
returned INVALID_RESULT because of libharfbuzz missing
Re: Issue 422129 in chromium: Windows Alt + Numeric Codes Uncleared in text
field that clears itself.
Re: Issue 550269 in chromium: Tryjob failed because all of swarmed tests
returned INVALID_RESULT because of libharfbuzz missing
Re: Issue 545891 in chromium: Regression: Border of 'find in page' textbox
is not proper for apps after selecting 'open as window' option.
Re: Issue 459055 in chromium: Try to make checkboxes easier to tap without
adjustment on Android
Re: Issue 363699 in chromium: RenderObject::containerForRepaint should
never be null
Issue 550546 in chromium: EXCEPTION_ACCESS_VIOLATION_READ @ 0x00000000 from
NULL main_task_runner_ in RendererGpuVideoAcceleratorFactories
Re: Issue 297864 in chromium: Chrome not restored to same desktop at KDE
startup
Re: Issue 550362 in chromium: Tooltip issue is observed in dev tools
for 'Network conditions' section.
Re: Issue 429100 in chromium: Load any URL using Go button in chrome shell
Re: Issue 422940 in chromium: Text Selection shows vertical gap.
Re: Issue 435721 in chromium: Font weight not functioning for some Google
Web Fonts
Re: Issue 410230 in chromium: SimSun 12-17px is not rendered at all
Re: Issue 550528 in chromium: veyron_rialto fails consistently on AU and
sanity checks, mark as experimental
Re: Issue 440819 in chromium: Silverlight plug-in becomes unresponsive when
javascript alert is shown in chrome
Re: Issue 546861 in chromium: Cannot view half of forge of empires game
Re: Issue 441330 in chromium: Cookies not being set
Re: Issue 468103 in chromium: APL programming language symbols don't
display correctly
Re: Issue 548498 in chromium: bluetooth: android: Add
BluetoothService::GattErrorCode enums
Re: Issue 479265 in chromium: PDF cause invalid response when sent with
status 404
Issue 550547 in chromium: Timeline: Bottom-up view shows "Infinity%" when
entries are grouped
Re: Issue 550528 in chromium: veyron_rialto fails consistently on AU and
sanity checks, mark as experimental
Re: Issue 546405 in chromium: chameleon: dump multimedia_xmlrpc_server log
to debug "Failed to start" issue
Re: Issue 461551 in chromium: Tool to measure Telemetry public API size
Re: Issue 550008 in chromium: Don't auto-complete passwords when Chrome
profile credentials are out-of-date
Re: Issue 532436 in chromium: Not found error rate of
Notifications.Database.ReadResult is high (9.5%)
Re: Issue 544379 in chromium: I will be usually and it awww snapp we found
a problem please re load usually in Farmville
Re: Issue 545185 in chromium: window.history.back() goes right to beginning
if navigating from page within chrome extension to a normal webpage
Issue 550548 in chromium: Search sometimes doesn't highlight the entire
match
Re: Issue 519023 in chromium: Reduce Android perf cycle time
Re: Issue 463914 in chromium: Canvas (2d Context does not respect CORS
Headers
Issue 550549 in chromium: Encode latency values no longer being recorded.
Re: Issue 537117 in chromium: Please take down blink merge playground repo
and groups
Re: Issue 517806 in chromium: BenchmarkSmokeTest.memory.top_7_stress broken
on mac_chromium_10.10_rel_ng
Re: Issue 537017 in chromium: My machine freezes when playing games on
Facebook. The mouse will move; but I cannot get to any tabs or close
without a F3 and power button. Yes I can recreate this whenever I try to
play a game. I am using a HP Pavilion 14 Chromebook.
Re: Issue 549717 in chromium: Timeline not showing stack traces.
Re: Issue 550545 in chromium: Timeline: Negative Idle time for the
Rasterize Paint events.
Re: Issue 548964 in chromium: Regerssion : Chrome browser does not get
launch in Windows 8 mode.
Re: Issue 342609 in chromium: Possible double padding bug.
Re: Issue 338066 in chromium: Consider reversing title and URL based on
which part matched
Re: Issue 302215 in chromium: Webpage rendering crashes when WebGL is
working
Re: Issue 550547 in chromium: Timeline: Bottom-up view shows "Infinity%"
when entries are grouped
Re: Issue 545891 in chromium: Regression: Border of 'find in page' textbox
is not proper for apps after selecting 'open as window' option.
Re: Issue 550528 in chromium: veyron_rialto fails consistently on AU and
sanity checks, mark as experimental
Re: Issue 297383 in chromium: Windows Chrome: flash no longer working since
update to 29.0.1547.76
Re: Issue 305640 in chromium: Flash player content redraw hangs(please see
atached code and example)
Re: Issue 534692 in chromium: chameleon: audio_AudioBasicInternalSpeaker
test fails on link
Re: Issue 546109 in chromium: Android Galaxy S5 Perf test failures
Re: Issue 549983 in chromium: Cant play games on facebook
Re: Issue 550021 in chromium: Crash just after pressing the search key.
Re: Issue 548965 in chromium: Regression : Browser does not relaunch on
using 'chrome://restart'.
Re: Issue 105290 in chromium: Chrome crashes with check failure when doing
a session restore on an invalid url
Re: Issue 247302 in chromium: Chromium for Linux fails to parse GBK encoded
XML file
Re: Issue 257625 in chromium: Stage3D looses Context on entering Fullscreen
Re: Issue 69280 in chromium: safe_browsing test are red on Mac valgrind bot
Re: Issue 471986 in chromium: Google Chrome has stopped working
Re: Issue 550021 in chromium: Crash just after pressing the search key.
Re: Issue 265992 in chromium: Java Applet printing problem
Re: Issue 543324 in chromium: Lots of flickering browsing sites using
Chrome version 46.0.2490.71
Re: Issue 255159 in chromium: feBlend still not working correctly with
accelerated Filters
Re: Issue 540523 in chromium: 1%-11% regression in
thread_times.key_silk_cases at 351537:352432
Re: Issue 471986 in chromium: Google Chrome has stopped working
Re: Issue 536745 in chromium: Unify Chrome's base64url implementations
Re: Issue 261533 in chromium: Run chromium, without restore prompt or never
restore
Re: Issue 351283 in chromium: ASSERTION FAILED: resolver.position() ==
endOfLine in WebCore::RenderBlockFlow::layoutRunsAndFloatsInRange
Re: Issue 297864 in chromium: Chrome not restored to same desktop at KDE
startup
Re: Issue 298948 in chromium: Gesture/Scroll behavior is sporadically
occurring despite the use of preventDefault() on touch event handlers
Re: Issue 508900 in chromium: Check failed: request_->status().is_success()
Re: Issue 548621 in chromium: [Regression]: Distortion is seen while
inverting the picture from preview on change picture overlay.
Re: Issue 300056 in chromium: "New tab" doesn't show bookmarks
Re: Issue 268030 in chromium: Permanent distortion of images in Chrome.
Re: Issue 550421 in chromium: Chrome browser ui thread enter
uninterruptible sleep for 600ms
Re: Issue 274986 in chromium: Missing symbols
Re: Issue 269931 in chromium: Fixed-width fonts are displayed with
variable-width characters (makes code hard to read)
Re: Issue 539901 in chromium: Could we include the TraceConfig json in the
metadata of the trace?
Re: Issue 471986 in chromium: Google Chrome has stopped working
Re: Issue 338066 in chromium: Consider reversing title and URL based on
which part matched
Re: Issue 509899 in chromium: FYI waterfall bot for 10.11
Re: Issue 482735 in chromium: Instrument sharded_perf_tests using
py_trace_event to collect sharding traces
Re: Issue 384357 in chromium: Caret position inside contenteditable region
with uneditable nodes
Re: Issue 422871 in chromium: still a non-zero count of invalid referrers
Re: Issue 550151 in chromium: OOPIF: Extension frames in non-extension tabs
obtain access to extension APIs
Re: Issue 548678 in chromium: Frequent "Sharded Perf Tests" failure on
Android Galaxy S5 Perf (1)
Re: Issue 530200 in chromium: Performance Point Excel Services Page display
casues looping
Re: Issue 407606 in chromium: 1px margin between two vertically laid out
divs in Chrome
Re: Issue 526160 in chromium: Cannot authenticate via SSO when Netmask is
enabled in cPanel
Re: Issue 529399 in chromium: [Assist][NN5] Google Now button displays
with graphical glitches on home button long press
Issue 550554 in chromium: Incorrect mouse wheel scroll for RTL page when
smooth scrolling is enabled
Re: Issue 526160 in chromium: Cannot authenticate via SSO when Netmask is
enabled in cPanel
Re: Issue 543324 in chromium: Lots of flickering browsing sites using
Chrome version 46.0.2490.71
Re: Issue 533125 in chromium: chameleon:
audio_AudioAfterReboot.external_mic fail on peppy
Re: Issue 529399 in chromium: [Assist][NN5] Google Now button displays
with graphical glitches on home button long press
Re: Issue 543324 in chromium: Lots of flickering browsing sites using
Chrome version 46.0.2490.71
Re: Issue 543324 in chromium: Lots of flickering browsing sites using
Chrome version 46.0.2490.71
--
--
Automated mail from issue updates at http://crbug.com/
Subscription options: http://groups.google.com/a/chromium.org/group/chromium-bugs

To unsubscribe from this group and stop receiving emails from it, send an email to chromium-bugs+***@chromium.org.
c***@googlecode.com
2015-11-03 18:27:47 UTC
Permalink
Your project notifications generated too many emails to send
individually. Here are the subject lines of the emails you would have
received:

Re: Issue 550751 in chromium: Suspected SSD problem on
chromeos2-row2-rack10-host10
Re: Issue 455464 in chromium: Auto_bisect recipe module: Output structured
data on check_job_status.py
Re: Issue 464983 in chromium: update harfbuzz on Chrome OS to 0.9.38
Re: Issue 169120 in chromium: PDF Viewer doesn't honor PDF Print Dialog
Presets - I.E. Duplex
Re: Issue 266427 in chromium: background blend mode not working in some
cases with bg color
Re: Issue 309400 in chromium: Unnecessary blurring of images when zooming in
Re: Issue 550751 in chromium: Suspected SSD problem on
chromeos2-row2-rack10-host10
Re: Issue 457789 in chromium: Investigate different approach to
classify 'good' and 'bad' revisions.
Re: Issue 337640 in chromium: Full-window WebGL renders are incredibly slow
Re: Issue 549176 in chromium: There is no "delete" option in right-click
menu when editing text.
Issue 551011 in chromium: "gpu_rasterization on NVIDIA GPU on Mac Retina
TEST RESULTS WERE INVALID" is flaky
Issue 551012 in chromium: "context_lost on NVIDIA GPU on Mac Retina TEST
RESULTS WERE INVALID" is flaky
Re: Issue 538727 in chromium: clankium_nexus4_perf_bisect not picking up
jobs.
Issue 551015 in chromium: "hardware_accelerated_feature on NVIDIA GPU on
Mac Retina TEST RESULTS WERE INVALID" is flaky
Issue 551010 in chromium: "content_gl_tests on NVIDIA GPU on Mac Retina
TEST RESULTS WERE INVALID" is flaky
Issue 551016 in chromium: "maps_pixel_test on NVIDIA GPU on Mac Retina TEST
RESULTS WERE INVALID" is flaky
Issue 551013 in chromium: "gpu_process_launch on NVIDIA GPU on Mac Retina
TEST RESULTS WERE INVALID" is flaky
Re: Issue 550994 in chromium: Guest renderer in out of process <iframe>
should know about the visibility state of <iframe>
Issue 551014 in chromium: "gpu_process_launch on NVIDIA GPU on Mac Retina
TEST RESULTS WERE INVALID" is flaky
Re: Issue 286671 in chromium: Background drawn incorrectly on tables
border-collapse:collapse
Issue 551017 in chromium: "memory_test on NVIDIA GPU on Mac Retina TEST
RESULTS WERE INVALID" is flaky
Issue 551018 in chromium: "pixel_test on NVIDIA GPU on Mac Retina TEST
RESULTS WERE INVALID" is flaky
Issue 551020 in chromium: "trace_test on NVIDIA GPU on Mac Retina TEST
RESULTS WERE INVALID" is flaky
Issue 551019 in chromium: "screenshot_sync on NVIDIA GPU on Mac Retina TEST
RESULTS WERE INVALID" is flaky
Re: Issue 544897 in chromium: Text is seen clipped downwards in some pages
Re: Issue 540765 in chromium: Log in Error for SSO
Re: Issue 548693 in chromium: video_ChromeRTCHWDecodeUsed test fails
Re: Issue 542316 in chromium: Bisect recipe breaks when expanding webkit
roll.
Re: Issue 346084 in chromium: Certain fonts disable font fallback list
Re: Issue 317481 in chromium: Telemetry should have access to startup traces
Re: Issue 531579 in chromium: Changing Settings.in results in a broken build
Re: Issue 542320 in chromium: Bisect director buildbot page shows too much
useless data on the info column.
Re: Issue 362356 in chromium: Chrome does a Google Search for .local domains
Re: Issue 544897 in chromium: Text is seen clipped downwards in some pages
Re: Issue 347117 in chromium: Fonts disappearing in Chrome 33
Re: Issue 550397 in chromium: [Regression]: Gallore app notifications do
not close via mouse click.
Re: Issue 548693 in chromium: video_ChromeRTCHWDecodeUsed test fails
Re: Issue 248562 in chromium: Chrome’s condescending and accusatory
messages should be removed
Re: Issue 347440 in chromium: Partial image rendering
Re: Issue 479043 in chromium: Implement chrome.languagePrivate
Re: Issue 550338 in chromium: Youtube Quality Problems
Re: Issue 532739 in chromium: Update ClearBrowsingData Settings to Material
Design
Re: Issue 248562 in chromium: Chrome’s condescending and accusatory
messages should be removed
Re: Issue 549330 in chromium: The platform view of wmatrix is broken
Re: Issue 550787 in chromium: Material design downloads: toolbar gets
squished when resizing window
Re: Issue 413099 in chromium: Is chrome always run in debug mode ?
Re: Issue 339193 in chromium: Support auto-bisect of Chrome OS builds.
Re: Issue 549330 in chromium: The platform view of wmatrix is broken
Re: Issue 546112 in chromium: [minnie,cyan]: video and audio stop playback
when click subtitles button on TED.com
Re: Issue 408919 in chromium: Rendering problem, gets worse with
--disable-lcd-text
Re: Issue 550886 in chromium: MemoryInfra: rework allocator shim layer and
make it usable on all platforms
Re: Issue 248562 in chromium: Chrome’s condescending and accusatory
messages should be removed
Re: Issue 145206 in chromium: CSS3 box-shadow causing unexpected resizing
on hover/focus
Re: Issue 497307 in chromium: Remove [TreatNullAs=NullString] from
attributes on Document and elsewhere
Re: Issue 548693 in chromium: video_ChromeRTCHWDecodeUsed test fails
Re: Issue 387408 in chromium: throttling should not be a supported tree
status
Re: Issue 141887 in chromium: Textwrap Bug When Negative Margin
Re: Issue 367595 in chromium: GN: Clean up errors reported by gn check.
Re: Issue 376000 in chromium: Change gn gen to run w/ --check on the bots
by default
Re: Issue 137481 in chromium: Box-shadow not renders well with border in
css table
Re: Issue 546535 in chromium: Overlayed Canvas don't draw correctly on
soundcloud.com (only on Windows)
Re: Issue 110872 in chromium: A part of a background image is not painted
at the first time
Re: Issue 489820 in chromium: ipc/ipc_sync_channel.cc should call DVLOG()
instead of VLOG()
Re: Issue 511825 in chromium: chrome.contentSettings.plugins.get crashes
Chromium when plugin content setting is "Detect and run important plugin
content"
Re: Issue 549602 in chromium: Need credentials on swarming bots for running
telemetry_perf_unittest
Re: Issue 548984 in chromium: samus/hoho: Audio over HDMI stops working
about a large number of resolution changes
Re: Issue 546535 in chromium: Overlayed Canvas don't draw correctly on
soundcloud.com (only on Windows)
Re: Issue 549021 in chromium: Add stats to track cases where input audio
recording does not start correctly on Mac
Re: Issue 548368 in chromium: New perfbots not listed in chromium.perf.json
Re: Issue 549330 in chromium: The platform view of wmatrix is broken
Re: Issue 521364 in chromium: Font blurs when using translate on a webpage
with a WebGL Canvas
Re: Issue 541846 in chromium: Font rendering is lighter than Safari /
Firefox on OS X El Capitan
Re: Issue 134643 in chromium: Incorrect rendering
Re: Issue 482738 in chromium: Unable to switch back from VT2
Re: Issue 226784 in chromium: Freeze behaviour, not correct, depends on
begin time ( Looks like Floating Point Problem )
Re: Issue 277763 in chromium: visible edges on canvas elements when scaled
via css
Re: Issue 510028 in chromium: Add data volume counters to the "Clear
browsing data" dialog
Re: Issue 546112 in chromium: [minnie,cyan]: video and audio stop playback
when click subtitles button on TED.com
Re: Issue 362356 in chromium: Chrome does a Google Search for .local domains
Re: Issue 277763 in chromium: visible edges on canvas elements when scaled
via css
Re: Issue 536586 in chromium: Distorted video-out on samus when docked to
external monitor
Re: Issue 248562 in chromium: Chrome’s condescending and accusatory
messages should be removed
Re: Issue 248562 in chromium: Chrome’s condescending and accusatory
messages should be removed
Re: Issue 260319 in chromium: background-position not correct when
background-size present and brower zoom level is off
Re: Issue 342332 in chromium: Recently Closed link is not not working
properly
Re: Issue 511825 in chromium: chrome.contentSettings.plugins.get crashes
Chromium when plugin content setting is "Detect and run important plugin
content"
Re: Issue 541846 in chromium: Font rendering is lighter than Safari /
Firefox on OS X El Capitan
Re: Issue 480365 in chromium: Issues with XML object
Re: Issue 546953 in chromium: Implement a headless mode for Chrome
Re: Issue 481293 in chromium: Youtube/Vimeo HTML5 Playback crashes when
reinserting headphones, switches to flash? then plays another ad.
Re: Issue 505012 in chromium: Color seeping between elements with shared
edges
Re: Issue 154341 in chromium: Canvas doesn't render after page refresh,
only after first-launch.
Re: Issue 549176 in chromium: There is no "delete" option in right-click
menu when editing text.
Re: Issue 546112 in chromium: [minnie,cyan]: video and audio stop playback
when click subtitles button on TED.com
Re: Issue 511270 in chromium: Make fuzzing on Clank awesome
Re: Issue 546535 in chromium: Overlayed Canvas don't draw correctly on
soundcloud.com (only on Windows)
Re: Issue 511270 in chromium: Make fuzzing on Clank awesome
Re: Issue 437799 in chromium: Repeatedly creating WebGL contexts with
anti-aliasing runs browser out of GPU memory.
Re: Issue 437800 in chromium: Repeatedly creating WebGL contexts with
anti-aliasing runs browser out of GPU memory.
Re: Issue 123306 in chromium: Blurry text css rotate
Re: Issue 521364 in chromium: Font blurs when using translate on a webpage
with a WebGL Canvas
Re: Issue 548693 in chromium: video_ChromeRTCHWDecodeUsed test fails
--
--
Automated mail from issue updates at http://crbug.com/
Subscription options: http://groups.google.com/a/chromium.org/group/chromium-bugs

To unsubscribe from this group and stop receiving emails from it, send an email to chromium-bugs+***@chromium.org.
Continue reading on narkive:
Loading...