Discussion:
102 messages from Google Code
(too old to reply)
c***@googlecode.com
2014-04-21 22:22:30 UTC
Permalink
Your project notifications generated too many emails to send
individually. Here are the subject lines of the emails you would have
received:

Re: Issue 365328 in chromium: Remove SK_IGNORE_FREETYPE_ROTATION_FIX and
rebaseline.
Issue 365443 in chromium: Chrome Crashes or Freezes on iCloud.com
Re: Issue 364711 in chromium: Regression: native scrolling hitches up when
using two fingers on a trackpad
Re: Issue 365266 in chromium: [Mac] Regression : Profile icons not seen on
tabstrip in Fullscreen mode, even though bubble opens on clicking on that
position.
Re: Issue 363316 in chromium: [All x86 systems with Cypress TPs] Fast Lid
close causes repeated wakeup condition
Re: Issue 363753 in chromium: CoreSymbolication does not like recent DWARF
data for some targets
Re: Issue 348237 in chromium: TEXTURE_MAX_ANISOTROPY init value is wrong on
Linux AMD
Re: Issue 352891 in chromium: Silverlight 30317 crashes, but only on M35
Re: Issue 354621 in chromium: Problem with Chrome javascript number
comparison.
Issue 365445 in chromium: Config Failure with correct security on
f9k1102_v2_n_ch5_open (BelkinF9K1102APConfigurator)
Re: Issue 178552 in chromium: Allow X-Auto-Login on all sites
Issue 365446 in chromium: Create benchmark for DoYouEvenBench
Re: Issue 360406 in chromium: Client certificate support broken on Android
Re: Issue 364619 in chromium: Leaks in RenderProcessHost
Re: Issue 365446 in chromium: Create benchmark for DoYouEvenBench
Re: Issue 346336 in chromium: Memory leaks at
content::ChildProcessLauncher::ChildProcessLauncher from webkit bot
Re: Issue 365445 in chromium: Config Failure with correct security on
f9k1102_v2_n_ch5_open (BelkinF9K1102APConfigurator)
Re: Issue 358391 in chromium: Pink Hue in Chrome Window Only
Re: Issue 362400 in chromium: Regression: Credit card number details do not
remain saved in Autofill Settings
Re: Issue 352891 in chromium: Silverlight 30317 crashes, but only on M35
Re: Issue 160900 in chromium: FileEntry objects returned from MediaGallery
API don't support toURL() method.
Re: Issue 360938 in chromium: Need android compile-only try servers for the
GN build
Re: Issue 362329 in chromium: Need an Android GN (build tool) bot running
on the chromium.linux waterfall
Re: Issue 365438 in chromium: Uninit error from content_unittests
TouchEmulatorTest.Touch
Re: Issue 365241 in chromium: Instruments.app crashes when profiling Chrome
or Content Shell
Re: Issue 365429 in chromium: REGRESSION: Running Instruments (on Mac) on
Chrome crashes Instruments
Re: Issue 365443 in chromium: Chrome Crashes or Freezes on iCloud.com
Re: Issue 365126 in chromium: "cros flash" against lab machine fails
with "Device update failed." when given unexpected image filename
Re: Issue 342591 in chromium: Uninit Error reported from write at
IPC::Channel::ChannelImpl::ProcessOutgoingMessages
Issue 365447 in chromium: New window is minimized on creation
Re: Issue 363466 in chromium: cras: log spam fills disk, makes system
unbootable
Issue 365448 in chromium: Failed to connect to rt_n56u_n_ch149_open at 5GHz
Re: Issue 365126 in chromium: "cros flash" against lab machine fails
with "Device update failed." when given unexpected image filename
Re: Issue 365410 in chromium: regression in media.mse_cases at 264722:264745
Re: Issue 339160 in chromium: Security review for supervised users (client
implementation and management UI)
Re: Issue 363316 in chromium: [All x86 systems with Cypress TPs] Fast Lid
close causes repeated wakeup condition
Re: Issue 365396 in chromium: Disk-full errors on peppy after resume
Re: Issue 160900 in chromium: FileEntry objects returned from MediaGallery
API don't support toURL() method.
Re: Issue 365447 in chromium: New window is minimized on creation
Issue 365449 in chromium: Config Failure with correct security on
f9k1102_v2_n_ch149_open (BelkinF9K1102APConfigurator)
Re: Issue 364633 in chromium: shill: cellular:
network_3GModemContorl.autoconnect-pseudomodem.3GPP fails
Re: Issue 365449 in chromium: Config Failure with correct security on
f9k1102_v2_n_ch149_open (BelkinF9K1102APConfigurator)
Re: Issue 363454 in chromium: No Gallery image displayed from USB or SD card
Re: Issue 365438 in chromium: Uninit error from content_unittests
TouchEmulatorTest.Touch
Re: Issue 363454 in chromium: No Gallery image displayed from USB or SD card
Re: Issue 365328 in chromium: Remove SK_IGNORE_FREETYPE_ROTATION_FIX and
rebaseline.
Issue 365450 in chromium: chrome.windows.update {'focused': true} doesn't
work on Chrome unstable with Aura
Re: Issue 125093 in chromium: HTML5 Notifications Bypass Lock Screen on
Linux
Re: Issue 365450 in chromium: chrome.windows.update {'focused': true}
doesn't work on Chrome unstable with Aura
Issue 365451 in chromium: [devtools][feature request] Workspaces and the
file protocol
Re: Issue 125093 in chromium: HTML5 Notifications Bypass Lock Screen on
Linux
Issue 365452 in chromium: [chrome.cast.channel] Don't log binary blobs into
LOG(VERBOSE)
Re: Issue 358357 in chromium: Panels disappear on Codepen.io
Re: Issue 363422 in chromium: Communicate OutputSurface id's with SwapAcks
to prevent race conditions
Re: Issue 362352 in chromium: No audio on Atom devices when playing
Highgrounds.com game
Re: Issue 365200 in chromium: chrome.identity.launchWebAuthFlow should
re-use existing credentials to avoid phishing
Re: Issue 363454 in chromium: No Gallery image displayed from USB or SD card
Re: Issue 363715 in chromium: Divide by 0 in MostVisitedLayout
Issue 365454 in chromium: Implement future sync points in Chrome's GPU
Service
Re: Issue 365454 in chromium: Implement future sync points in Chrome's GPU
Service
Re: Issue 350621 in chromium: Allow UI to defer a high latency Renderer's
GPU context
Re: Issue 360406 in chromium: Client certificate support broken on Android
Re: Issue 349438 in chromium: transform is not recognized for ::before
content
Re: Issue 243905 in chromium: Improve main thread performance with
SetNextCommitWaitsForActivation
Re: Issue 365454 in chromium: Implement future sync points in Chrome's GPU
Service
Re: Issue 332461 in chromium: Accessiblity:- Spoken feedback does not
disable once enabled
Re: Issue 354167 in chromium: -webkit-animation does not resize page
properly
Re: Issue 363715 in chromium: Divide by 0 in MostVisitedLayout
Re: Issue 362362 in chromium: Extra exception entry is added when being
modified manually
Issue 365456 in chromium: Configuration timed out for Link on
f6d4230-4_g_ch5_wpa (BelkinF6D4230APConfigurator)
Re: Issue 365456 in chromium: Configuration timed out for Link on
f6d4230-4_g_ch5_wpa (BelkinF6D4230APConfigurator)
Re: Issue 131813 in chromium: Chrome gets stuck in full screen mode
Issue 365457 in chromium: Javascript IFrame onerror event does not fire
when IFrame src load fails
Issue 365458 in chromium: Failed to connect to wrt120n_g_ch5_wpa2 at 2.4GHz
Re: Issue 350200 in chromium: Omnibox: Setup Experiment to Display Hint
Text in the Omnibox
Issue 365459 in chromium: Failed to connect to linksys_wrt600_g_ch5_wpa at
2.4GHz
Issue 365460 in chromium: Failed to connect to f5d8236-4_v2_g_ch5_wpa at
2.4GHz
Re: Issue 364736 in chromium: nyan firmware and factory branches (and
builders)
Re: Issue 364711 in chromium: Regression: native scrolling hitches up when
using two fingers on a trackpad
Re: Issue 362693 in chromium: Cannot drag to select text with large mouse
cursor or other a11y features
Re: Issue 354232 in chromium: Cells do not refresh correctly after undoing
insert row
Re: Issue 364736 in chromium: nyan firmware and factory branches (and
builders)
Re: Issue 365408 in chromium: InvalidElementStateException for Link on
belkinF9K1001
Re: Issue 343182 in chromium: factory code must handle eMMC on Intel
Platform
Re: Issue 365461 in chromium: regression in audio_bus_to_intervealed
media_perftests at 264760:264772
Issue 365461 in chromium: regression in audio_bus_to_intervealed
media_perftests at 264760:264772
Re: Issue 365443 in chromium: Chrome Crashes or Freezes on iCloud.com
Re: Issue 365388 in chromium: reproduce panther hangs
Re: Issue 365461 in chromium: regression in audio_bus_to_intervealed
media_perftests at 264760:264772
Re: Issue 344837 in chromium: UNKNOWN in cricket::SrtpSession::ProtectRtp
Re: Issue 336983 in chromium: 'gclient revert' is very very slow on the
WebKit Android (Nexus 4) bot, others
Re: Issue 363471 in chromium: Cleanup chromium.patch for libexif
Issue 365462 in chromium: Config Failure with correct security on
xwr100_a_ch48_wpa2
Re: Issue 357946 in chromium: Virtual Keyboard is broken
Re: Issue 364721 in chromium: Convert the boolean param of
Image::startAnimation() to an enum
Re: Issue 364358 in chromium: SVG ShadowDom: ReferenceFilterBuilder::build
should use treeScope for element id lookups
Re: Issue 364302 in chromium: SVGElement::isInUserAgentShadowTree should
check shadowHost->isSVGUseElement
Re: Issue 365461 in chromium: regression in audio_bus_to_intervealed
media_perftests at 264760:264772
Re: Issue 362659 in chromium: Ctrl+Home no longer goes to first line of
multi-line text field
Issue 365463 in chromium: Failed to connect to airport_express_g_5_wpa2 at
2.4GHz
Re: Issue 365463 in chromium: Failed to connect to airport_express_g_5_wpa2
at 2.4GHz
Re: Issue 264818 in chromium: GPU Sandbox "disabled"
--
--
Automated mail from issue updates at http://crbug.com/
Subscription options: http://groups.google.com/a/chromium.org/group/chromium-bugs

To unsubscribe from this group and stop receiving emails from it, send an email to chromium-bugs+***@chromium.org.
c***@googlecode.com
2014-04-21 23:22:01 UTC
Permalink
Your project notifications generated too many emails to send
individually. Here are the subject lines of the emails you would have
received:

Re: Issue 240465 in chromium: [meta] Enable picture profiling
Re: Issue 365473 in chromium: regression in clock_less_playback
media_perftests at 263430:263470
Re: Issue 365389 in chromium: rasterize_and_record_micro perf fails on
Nexus4
Re: Issue 338759 in chromium: Repacking resources with only resources that
are used
Re: Issue 269946 in chromium: SVG shrinks when src changes with CSS sizing
Re: Issue 365474 in chromium: ASSERTION FAILED: clipRectsContext.rootLayer
== m_clipRectsCache->m_clipRectsRoot[clipRectsType]
Re: Issue 337726 in chromium: avahi-daemon doesn't announce its PTR record
for _cros_p2p.local
Re: Issue 239656 in chromium: Refactor NaCl integration to eliminate the
trusted, in-process plugin.
Re: Issue 359789 in chromium: Accessibility accidentally broken in ICS
Re: Issue 365466 in chromium: Disable voice search feature for AppLauncher
in M35
Re: Issue 359789 in chromium: Accessibility accidentally broken in ICS
Issue 365477 in chromium: Rambi: hardware_VideoDecodeCapable fails
Re: Issue 365389 in chromium: rasterize_and_record_micro perf fails on
Nexus4
Re: Issue 365445 in chromium: Config Failure with incorrect security on
f9k1102_v2_n_ch5_open (BelkinF9K1102APConfigurator)
Re: Issue 365469 in chromium: Extension folder is empty making apps not work
Re: Issue 365449 in chromium: Config Failure with incorrect security on
f9k1102_v2_n_ch149_open (BelkinF9K1102APConfigurator)
Issue 365478 in chromium: Rambi: video_VideoEncodeAccelerator fails
Re: Issue 365472 in chromium: Desktop Youtube is janky when resizing on
Nexus 10 tablet
Re: Issue 354539 in chromium: 64 bit support for WebRtc
Issue 365481 in chromium: Preferences for output devices should be stored
in user "Preferences" file, not "Local State"
Re: Issue 354167 in chromium: -webkit-animation does not resize page
properly
Re: Issue 363785 in chromium: Use VAO for default_vertex_attrib_manager if
available.
Re: Issue 365047 in chromium: saved password doesn't work
Re: Issue 364711 in chromium: Regression: native scrolling hitches up when
using two fingers on a trackpad
Re: Issue 358160 in chromium: Unexpected Error
Re: Issue 360348 in chromium: Google Night Walk breaks system volume
control (even in other apps) and "OK, Google" in Google Now
Re: Issue 360272 in chromium: 13%-20% regression in blink_perf at
261647:261675
Re: Issue 355682 in chromium: 15% regression in blink_perf at 258855:258874
Re: Issue 365450 in chromium: chrome.windows.update {'focused': true}
doesn't work on Chrome unstable with Aura
Re: Issue 364844 in chromium: chrome on android transletes cyrillic domains
to Punycode but chrome on desktop works fine
Issue 365484 in chromium: Aura UI does not support non-RGB subpixel
rendering
Issue 365485 in chromium: CPU utilization regression in
media.tough_media_cases at 264721:264745
Re: Issue 365485 in chromium: CPU utilization regression in
media.tough_media_cases at 264721:264745
Re: Issue 365410 in chromium: regression in media.mse_cases at 264722:264745
Re: Issue 360272 in chromium: 13%-20% regression in blink_perf at
261647:261675
Re: Issue 365470 in chromium: Time updates are delayed until the second
audio buffer is rendered.
Re: Issue 342077 in chromium: Linux Aura doesn't use subpixel rendering
when requested
Re: Issue 363479 in chromium: Excessive idle cpu time on Android
Issue 365487 in chromium: [Panther] Bluetooth integrated mic not working
Re: Issue 353045 in chromium: Chrome froze trying to show a context menu on
crbug [deadlock?]
Issue 365488 in chromium: Blink symbols missing on ChromiumOS waterfall bots
Re: Issue 365468 in chromium: moblab: Peppy machine can not be repair:
moblab tries to install an old image.
Re: Issue 365481 in chromium: Preferences for output devices should be
stored in user "Preferences" file, not "Local State"
Re: Issue 362277 in chromium: Add libGL.so to linux sysroot
Re: Issue 354539 in chromium: 64 bit support for WebRtc
Re: Issue 365466 in chromium: Disable voice search feature for AppLauncher
in M35
Re: Issue 354324 in chromium: Crash when toggling bookmark bar visibility
after importing data
Re: Issue 313562 in chromium: Changing left/top/bottom/right should set
layer positions directly instead of doing layout
Re: Issue 364553 in chromium: Stop any on-going Hangouts upon screen locking
Re: Issue 365485 in chromium: CPU utilization regression in
media.tough_media_cases at 264721:264745
Re: Issue 363711 in chromium: Add a BVT test to catch issues with login
after autoupdate - crbug.com/363665
Re: Issue 354461 in chromium: Regression: "App Launcher" hides or minimizes
on removing any installed apps in Windows 8/ASH mode.
Re: Issue 364337 in chromium: Focusing an uninstall dialog on the App
Launcher dismisses the App Launcher (and the dialog)
Re: Issue 35309 in chromium: History expiry causes inline autocomplete
flakiness
Re: Issue 365485 in chromium: CPU utilization regression in
media.tough_media_cases at 264721:264745
Re: Issue 365487 in chromium: [Panther] Bluetooth integrated mic not working
Re: Issue 353470 in chromium: Regression:Frame of video is partially
visible.
Re: Issue 354324 in chromium: Toggling bookmark bar visibility after
importing data has no effect
Re: Issue 362444 in chromium: Feedback app turns blank after quitting
browser and browser behaves unresponsive
Re: Issue 358978 in chromium: Disable all network connectivity during Demo
Mode
Re: Issue 365334 in chromium:
DownloadExtensionTest.DownloadExtensionTest_SearchOrderByEmpty fail under
ASan with libc++
Re: Issue 35309 in chromium: History expiry causes inline autocomplete
flakiness
Re: Issue 365485 in chromium: CPU utilization regression in
media.tough_media_cases at 264721:264745
Re: Issue 362763 in chromium: UDPSocket accepts SO_REUSEADDR and
SO_BROADCAST only before bind() is called.
Re: Issue 365487 in chromium: [Panther] Bluetooth integrated mic not working
Re: Issue 358152 in chromium: google code setting security option google
account password using a Git or Mercurial client failed.
Re: Issue 365484 in chromium: Aura UI does not support non-RGB subpixel
rendering
Re: Issue 337726 in chromium: avahi-daemon doesn't announce its PTR record
for _cros_p2p.local
Re: Issue 355385 in chromium: Web page not painting properly
Re: Issue 356988 in chromium: ftrace does not work on R35 peach-pit
Re: Issue 348669 in chromium: Hangouts extension unable to gain focus again
Re: Issue 364990 in chromium: AudioBufferConverter incorrectly sizes output
requests, resulting in large amounts of buffered data.
Re: Issue 362928 in chromium: Some saved password can't pass the
authentication
Re: Issue 363430 in chromium: Enable TDLS option in Cast extension
Re: Issue 312462 in chromium: Investigate using CARemoteLayer for Mac
compositing
Re: Issue 358152 in chromium: google code setting security option google
account password using a Git or Mercurial client failed.
Re: Issue 355898 in chromium: Network config from kiosk launch screen
creates shared networks by default
Re: Issue 351040 in chromium: Security: Sync is transported over HTTP
Re: Issue 351040 in chromium: Security: Sync is potentially transported
over HTTP
Re: Issue 362938 in chromium: Missing invalidations on youtube.com in HTML5
player
Re: Issue 343273 in chromium: Detect cloned installs and reset variation
state.
Re: Issue 358808 in chromium: Create an URL app from a given DriveAppInfo
Re: Issue 362352 in chromium: No audio on Atom devices when playing
Highgrounds.com game
Re: Issue 310216 in chromium: Add Drive Apps to Chrome Launcher
Re: Issue 304565 in chromium: Chrome: Crash Report - Magic Signature:
v8::internal::Invoke
Re: Issue 360311 in chromium: Switch linux to use clang by default
Re: Issue 364715 in chromium: Kiosk mode diagnostics UI layout broken
Re: Issue 364253 in chromium: Fix 1x app assets for Chrome OS window headers
Re: Issue 364715 in chromium: Kiosk mode diagnostics UI layout broken
Re: Issue 364715 in chromium: Kiosk mode diagnostics UI layout broken
Re: Issue 358927 in chromium: [Stress Test] Create a suspend/resume stress
test for power
Re: Issue 364702 in chromium: Closing Connectivity Diagnostics tool in
kiosk mode should not cause the device to reboot
Re: Issue 337726 in chromium: avahi-daemon doesn't announce its PTR record
for _cros_p2p.local
Re: Issue 362938 in chromium: Missing invalidations on youtube.com in HTML5
player
Re: Issue 355424 in chromium: MP3 Played twice when not supposed to.
Re: Issue 239179 in chromium: Use Python for page sets instead of JSON
Re: Issue 364900 in chromium: Investigate daisy_spring and falco pfq timing
out
Re: Issue 365417 in chromium: [Link] [Open] ]Failed to connect to
f6d4230-4_g_ch5_open at 2.4GHz
Re: Issue 364553 in chromium: Stop any on-going Hangouts upon screen locking
Re: Issue 359293 in chromium: run_benchmarks on cros device
Re: Issue 365419 in chromium: [Link] [Open] Failed to connect to
f7d1301_v1_g_ch5_open at 2.4GHz
Re: Issue 365119 in chromium: pixel: Report of ChromeOS m34 stable update
bricking machine
--
--
Automated mail from issue updates at http://crbug.com/
Subscription options: http://groups.google.com/a/chromium.org/group/chromium-bugs

To unsubscribe from this group and stop receiving emails from it, send an email to chromium-bugs+***@chromium.org.
c***@googlecode.com
2014-04-23 23:30:54 UTC
Permalink
Your project notifications generated too many emails to send
individually. Here are the subject lines of the emails you would have
received:

Issue 366354 in chromium: Remove --disable-html-threaded-parser command
line flag
Re: Issue 236772 in chromium: gold64: Sporadic linking failures
with "internal error in make_view, at fileread.cc:462"
Issue 366355 in chromium: Sync needs to be able to programatically
disable/enable data types based on an extension being installed
Re: Issue 366286 in chromium: Mouse icon doesn't change when we mouse over
certain area's on tabstrip.
Re: Issue 365913 in chromium: The Minimize/Maximize/Restore buttons don't
work if a theme is installed in Chrome on Windows high DPI
Re: Issue 366354 in chromium: Remove --disable-html-threaded-parser command
line flag
Issue 366356 in chromium: Support for Playstation dualshock bluetooth
joystick
Re: Issue 336629 in chromium: InspectorTimelineTabTest.testGotTimeline is
flaky
Re: Issue 356071 in chromium: Fails to build with video_hole=1
Re: Issue 365883 in chromium: Include ipv6 entries for IPConfigs in Shill
Re: Issue 359923 in chromium: zoom in/out and scroll is not smooth
Re: Issue 327501 in chromium: CQ should use full e-mail address for
non-googler/chromium authors
Re: Issue 364231 in chromium: salsa is missing dependency info
Re: Issue 359674 in chromium: PolicyManager: Add a per-board const
key-value pair provider
Re: Issue 329920 in chromium: restructure OS targets
Re: Issue 329920 in chromium: restructure OS targets
Re: Issue 362157 in chromium: Stats on how many CQ runs were saved by
Pre-CQ in the past week
Re: Issue 366338 in chromium: EULA Update
Issue 366359 in chromium: Clients remote desktop does not scale to higher
resolution host properly
Re: Issue 342482 in chromium: My "google profile" image does not animate
when it is a GIF
Re: Issue 359674 in chromium: PolicyManager: Add a per-board const
key-value pair provider
Re: Issue 361891 in chromium: Run the chromium tests (browser_tests,
content_browser_tests) on one (fast) configuration as part of the Blink CQ
Issue 366361 in chromium: VideoRendererImplTest.Rebuffer is flaky on Android
Re: Issue 366338 in chromium: EULA Update
Re: Issue 366363 in chromium: 15%-16% regression in blink_perf at
264773:264796
Issue 366363 in chromium: 15%-16% regression in blink_perf at 264773:264796
Re: Issue 366362 in chromium: browser_tests is not sharded across all
three "Linux ChromiumOS Tests (dbg)" builders on chromium.chromiumos
Re: Issue 366361 in chromium: VideoRendererImplTest.Rebuffer is flaky on
Android
Re: Issue 366363 in chromium: 15%-16% regression in blink_perf at
264773:264796
Re: Issue 366363 in chromium: 15%-16% regression in blink_perf at
264773:264796
Re: Issue 366343 in chromium: Add usage statistics for meta viewport values
Re: Issue 318222 in chromium: Cannot properly rearrange bookmarks in the
bookmarks bar (+ its collapsible list on the right)
Re: Issue 366362 in chromium: browser_tests is not sharded across all
three "Linux ChromiumOS Tests (dbg)" builders on chromium.chromiumos
Re: Issue 327501 in chromium: CQ should use full e-mail address for
non-googler/chromium authors
Re: Issue 365509 in chromium: setMockScrollbarsEnabled does not do any
invalidation
Re: Issue 308321 in chromium: There's no way to run a JS string through the
threaded html parser
Issue 366364 in chromium: Android blink_perf tests timing out
Re: Issue 362896 in chromium: Accelerated CSS filters not working on
Android in v.34
Re: Issue 366105 in chromium: HTMLDetailsElement should fire a toggle event
Re: Issue 366329 in chromium: llvm installs internal libs into subdir where
they cannot be found at runtime
Issue 366365 in chromium: Improve the chrome://network UI
Re: Issue 366187 in chromium: M35: Missing beta AU Test for Glimmer,
Monroe, Stumpy, Panther(failed)
Issue 366367 in chromium: Purging .pyc files causes benchmarks to hang
Re: Issue 362896 in chromium: Accelerated CSS filters not working on
Android in v.34
Re: Issue 365407 in chromium: browser_tests/interactive_ui_tests should set
the override redirect flag on root windows.
Re: Issue 362896 in chromium: Accelerated CSS filters not working on
Android in v.34
Re: Issue 362896 in chromium: Accelerated CSS filters not working on
Android in v.34
Issue 366370 in chromium: HTMLAnchorElement ignores download attribute value
Re: Issue 362896 in chromium: Accelerated CSS filters not working on
Android in v.34
Re: Issue 346560 in chromium: Flash Player needs updating
Issue 366371 in chromium: key_silk_cases not producing frame_times on
befamous
Re: Issue 365407 in chromium: browser_tests/interactive_ui_tests should set
the override redirect flag on root windows.
Re: Issue 259529 in chromium: Autofill dropdown in rAc dialog is hard to
dismiss.
Re: Issue 351475 in chromium: GSUtil giving error 403 AccessDenied for
external partners
Re: Issue 366361 in chromium: VideoRendererImplTest.Rebuffer is flaky on
Android
Re: Issue 1945 in chromium: Alt + Down Arrow in Combo box doesnot drop down
the option box
Re: Issue 259529 in chromium: Autofill dropdown in rAc dialog is hard to
dismiss.
Re: Issue 366367 in chromium: Purging .pyc files causes benchmarks to hang
Re: Issue 239179 in chromium: Use Python for page sets instead of JSON
Re: Issue 366370 in chromium: HTMLAnchorElement ignores download attribute
value
Issue 366372 in chromium: Mac rasterize_and_record_micro.key_silk_cases
crashing
Issue 366373 in chromium: smoothness.key_silk_cases not running on GN
anymore
Re: Issue 366373 in chromium: smoothness.key_silk_cases not running on GN
anymore
Re: issue 359710 in chromium: Ensure that PPB_Audio uses PP_ThreadFunctions
properly in Non-SFI NaCl
Re: Issue 362896 in chromium: Accelerated CSS filters not working on
Android in v.34
Re: Issue 366080 in chromium: Regression [r172041]: layer squashing breaks
repaint in some cases
Re: Issue 351143 in chromium: Performance Dashboard broken on ChromeOS
Re: Issue 366367 in chromium: Purging .pyc files causes benchmarks to hang
Issue 366374 in chromium: sports.yahoo.com tab crash in
tough_pinch_zoom_cases
Issue 366375 in chromium: `git-rebase-update` should provide intermediate
status for long git-fetch operations
Re: Issue 366372 in chromium: Mac rasterize_and_record_micro crashing
Re: Issue 336368 in chromium: Very bad performance the last 3 days
Re: Issue 366372 in chromium: Mac rasterize_and_record_micro crashing
Re: Issue 351143 in chromium: Performance Dashboard broken on ChromeOS
Re: Issue 336368 in chromium: Very bad performance the last 3 days
Re: Issue 366372 in chromium: Mac rasterize_and_record_micro crashing
Re: Issue 358268 in chromium: Helper extension shows up on every single
page load even when hotwording is not enabled
Re: Issue 365959 in chromium: the focus background of candidate window
disappear on mouse hover
Re: Issue 366056 in chromium: Regression: GPU Process and AdjustOOMScore
isn't execute in linux.
Issue 366377 in chromium: In chrome:extensions page with high DPi enabled
test overlaps with webstore icon.
Re: Issue 364716 in chromium: WebViewPlugin returns a null layerTreeView.
Re: Issue 358268 in chromium: Helper extension shows up on every single
page load even when hotwording is not enabled
Re: Issue 351143 in chromium: Performance Dashboard broken on ChromeOS
Re: Issue 329697 in chromium: Add metric to track use of mobile vs. desktop
sites
Re: Issue 366343 in chromium: Add usage statistics for meta viewport values
Re: Issue 352769 in chromium: scheduler.tough_scheduling_cases fails on
Android Nexus5 Perf
Re: Issue 327903 in chromium: Thai Omnibox input doesn't automatically
select inline autocompletion text.
Re: Issue 352769 in chromium: scheduler.tough_scheduling_cases fails on
Android Nexus5 Perf
Re: Issue 366377 in chromium: In chrome:extensions page with high DPi
enabled test overlaps with webstore icon.
Re: Issue 366377 in chromium: In chrome:extensions page with high DPi
enabled test overlaps with webstore icon.
Re: Issue 234505 in chromium: DevTools should allow inspecting flattened
Shadow DOM trees
Re: Issue 364713 in chromium: Add baytrail devices to power pool
Re: Issue 267773 in chromium: [Meta bug] Replace android_commands.py
Issue 366378 in chromium: Pushlive should use bandaid
Issue 366379 in chromium: run_recipe / annotated_run should error out if
the recipe name ends with '.py'
Re: Issue 315025 in chromium: Why does requestAnimationFrame go on
walkabout every so often?
Re: Issue 366373 in chromium: smoothness.key_silk_cases not running on GN
anymore
Re: Issue 366201 in chromium: Decrease the priority of the qav suite
Issue 366380 in chromium: Linux Scheduler.tough_scheduling_cases
simple_touch_drag assertion error
Re: Issue 365913 in chromium: The Minimize/Maximize/Restore buttons don't
work if a theme is installed in Chrome on Windows high DPI
Re: Issue 358460 in chromium: Separate repaint and layout requirements in
StyleDifference
Re: Issue 267773 in chromium: [Meta bug] Replace android_commands.py
--
--
Automated mail from issue updates at http://crbug.com/
Subscription options: http://groups.google.com/a/chromium.org/group/chromium-bugs

To unsubscribe from this group and stop receiving emails from it, send an email to chromium-bugs+***@chromium.org.
c***@googlecode.com
2014-04-24 21:27:30 UTC
Permalink
Your project notifications generated too many emails to send
individually. Here are the subject lines of the emails you would have
received:

Re: Issue 366331 in chromium: M34: HWTest [bvt] failing on several boards
Re: Issue 362444 in chromium: Feedback app turns blank after quitting
browser and browser behaves unresponsive
Re: Issue 366331 in chromium: M34: HWTest [bvt] failing on several boards
Re: Issue 366331 in chromium: M34: HWTest [bvt] failing on several boards
Re: Issue 353598 in chromium: [Daisy] no image on external monitor after
suspend/unplug/resume/plug 2 times and switching display mode
Re: Issue 363056 in chromium: Line gets added when user selects Underline
formatting and hits spacebar
Re: Issue 366416 in chromium: YUV420/422 videos are offset by half a pixel
when composited
Re: Issue 366331 in chromium: M34: HWTest [bvt] failing on several boards
Re: Issue 285408 in chromium: 'git cl push' seemed to succeed but actually
did nothing
Re: Issue 366331 in chromium: M34: HWTest [bvt] failing on several boards
Re: Issue 359613 in chromium: WebGL vertex attrib array enabled states
inconsistent with underlying graphics driver
Re: Issue 361720 in chromium: Fullscreen chrome cut off on the edges with
64-bit chrome.
Re: Issue 366331 in chromium: M34: HWTest [bvt] failing on several boards
Re: Issue 366331 in chromium: M34: HWTest [bvt] failing on several boards
Re: Issue 366331 in chromium: M34: HWTest [bvt] failing on several boards
Re: Issue 366331 in chromium: M34: HWTest [bvt] failing on several boards
Re: Issue 362668 in chromium: Give TilingData a Rect instead of a Size
Re: Issue 338057 in chromium: Re-enable testRasterizeAndRecordMicro
Re: Issue 141178 in chromium: High CPU usage of Browser process in Chrome
Task manager
Re: Issue 366331 in chromium: M34: HWTest [bvt] failing on several boards
Re: Issue 362269 in chromium: chromeos-install fails with "Unable to detect
device type"
Re: Issue 365444 in chromium: Chrome_Mac: Crash Report - Silverlight crash
in _NPN_ReleaseObject
Re: Issue 365444 in chromium: Chrome_Mac: Crash Report - Silverlight crash
in _NPN_ReleaseObject
Issue 366844 in chromium: Synced Notifications toasting again
Re: Issue 366331 in chromium: M34: HWTest [bvt] failing on several boards
Re: Issue 336654 in chromium: Sync recovery mode install device selection
logic to chromeos-install
Re: Issue 366133 in chromium: chromeSDK failure - fatal error:
bits/predefs.h
Re: Issue 365444 in chromium: Chrome_Mac: Crash Report - Silverlight crash
in _NPN_ReleaseObject
Re: Issue 365444 in chromium: Chrome_Mac: Crash Report - Silverlight crash
in _NPN_ReleaseObject
Re: Issue 366841 in chromium: aura: Use WindowTargeter to block events from
going to a window
Re: Issue 359163 in chromium: Chrome zooms in way too close when typing
into pop up text windows
Re: Issue 360270 in chromium: Docs: need to support whole directory
redirects
Re: Issue 358109 in chromium: Properties added to the TextTrackCue object
is undefined in cue.onenter callback
Re: Issue 365914 in chromium: Chrome does not restore windows in the right
place
Re: Issue 323782 in chromium: dromaeo.domcoremodify failing on Win7 Perf (3)
Re: Issue 353398 in chromium: [Mirror] Update user menu UI
Re: Issue 137373 in chromium: -webkit-animation shorthand is wrong when
only -webkit-animation-delay is set
Re: Issue 356791 in chromium: Prototype/test Domain Reliability /
Navigation Error Logging with Google sites
Re: Issue 356894 in chromium: Omnibox prerenders should get
abandoned/cancelled when the user's done using the omnibox
Re: Issue 366662 in chromium: Interrupted Basic Authorization sends wrong
Host header field
Re: Issue 365914 in chromium: Chrome does not restore windows in the right
place
Re: Issue 356894 in chromium: Omnibox prerenders should get
abandoned/cancelled when the user's done using the omnibox
Re: Issue 353398 in chromium: [Mirror] Update user menu UI
Re: Issue 356791 in chromium: Prototype/test Domain Reliability /
Navigation Error Logging with Google sites
Re: Issue 132145 in chromium: Upgrade ICU to version 52.x
Re: Issue 366430 in chromium: 13%-16% regression in blink_perf at
264824:264859
Re: Issue 361890 in chromium: a message in notification gets truncated
Re: Issue 137373 in chromium: -webkit-animation shorthand is wrong when
only -webkit-animation-delay is set
Re: Issue 366662 in chromium: Interrupted Basic Authorization shows wrong
URL in omnibox
Re: Issue 361026 in chromium: Regression: While hovering the mouse, over
opened dropdown, 'Focus line' remains at some of the positions in 'Dev
tools'
Re: Issue 365920 in chromium: Session has ended modal becomes unresponsive
Re: Issue 323782 in chromium: dromaeo.domcoremodify failing on Win7 Perf (3)
Re: Issue 137373 in chromium: -webkit-animation shorthand is wrong when
only -webkit-animation-delay is set
Re: Issue 365931 in chromium: linux: 'Dumping breakpad symbols
to "libremoting_host_plugin.x64.so.breakpad.x64"' warns when building with
clang
Re: Issue 362664 in chromium: Viewport Tiling
Re: Issue 365681 in chromium: touchcancel incorrectly reports
cancelable=true
Re: Issue 178358 in chromium: A pop up message "Google Chrome wants to use
your confidential information stored in your keychain. Do you want to allow
access to this item?" appears persistently
Re: Issue 110324 in chromium: "Reopen the pages that were open last" fails
Re: Issue 366846 in chromium: 38%-69% regression in startup.warm.blank_page
at 263474:263540
Issue 366846 in chromium: 38%-69% regression in startup.warm.blank_page at
263474:263540
Re: Issue 365681 in chromium: touchcancel incorrectly reports
cancelable=true
Re: Issue 362664 in chromium: Viewport Tiling
Re: Issue 362870 in chromium: IE Popcorn benchmark slow due to
rasterization and time-in-js
Re: Issue 178358 in chromium: A pop up message "Google Chrome wants to use
your confidential information stored in your keychain. Do you want to allow
access to this item?" appears persistently
Re: Issue 366846 in chromium: 38%-69% regression in startup.warm.blank_page
at 263474:263540
Re: Issue 365914 in chromium: Chrome does not restore windows in the right
place
Re: Issue 366432 in chromium: Support Ubuntu 14.04 in CRD host
Re: Issue 366614 in chromium: Add browser tests for default wallpaper
customization
Re: Issue 321294 in chromium: Crash with Matrox Power Desk software
(TripleHead2Go and DualHead2Go devices)
Re: Issue 366101 in chromium: Regression: Distorted map preview is
displayed for old maps.google.com site after dragging pegman on maps
Re: Issue 366331 in chromium: M34: HWTest [bvt] failing on several boards
Re: Issue 366614 in chromium: Add browser tests for default wallpaper
customization
Re: Issue 366331 in chromium: M34: HWTest [bvt] failing on several boards
Issue 366848 in chromium: Send screen info updates to the renderer
separately from resize
Re: Issue 353470 in chromium: Regression:Frame of video is partially
visible.
Re: Issue 366841 in chromium: aura: Use WindowTargeter to block events from
going to a window
Re: Issue 365738 in chromium: can not boot from image installed by
chromeos-install on usb or ssd/emmc after make_dev_firmware.sh
Re: Issue 353598 in chromium: [Daisy] no image on external monitor after
suspend/unplug/resume/plug 2 times and switching display mode
Re: Issue 362182 in chromium: "Out of the box", AFE is not running.
Re: Issue 364248 in chromium: geoapis.appspot.com fails on Nexus 5 in tough
canvas cases.
Issue 366849 in chromium: Create an AppEngine Master Status webpage
Re: Issue 360240 in chromium: Pepper sometimes supplies an incorrect clip
rect on M35
Re: Issue 360270 in chromium: Docs: need to support whole directory
redirects
Re: Issue 110995 in chromium: fillText() does not ignore null as the
maxWidth parameter
Re: Issue 363593 in chromium: Time stamp disappears momentarily from shelf
and does not appear back instantly in Ash mode
Re: Issue 127016 in chromium: Bluetooth: Need to be able to add HID devices
at OOBE (UI)
Re: Issue 355719 in chromium: Add input latency bechmark for a simple
pepper plugin
Re: Issue 342881 in chromium: WebGL conformance test crashes browser on
Android, reported as OK.
Re: Issue 363535 in chromium: Regression : Header of 'Dev Tools' disappears
after clicking on the icon 'colorpicker'.
Re: Issue 361161 in chromium: tough_canvas_cases produces no frame_times on
geoapis.appspot.com
Re: Issue 127016 in chromium: Bluetooth: Need to be able to add HID devices
at OOBE (UI)
Re: Issue 359940 in chromium: Regression: Transition of image moves from
its actual position on clicking 'Multi-Flip' option.
Re: Issue 366715 in chromium: page_cycler.intl_hi_ru timing out on Windows
Re: Issue 366375 in chromium: `git-rebase-update` should provide
intermediate status for long git-fetch operations
Re: Issue 364016 in chromium: Regression:User redirects to a wrong page on
pressing back navigation button
Re: Issue 366415 in chromium: 6%-50% regression in indexeddb_perf at
263840:264818
Re: Issue 363611 in chromium: git setup step can only be used once per
recipe execution
Re: Issue 100845 in chromium: Determine and store the country code of a new
countryless autofill profile
Issue 366853 in chromium: 40% regression in session_restore.warm.typical_25
at 261722:261821
Re: Issue 366853 in chromium: 40% regression in
session_restore.warm.typical_25 at 261722:261821
Issue 366852 in chromium:
WebglConformance.conformance_textures_tex_image_and_sub_image_2d_with_video
crashing intermittently on Android
Re: Issue 366853 in chromium: 40% regression in
session_restore.warm.typical_25 at 261722:261821
--
--
Automated mail from issue updates at http://crbug.com/
Subscription options: http://groups.google.com/a/chromium.org/group/chromium-bugs

To unsubscribe from this group and stop receiving emails from it, send an email to chromium-bugs+***@chromium.org.
c***@googlecode.com
2014-04-25 01:06:15 UTC
Permalink
Your project notifications generated too many emails to send
individually. Here are the subject lines of the emails you would have
received:

Re: Issue 366910 in chromium:
chrome!WebCore::RenderLayerClipper::localClipRect [LayoutUnit.h : 230 + 0x0]
Issue 366940 in chromium: coreboot: smbios: Allow custom Type 3 / System
Enclosure or Chassis Type Entry
Re: Issue 366910 in chromium:
chrome!WebCore::RenderLayerClipper::localClipRect [LayoutUnit.h : 230 + 0x0]
Re: Issue 366259 in chromium: PolicyManager: Add shared functionality for
setting expectations / testing Variable instances
Re: Issue 359176 in chromium: AppListSyncableService should handle OTR
profiles
Re: Issue 347641 in chromium: Remove screenshare flag from about:flags
[was "Move screenshare flag to be dev/beta-only"]
Re: Issue 366939 in chromium: SvgTextElement.getComputedTextLength returns
bad values for Arabic text
Re: Issue 366910 in chromium:
chrome!WebCore::RenderLayerClipper::localClipRect [LayoutUnit.h : 230 + 0x0]
Issue 366941 in chromium: Bisect bot should have an option to use ToT
Telemetry
Re: Issue 115029 in chromium: Action attribute is empty in the DOM after
POST
Re: Issue 359560 in chromium: chrome.hid : device identification is not
consistent across platforms
Issue 366942 in chromium: Changing the connectivity order and getting
captive portal status
Re: Issue 363822 in chromium: Set up GitWeb/ViewVC instance to compare
performance to Gitiles Blame
Re: Issue 360348 in chromium: Google Night Walk breaks system volume
control (even in other apps) and "OK, Google" in Google Now
Re: Issue 366750 in chromium: The EBML discard padding element should be a
signed integer, not unsigned.
Re: Issue 359560 in chromium: chrome.hid : device identification is not
consistent across platforms
Re: Issue 366750 in chromium: The EBML discard padding element should be a
signed integer, not unsigned.
Re: Issue 366943 in chromium: 2%-7% regression in page_cycler.morejs at
265154:265187
Issue 366943 in chromium: 2%-7% regression in page_cycler.morejs at
265154:265187
Issue 366944 in chromium: Autofill not working
Re: Issue 366943 in chromium: 2%-7% regression in page_cycler.morejs at
265154:265187
Re: Issue 366750 in chromium: The EBML discard padding element should be a
signed integer, not unsigned.
Re: Issue 363623 in chromium: Sometimes tab drag does not end when mouse is
released on Linux Aura only
Re: Issue 139706 in chromium: print preview dialog for window.print()
should be modal
Re: Issue 365824 in chromium: Print preview blocks JS in other tabs.
Re: Issue 365621 in chromium: Print. Dead tab after click on print-button
with window.print() and close print-tab
Re: Issue 359627 in chromium: Version 34 page seems hung after Print dialog
box is opened & closed
Re: Issue 366942 in chromium: Changing the connectivity order and getting
captive portal status
Re: Issue 364465 in chromium: Cloud Printer Driver fails with Error status
(used to work)
Issue 366945 in chromium: 4% regression in cc_perftests at 264906:264913
Re: Issue 366945 in chromium: 4% regression in cc_perftests at 264906:264913
Re: Issue 357706 in chromium: Missing dependency in isolates?
Re: Issue 366945 in chromium: 4% regression in cc_perftests at 264906:264913
Re: Issue 366377 in chromium: In chrome:extensions page with high DPi
enabled test overlaps with webstore icon.
Re: Issue 360302 in chromium: PreCQ Coverage for BeagleBone
Re: Issue 336661 in chromium: [Pinch-to-zoom] Pinch-zoom overlay scrollbars
should only be visible on non-Clank when page scale > 1
Re: Issue 366750 in chromium: The EBML discard padding element should be a
signed integer, not unsigned.
Re: Issue 366504 in chromium: MTPFileStreamReader::Read should return 0
instead of error on read-from-eof.
Re: Issue 366504 in chromium: MTPFileStreamReader::Read should return 0
instead of error on read-from-eof.
Re: Issue 366424 in chromium: Bluetooth: The first key for the User Passkey
Notification while trying to connect to "Dell Tablet Wireless Keyboard" is
blue colored
Re: Issue 233006 in chromium: BlueZ does not send notification that a User
Passkey Notification has started
Re: Issue 364772 in chromium: No mouseover to distinguish identical
directories in print to file menu
Re: Issue 364772 in chromium: No mouseover to distinguish identical
directories in print to file menu
Issue 366947 in chromium: PSL matching should only apply to HTML forms
Re: Issue 366504 in chromium: MTPFileStreamReader::Read should return 0
instead of error on read-from-eof.
Re: Issue 365567 in chromium: Domain name of Korean is keeping holding on
address bar as Korean.
Re: Issue 312302 in chromium: Give focus to chat icon in People search
Re: Issue 366942 in chromium: Changing the connectivity order and getting
captive portal status
Re: Issue 139706 in chromium: print preview dialog for window.print()
should be modal
Re: Issue 365250 in chromium: Server control not working while printing
document
Re: Issue 316085 in chromium: Touch events not being properly released on
some devices, leading to touch input hanging.
Re: Issue 363822 in chromium: Set up GitWeb/ViewVC instance to compare
performance to Gitiles Blame
Re: Issue 361538 in chromium: [Android] Content download canceled
Re: Issue 366449 in chromium: Create sync points without a roundtrip to the
GPU Service I/O thread
Re: Issue 348553 in chromium: ASSERTION FAILED: !m_isDelayingLoadEvent,
UNKNOWN in bool url_util::DoIsStandard<char>
Re: Issue 363822 in chromium: Set up GitWeb/ViewVC instance to compare
performance to Gitiles Blame
Issue 366952 in chromium: HTML5 color picker isn't using a native window
Re: Issue 139706 in chromium: print preview dialog for window.print()
should be modal
Re: Issue 360663 in chromium: Create assets for maximized short Chrome
header
Re: Issue 310944 in chromium: Fullscreen mode in some Thai websites broken
on iOS
Re: Issue 132145 in chromium: Upgrade ICU to version 52.x
Re: Issue 366449 in chromium: Create sync points without a roundtrip to the
GPU Service I/O thread
Re: Issue 107091 in chromium: Editing a specific input field causes an
onclick-event-button to stop working.
Re: Issue 364751 in chromium: components_unittests leaks threads and breaks
NaClNonSfiSandboxTest.*
Re: Issue 366942 in chromium: Changing the connectivity order and getting
captive portal status
Re: Issue 92738 in chromium: text will not paste into search box on
amazon.com
Re: Issue 92808 in chromium: Paste enter symbol in <input type="text"
Issue 366954 in chromium: chromium.lkgr's build triggering mechanism is
completely insane
Re: Issue 366954 in chromium: chromium.lkgr's build triggering mechanism is
completely insane
Re: Issue 363898 in chromium: Text disappears from time to time
Re: Issue 366718 in chromium: All text printed with system dialog on
windows randomly transformed.
Re: Issue 360416 in chromium: Print output is garbled regardless of printer
used with --enable-direct-write
Issue 366955 in chromium: Crash in webrtc::StatsCollector::ExtractVoiceInfo
Re: Issue 364575 in chromium: Android GN perf - device offline
Re: Issue 366575 in chromium: REGRESSION:Google Cloud Print Page Showing
Error When Opened from Chrome://Devices in a Signed-In Profile
Re: Issue 143281 in chromium: onerror event doesn't trigger in the
(extension) context of a chrome event listener
Re: Issue 365235 in chromium: Show console messages from ServiceWorker on
serviceworker-internals
Re: Issue 359343 in chromium: UE build shouldn't link delta_generation code
on production update_engine binary
Re: Issue 362108 in chromium: EC & BIOS Update for Pixel
Re: Issue 360416 in chromium: Print output is garbled regardless of printer
used with --enable-direct-write
Re: Issue 366571 in chromium: ASSERTION FAILED: m_purgePreventCount in
WebCore::FontCache::fontDataFromFontPlatformData
Re: Issue 170859 in chromium: Don't generate EMF in renderer process
printing from print preview.
Re: Issue 237391 in chromium: Frequent Chrome automation timeouts in
SkipToLogin in VMTest
Re: Issue 366498 in chromium: Let the Selection.deleteFromDocument behavior
follow the current spec.
Re: Issue 353398 in chromium: [Mirror] Update user menu UI
Re: Issue 366382 in chromium: Diagnose errors may allow a user to break out
of a kiosk app.
Re: Issue 335624 in chromium: Win 7 Low-End Perf (1) fails dom_perf
Re: Issue 366205 in chromium: ozone: DRI implementation is too slow
Re: Issue 335624 in chromium: Win 7 Low-End Perf (1) fails dom_perf
Re: Issue 366205 in chromium: ozone: DRI implementation is too slow
Re: Issue 365235 in chromium: Show console messages from ServiceWorker on
serviceworker-internals
Re: Issue 366382 in chromium: Diagnose errors may allow a user to break out
of a kiosk app.
Re: Issue 343376 in chromium: elan_i2c : need firmware update feature and
related sysfs nodes
Issue 366956 in chromium: The screensharing request popup should not be
allowed to go behind a window
Re: Issue 338529 in chromium: MediaSource API may delay video frames until
further frames are received
Re: Issue 129174 in chromium: Support TLS Channel ID
Re: Issue 366395 in chromium: chromium/src PRESUBMIT should check the
validity of the JSON files in testing/buildbot/*
Re: Issue 366959 in chromium: 13%-21% regression in blink_perf at
237294:253532
Issue 366959 in chromium: 13%-21% regression in blink_perf at 237294:253532
Re: Issue 366959 in chromium: 13%-21% regression in blink_perf at
237294:253532
Re: Issue 361862 in chromium: Telemetry not logging in for power_LoadTest
Re: Issue 338529 in chromium: MediaSource API may delay video frames until
further frames are received
--
--
Automated mail from issue updates at http://crbug.com/
Subscription options: http://groups.google.com/a/chromium.org/group/chromium-bugs

To unsubscribe from this group and stop receiving emails from it, send an email to chromium-bugs+***@chromium.org.
c***@googlecode.com
2014-04-25 18:04:06 UTC
Permalink
Your project notifications generated too many emails to send
individually. Here are the subject lines of the emails you would have
received:

Re: Issue 367169 in chromium: URL shortcut is not opened when "Continue
where you left off" is enabled on Mac
Re: Issue 367039 in chromium: Regression : All tabs are getting crashed
after clicking on "record" button in chrome://tracing
Re: Issue 340414 in chromium: first-line incorrectly overrides :before
styles
Re: Issue 366439 in chromium: Flaky tests are breaking the Blink CQ
Re: Issue 365474 in chromium: ASSERTION FAILED: clipRectsContext.rootLayer
== m_clipRectsCache->m_clipRectsRoot[clipRectsType]
Re: Issue 340414 in chromium: first-line incorrectly overrides :before
styles
Issue 367195 in chromium: Flaky tests are causing Blink CQ jobs to fail
Re: Issue 281676 in chromium: Issues with launchWebAuthFlow
Re: Issue 367181 in chromium: lastError Checking is too aggressive based
off of reasonable API use
Re: Issue 367176 in chromium: MSE - 'pipeline: decode error' for no
(apparent) reasons
Re: Issue 332992 in chromium: Implement voice announcement for overview mode
Re: Issue 367195 in chromium: Flaky tests are causing Blink CQ jobs to fail
Re: Issue 359159 in chromium: Land histograms to track version changes in
safe-browsing store and prefixset files.
Re: Issue 346552 in chromium: VMTest performance on CQ regressed to ~40
minutes
Issue 367196 in chromium: Set GrContext cache size to zero when OOM
Re: Issue 366939 in chromium: SvgTextElement.getComputedTextLength returns
bad values for Arabic text
Re: Issue 184812 in chromium: Detect backspace keydown event at the
beginning of text input
Re: Issue 367049 in chromium: BIG PROBLEM! Popup windows created by
extensions now contain visible adressbar
Re: Issue 367173 in chromium: Maps.maps_001 is failing due to recent
changes to window.screen
Re: Issue 359156 in chromium: Remove support for reading safe browsing
version 7 stores in M-37.
Re: Issue 365237 in chromium: perf jsgamebench started to time-out in
IsJavaScriptExpressionTrue (all platforms)
Re: Issue 346552 in chromium: VMTest performance on CQ regressed to ~40
minutes
Issue 367197 in chromium: Error console inspect doesn't scroll to the line
with the error
Re: Issue 364224 in chromium: Spike in renderer memory corruptions
Re: Issue 344036 in chromium: [Butterfly] "Removable device detected"
notification when logging in after a power down. Notification is persistent
Issue 367198 in chromium: Veto gpu rasterization per page
Re: Issue 359743 in chromium: Replace "Learn More" with "No Thanks" in the
Flywheel promo
Issue 367199 in chromium: COM Initialization errors in
StatusTrayStateChangerWinTest
Re: Issue 366276 in chromium: Observing UI glitch in media player
Re: Issue 359743 in chromium: Replace "Learn More" with "No Thanks" in the
Flywheel promo
Re: Issue 367181 in chromium: lastError Checking is too aggressive based
off of reasonable API use
Re: Issue 346405 in chromium: Remove support for reading v1 PrefixSet files
for M-37.
Re: Issue 344036 in chromium: [Butterfly] "Removable device detected"
notification when logging in after a power down. Notification is persistent
Issue 367200 in chromium: Delete hybrid (sw + gpu) rasterization
Re: Issue 179473 in chromium: Add convenient key combinations for common
characters such as em-dashes
Re: Issue 367181 in chromium: lastError Checking is too aggressive based
off of reasonable API use
Re: Issue 367200 in chromium: Delete hybrid (sw + gpu) rasterization
Issue 367201 in chromium: fast/images/repaint-subrect-grid.html is newly
flaky
3 issues changed in chromium
Re: Issue 366676 in chromium: Wrong question when user use email adress as
url
Re: Issue 353640 in chromium: no place to see component extensions
Re: Issue 344036 in chromium: [Butterfly] "Removable device detected"
notification when logging in after a power down. Notification is persistent
Re: Issue 367030 in chromium: REGRESSION:Smaller Sized <less than 10
kb>Images get displaced or disappear in Mosaic mode,on Mouse hover
Re: Issue 366895 in chromium: repair failed on peppy booting from USB
Issue 367202 in chromium: Update trigger for gpu rasterization
Re: Issue 367181 in chromium: lastError Checking is too aggressive based
off of reasonable API use
Issue 367203 in chromium: Permission bubbles on Mac don't align with page
info icon properly
Re: Issue 333619 in chromium: HTML video YV12 decoding is incorrect at HD
resolutions
Re: Issue 367201 in chromium: fast/images/repaint-subrect-grid.html is
newly flaky
Re: Issue 344036 in chromium: [Butterfly] "Removable device detected"
notification when logging in after a power down. Notification is persistent
Re: Issue 367005 in chromium: [bvt] login_OwnershipNotRetaken Failure on
daisy_spring-chrome-pfq/R36-5793.0.0-rc2
Re: Issue 358728 in chromium: Telemetry: Timed out going through login
screen
Issue 367205 in chromium: RDP Replies are not acknowledged when
Network.enable is turned on
Re: Issue 367176 in chromium: MSE - 'pipeline: decode error' for no
(apparent) reasons
Re: Issue 366952 in chromium: HTML5 color picker isn't using a native window
Re: Issue 365434 in chromium: Hardware Accelerated Decode: Seeking near the
end of a some variable framerate videos never completes
Re: Issue 362225 in chromium: ASSERTION FAILED: !m_normalFlowListDirty
Issue 367206 in chromium: cmd+shift+[ or ] shortcut doesn't work with
permission bubble visible
Re: Issue 367207 in chromium: 4% regression in indexeddb_perf at
265930:265959
Issue 367207 in chromium: 4% regression in indexeddb_perf at 265930:265959
Re: Issue 367207 in chromium: 4% regression in indexeddb_perf at
265930:265959
Re: Issue 352814 in chromium: elan_i2c : need to sync back driver changes
to chromeos-3.8
Re: Issue 327903 in chromium: Thai Omnibox input doesn't automatically
select inline autocompletion text.
Re: Issue 367174 in chromium: Tests aborting on HW tests
Re: Issue 366141 in chromium: Suite aborts from a timeout without any other
failures
Re: Issue 343376 in chromium: elan_i2c : need firmware update feature and
related sysfs nodes
Re: Issue 348914 in chromium: about:gpu doesn't report sanboxing status
correctly on OSX
Re: Issue 360013 in chromium: Canvas clipping ignored
Re: Issue 351915 in chromium: Evaluation changes when performing equality
checks objects created repeatedly.
Re: Issue 266666 in chromium: Need to handle 'ExitCompositing' on Android
Issue 367209 in chromium: Next tab inline crashed when draging tab out of
window
Re: Issue 367005 in chromium: [bvt] login_OwnershipNotRetaken Failure on
daisy_spring-chrome-pfq/R36-5793.0.0-rc2
Re: Issue 358728 in chromium: Telemetry: Timed out going through login
screen
Re: Issue 366966 in chromium: Changelists are duplicated 3 times on GPU
bots on Blink waterfall
Re: Issue 367130 in chromium: 52% regression in blink_perf at 264376:264384
Re: Issue 367140 in chromium: 49% regression in blink_perf at 264359:264383
Re: Issue 367181 in chromium: lastError Checking is too aggressive based
off of reasonable API use
Issue 367211 in chromium: Badly behaving extension can freeze entire linux
desktop UI
Re: Issue 367199 in chromium: COM Initialization errors in
StatusTrayStateChangerWinTest
Re: Issue 367176 in chromium: MSE - 'pipeline: decode error' for no
(apparent) reasons
Re: Issue 344983 in chromium:
platform_Pkcs11InitOnLogin/platform_Pkcs11Persistence to telemetry
Re: Issue 366064 in chromium: Windowed plugins are not obscured by other
elements
Re: Issue 362108 in chromium: EC & BIOS Update for Pixel
Issue 367212 in chromium: Can trigger multiple text selection handles on
disabled native text input views.
Re: Issue 362231 in chromium: cros flash: Give more informative message on
failure because the board is not setup
Re: Issue 367200 in chromium: Delete hybrid (sw + gpu) rasterization
Re: Issue 132145 in chromium: Upgrade ICU to version 52.x
Re: Issue 367199 in chromium: COM Initialization errors in
StatusTrayStateChangerWinTest
Re: Issue 366141 in chromium: Suite aborts from a timeout without any other
failures
Re: Issue 367211 in chromium: Badly behaving extension can freeze entire
linux desktop UI
9 issues changed in chromium
Re: Issue 366868 in chromium: gpulin11 is intermittently forgetting its
hostname
Re: Issue 345811 in chromium: Opt-in checkbox to enable audio logging for
few seconds before 'Ok Google'
Re: Issue 323956 in chromium: Touch selection handles in Aura disabled
textfields
Re: Issue 367198 in chromium: Veto gpu rasterization per page
Re: Issue 367200 in chromium: Delete hybrid (sw + gpu) rasterization
Re: Issue 367212 in chromium: Can trigger multiple text selection handles
on disabled native text input views.
Re: Issue 367010 in chromium: Official Bot 8011 stable build compile
failure for All OS.
Re: Issue 365883 in chromium: Include ipv6 entries for IPConfigs in Shill
Re: Issue 132145 in chromium: Upgrade ICU to version 52.x
Re: Issue 367176 in chromium: MSE - 'pipeline: decode error' for no
(apparent) reasons
Issue 367216 in chromium: Broken canvas animation/rendering on Android
--
--
Automated mail from issue updates at http://crbug.com/
Subscription options: http://groups.google.com/a/chromium.org/group/chromium-bugs

To unsubscribe from this group and stop receiving emails from it, send an email to chromium-bugs+***@chromium.org.
c***@googlecode.com
2014-04-28 19:55:55 UTC
Permalink
Your project notifications generated too many emails to send
individually. Here are the subject lines of the emails you would have
received:

Re: Issue 367876 in chromium: chromium should use a pinned version of
depot_tools
Re: Issue 367623 in chromium: Horizontal scroll not recognized.
Re: Issue 367665 in chromium: TaskManagerExistingPrintPreview turned flaky
on mac
Re: Issue 308757 in chromium: Telemetry should allow tests to use any
username and password, and provide authentication.
Re: Issue 366125 in chromium: GPU process (watchdog) crash 10 seconds after
unplug from (SW) Monitor Mode
Re: Issue 365300 in chromium: No WebGL with Mesa 10.x and "radeon" driver
Re: Issue 366280 in chromium: Incorrect framebuffer size in mirror mode
Re: Issue 359482 in chromium: craft url may be crash
Re: Issue 308321 in chromium: There's no way to run a JS string through the
threaded html parser
Re: Issue 365509 in chromium: setMockScrollbarsEnabled does not do any
invalidation
Re: Issue 366320 in chromium: Touch text selection handles and context menu
interfere
Re: Issue 363845 in chromium: sunspider dashboard does not show anything
interesting for chromeos boards
Issue 367903 in chromium: Layout Test web-animations-api/timeline-time.html
is flaky
Re: Issue 367903 in chromium: Layout Test
web-animations-api/timeline-time.html is flaky
Re: Issue 363750 in chromium: CoreAnimation: Download shelf does not have
anti-aliased text
Re: Issue 363750 in chromium: CoreAnimation: Download shelf does not have
anti-aliased text
Re: Issue 297782 in chromium: Unwanted extra spacing when using
-webkit-column-count
Re: Issue 367072 in chromium: In " www.forbes.com " after scrolling
up/down ,black header patch seen in between the webpage
Re: Issue 19541 in chromium: Search engines are not imported from Firefox
if it's installed in Non-Admin
Re: Issue 329175 in chromium: Search engine import from Firefox does't work
any more
Re: Issue 367640 in chromium: Regression:UI glitch observed when you click
on Chrome Autofill settings option on the autofill page.
Re: Issue 363845 in chromium: sunspider dashboard does not show anything
interesting for chromeos boards
Re: Issue 367904 in chromium: 3% regression in dromaeo.domcoreattr at
262652:262847
Issue 367904 in chromium: 3% regression in dromaeo.domcoreattr at
262652:262847
Re: Issue 367904 in chromium: 3% regression in dromaeo.domcoreattr at
262652:262847
Issue 367907 in chromium: 7% regression in cc_perftests at 265563:265602
Re: Issue 367907 in chromium: 7% regression in cc_perftests at 265563:265602
Re: Issue 322165 in chromium: [META][CSS Shapes] Implement new syntax for
CSS Shapes
Re: Issue 367623 in chromium: Horizontal scroll not recognized.
Re: Issue 367072 in chromium: In " www.forbes.com " after scrolling
up/down ,black header patch seen in between the webpage
Re: Issue 366320 in chromium: Touch text selection handles and context menu
interfere
Re: Issue 367907 in chromium: 7% regression in cc_perftests at 265563:265602
Re: Issue 367908 in chromium: 10% regression in blink_perf at 262487:262607
Issue 367908 in chromium: 10% regression in blink_perf at 262487:262607
Re: Issue 367908 in chromium: 10% regression in blink_perf at 262487:262607
Re: Issue 367705 in chromium: Regression:Text and button text shifts for
moment in chrome://devices
Issue 367909 in chromium: Dev builds don't prompt for the shared chronos
password anymore
Re: Issue 240715 in chromium: Remove glib specific main loop and OOM tests.
Re: Issue 333176 in chromium: UNKNOWN in
WebCore::SVGTransformList::calculateAnimatedValue
Re: Issue 294030 in chromium: SAP: Chrome sends conditional requests for
some cached objects before they are expired
Re: Issue 367903 in chromium: Layout Test
web-animations-api/timeline-time.html is flaky
Re: Issue 352079 in chromium: Consider clearing etagged resources from the
cache when clearing cookies.
Re: Issue 286030 in chromium: Touch handles do not disappear consistently
when mouse moves
Re: Issue 366713 in chromium: Bisect bots should bisect on functional
breakages
Re: Issue 366713 in chromium: Bisect bots should bisect on functional
breakages
Re: Issue 240715 in chromium: Remove glib specific main loop and OOM tests.
Issue 367910 in chromium: ASSERTION
FAILED: !rootForThisLayout->needsLayout() in testMeasurementSmoke
Issue 367912 in chromium: Wrong URL suggested for omnibox input "c:"
Re: Issue 341672 in chromium: document.importNode does not properly clone
templates
Re: Issue 367876 in chromium: chromium should use a pinned version of
depot_tools
Issue 367914 in chromium: No CrashIDs on chrome://crashes
Re: Issue 367910 in chromium: ASSERTION
FAILED: !rootForThisLayout->needsLayout() in testMeasurementSmoke
Re: Issue 252630 in chromium: Chromium crashes when 'e' is inputted in the
omnibox
Re: Issue 359975 in chromium: Stale resize dimensions after orientation
change
Re: Issue 252630 in chromium: Chromium crashes when 'e' is inputted in the
omnibox
Re: Issue 359975 in chromium: Stale resize dimensions after orientation
change
Re: Issue 367623 in chromium: Horizontal scroll not recognized.
Issue 367915 in chromium: Do not offer to sign-in using a Google profile
when opening a Google property in Incognito mode on Android
Re: Issue 367849 in chromium: Seen white border line at the edges of the
screen.
Re: Issue 366320 in chromium: Touch text selection handles and context menu
interfere
Re: Issue 269651 in chromium: Touch editing menu positioning is not quite
right in some cases
Issue 367918 in chromium: web-based-sign-in causes wrong template in New
Avatar Menu
Re: Issue 359424 in chromium: Can't attach my data for u to read
Re: Issue 367895 in chromium: Graph broken
Re: Issue 240715 in chromium: Remove glib specific main loop and OOM tests.
Re: Issue 364853 in chromium: Hotword extension gets disabled on launch
Re: Issue 142588 in chromium: Chrome in Windows 8 build 8400
Re: Issue 60641 in chromium: URLFixerUpper::FixupRelativeFile and FixupPath
do blocking disk IO from the UI thread
Re: Issue 367912 in chromium: Wrong URL suggested for omnibox input "c:"
Re: Issue 366101 in chromium: Regression: Distorted map preview is
displayed for old maps.google.com site after dragging pegman on maps
Re: Issue 366767 in chromium: Virtual keyboard closes dialog
Re: Issue 252630 in chromium: Chromium crashes when 'e' is inputted in the
omnibox
Re: Issue 112081 in chromium: Chrome extensions (chrome.tabs.executeScript)
not working when comments in script file
Re: Issue 357120 in chromium: REGRESSION:Unwanted Patches seen in LHS of
Facebook Page,While scrolling down..
Re: Issue 308710 in chromium: New WM component under src/ui
Re: Issue 365762 in chromium: Make PrefService the authoritative repository
of user-selected DSE
Re: Issue 367876 in chromium: chromium should use a pinned version of
depot_tools
Re: Issue 364498 in chromium: Crash during window snapping
Re: Issue 367876 in chromium: chromium should use a pinned version of
depot_tools
Re: Issue 366101 in chromium: Regression: Distorted map preview is
displayed for old maps.google.com site after dragging pegman on maps
Re: Issue 367876 in chromium: chromium should use a pinned version of
depot_tools
Re: Issue 367256 in chromium: file downloaded via QUIC got truncated
without error.
Re: Issue 110814 in chromium: Share a single video rendering thread per
process
Re: Issue 308710 in chromium: New WM component under src/ui
Re: Issue 365762 in chromium: Make PrefService the authoritative repository
of user-selected DSE
Re: Issue 339301 in chromium: AppShell: Design PermissionsProvider
mechanism for app_shell features
Re: Issue 367849 in chromium: Seen white border line at the edges of the
screen.
Re: Issue 339301 in chromium: AppShell: Design PermissionsProvider
mechanism for app_shell features
Re: Issue 110814 in chromium: Share a single video rendering thread per
process
Re: Issue 366767 in chromium: Virtual keyboard closes dialog
Re: Issue 366990 in chromium: Security: drive-by download
Re: Issue 272397 in chromium: embedded video is automatically downloaded
when flash is disabled
Re: Issue 356805 in chromium: Audio splice frame generation causes
ChunkDemuxerTest.OutOfOrderClusters to DCHECK when all frames have duration
Re: Issue 358268 in chromium: Helper extension shows up on every single
page load even when hotwording is not enabled
Re: Issue 361761 in chromium: Move WebFrameClient methods to
RenderFrameImpl; make RenderViewImpl not be a WebFrameClient
Issue 367923 in chromium: Remove bookmark prompt code
Re: Issue 344036 in chromium: [Butterfly] "Removable device detected"
notification when logging in after a power down. Notification is persistent
Re: Issue 357120 in chromium: REGRESSION:Unwanted Patches seen in LHS of
Facebook Page,While scrolling down..
Re: Issue 367628 in chromium: REGRESSION:Tab Crashes Closing and Reopening
Chat Box in Facebook.com
Re: Issue 344036 in chromium: [Butterfly] "Removable device detected"
notification when logging in after a power down. Notification is persistent
Re: Issue 356805 in chromium: Audio splice frame generation causes
ChunkDemuxerTest.OutOfOrderClusters to DCHECK when all frames have duration
Re: Issue 361761 in chromium: Move WebFrameClient methods to
RenderFrameImpl; make RenderViewImpl not be a WebFrameClient
--
--
Automated mail from issue updates at http://crbug.com/
Subscription options: http://groups.google.com/a/chromium.org/group/chromium-bugs

To unsubscribe from this group and stop receiving emails from it, send an email to chromium-bugs+***@chromium.org.
c***@googlecode.com
2014-04-28 23:46:55 UTC
Permalink
Your project notifications generated too many emails to send
individually. Here are the subject lines of the emails you would have
received:

Issue 368039 in chromium: Add option to omit http:// when copying from URL
bar to clipboard
Re: Issue 365738 in chromium: can not boot from image installed by
chromeos-install on usb or ssd/emmc after make_dev_firmware.sh
Re: Issue 368039 in chromium: Add option to omit http:// when copying from
URL bar to clipboard
Issue 368040 in chromium: `cros flash` fails on local image files
Re: Issue 368025 in chromium: Notification buttons lose mouse hover state
when updated, making buttons hard to press
Re: Issue 368020 in chromium: git-cl upload is producing a bad patch
Re: Issue 368004 in chromium: Device looses networking, screen goes white
Re: Issue 368037 in chromium: gpu memory tests broken on mac bots
Re: Issue 364077 in chromium: Mario: AU tests failures
Re: Issue 358658 in chromium: [Linux] Pressing Alt then Space should open
the top-left Restore/Move/Size/Minimize/Maximize menu
Re: Issue 368004 in chromium: Device looses networking, screen goes white
Re: Issue 342910 in chromium: Re-add a full update test to the au test
suite.
Re: Issue 366489 in chromium: chromium_presubmit fails with spurious OWNERS
check
Re: Issue 367967 in chromium: Cannot set Chrome to be the default browser
Re: Issue 367877 in chromium: Repeated crashes and freezes
Re: Issue 368004 in chromium: Device looses networking, screen goes white
Re: Issue 368042 in chromium: 15% regression in naclperf at 13034:13035
Issue 368042 in chromium: 15% regression in naclperf at 13034:13035
Re: Issue 368004 in chromium: Device looses networking, screen goes white
Re: Issue 368042 in chromium: 15% regression in naclperf at 13034:13035
Re: Issue 346405 in chromium: Remove support for reading v1 PrefixSet files
for M-37.
Issue 368044 in chromium: Remove support for reading v2 PrefixSet files for
M-38.
Re: Issue 307746 in chromium: Certain iframed pages blink for no apparent
reason
Re: Issue 366489 in chromium: chromium_presubmit fails with spurious OWNERS
check
Re: Issue 368008 in chromium: virtual/gpu/fast/canvas/canvas-bg.html fails
because expected.html uses <canvas>
Re: Issue 146451 in chromium: ConstrainedWindow(new): Fix regressions on Mac
Re: Issue 366567 in chromium: [Mac] Browser will not full-screen while a
print dialog is open in another tab.
Re: Issue 104638 in chromium: CanFindIntranetURL() should look up dotted
hosts based only on last component
Re: Issue 364303 in chromium: Add PDU unit to stress rack
Re: Issue 367965 in chromium: fix -mtune=generic logic in board make.conf
files
Re: Issue 146451 in chromium: ConstrainedWindow(new): Fix regressions on Mac
Re: Issue 366567 in chromium: [Mac] Browser will not full-screen while a
print dialog is open in another tab.
Re: Issue 104830 in chromium: First typed navigation to an intranet host
should nuke search history terms based on that host
Issue 368045 in chromium: Sync integration tests should use RunLoop
Re: Issue 336973 in chromium: Modify IDN Unicode display algorithm to match
Firefox
Issue 368046 in chromium: Sharded Tests should be affine to a single builder
Re: Issue 365904 in chromium: WebGL Context Lost/Restore tests are flaky on
the GPU bots
Re: Issue 358281 in chromium: when i open a tap it keeps opening n opening
new tags
Re: Issue 355724 in chromium: PolicyManager: Detailed log of a policy
evaluation.
Re: Issue 364841 in chromium: Impossible to open github homepage: ssl error
Re: Issue 366857 in chromium: MSE videos are failing to load
Re: Issue 151738 in chromium: Chrome Doesn't handle Input type Number with
Step value correct with Samsung Keyboard
Re: Issue 367564 in chromium: Impossible to show decimal point on numeric
input
Re: Issue 359940 in chromium: Regression: Transition of image moves from
its actual position on clicking 'Multi-Flip' option.
Re: Issue 311213 in chromium: Make max_pending_swap_buffers_ throttle
DrawAndSwap without throttling the BeginImplFrame
Re: Issue 346799 in chromium:
WindowSizerContextMenuTest.OpenBrowserUsingContextMenuOnOtherDisplay is
flaky
Re: Issue 311213 in chromium: Make max_pending_swap_buffers_ throttle
DrawAndSwap without throttling the BeginImplFrame
Re: Issue 366315 in chromium: [TouchView] Ignore min width and height for
windows in touchview mode
Re: Issue 363772 in chromium: Remove ForceCompositingMode and
AcceleratedCompositingEnabled
Re: Issue 169282 in chromium: Impl-side painting on all platforms
Re: Issue 353470 in chromium: Regression:Frame of video is partially
visible.
Re: Issue 346799 in chromium:
WindowSizerContextMenuTest.OpenBrowserUsingContextMenuOnOtherDisplay is
flaky
Re: Issue 146127 in chromium: "Request desktop site" is not inherited to
new tabs
Re: Issue 339938 in chromium: [PtZ] incorrect rendering of fixed position
elements when zoomed
Issue 368048 in chromium: Problema con enlazamiento de archivos .swf que
contienen la letra "ñ".
Re: Issue 365189 in chromium: High CPU usage on mac Chrome
Re: Issue 368010 in chromium: Remove support for remote access of cros
telemetry
Re: Issue 367849 in chromium: Seen white border line at the edges of the
screen.
Re: Issue 368020 in chromium: git-cl upload is producing a bad patch
Re: Issue 364295 in chromium: 12%-14% regression in blink_perf at
264170:264191
Re: Issue 346226 in chromium: [Mac] Regression: Error of invalid card
number of webpage appears on internal autofill settings page
Re: Issue 367495 in chromium: Chrome will freeze Nexus 5 while attempting
to play a video.
Re: Issue 364280 in chromium: 44%-59% regression in dom_perf / page_cycler
load time at 261471:264004
Re: Issue 368020 in chromium: git-cl upload is producing a bad patch
Re: Issue 364206 in chromium: 5%-6% regression in cc_perftests
schedule_alternate_tasks_image_raster_worker at 263651:263727
Re: Issue 368020 in chromium: git-cl upload is producing a bad patch
Re: Issue 365702 in chromium: Repaint issue in Google+ notification widget
Re: Issue 366080 in chromium: Regression [r172041]: layer squashing breaks
repaint in some cases
Re: Issue 359778 in chromium: Quawks: ImportError in paygen step
Re: Issue 368040 in chromium: `cros flash` fails on local image files
Re: Issue 365551 in chromium: 19% regression in cc_perftests at
264652:264744
Re: Issue 366080 in chromium: Regression [r172041]: layer squashing breaks
repaint in some cases
Re: Issue 368020 in chromium: git-cl upload is producing a bad patch
Re: Issue 365648 in chromium: [Mac] Regression : Options of Fishbowl
experiment not getting checked/unchecked .
Re: Issue 350047 in chromium: 13% regression in
chromium-rel-xp-dual/blink_perf/Bindings_undefined-get-element-by-id at
254694:254736
Re: Issue 346226 in chromium: [Mac] Regression: Error of invalid card
number of webpage appears on internal autofill settings page
Issue 368051 in chromium: DecodingSlow BMP Test Broken
Re: Issue 353157 in chromium: Compile errors when including
third_party/smhasher/src/City.h in Chromium
Re: Issue 355901 in chromium: Iconography for Bluetooth pairing during OOBE
Issue 368052 in chromium: ASSERT that RenderObjects are only
created/destroyed during certain times
Re: Issue 361269 in chromium: Improved version of Bluetooth Pairing dialog
with visual design more consistent with CrOS virtual keyboard
Re: Issue 368031 in chromium: [Autofill] street-address for textarea
returns a comma-delimited string
Re: Issue 359778 in chromium: Quawks: ImportError in paygen step
Re: Issue 366118 in chromium: Regression: In "Google docs", options
like "font styles, alignment, font color etc..." keeps blinking on its own.
Re: Issue 368031 in chromium: [Autofill] street-address for textarea
returns a comma-delimited string
Re: Issue 368031 in chromium: [Autofill] street-address for textarea
returns a comma-delimited string
Re: Issue 247028 in chromium: chrome://extensions should tell you how you
got the extension
Re: Issue 366118 in chromium: Regression: In "Google docs", options
like "font styles, alignment, font color etc..." keeps blinking on its own.
Re: Issue 358268 in chromium: Helper extension shows up on every single
page load even when hotwording is not enabled
Re: Issue 368051 in chromium: DecodingSlow BMP Test Broken
Re: Issue 343036 in chromium: "No tabs from other devices" shown
incorrectly in "Recent tabs" menu
Re: Issue 368020 in chromium: git-cl upload is producing a bad patch
Re: Issue 367060 in chromium: [rAc suggest]: No suggestions displayed for
Non-latin characters
Re: Issue 366602 in chromium: Regression:No grey cursor highlight seen over
context menu options of chrome://apps
Re: Issue 368051 in chromium: DecodingSlow BMP Test Broken
Re: Issue 368051 in chromium: DecodingSlow BMP Test Broken
Re: Issue 366525 in chromium: Observing 2 layers in sign-in box.
Re: Issue 365701 in chromium: [meta] Regressions from layer squashing
Re: Issue 368051 in chromium: DecodingSlow BMP Test Broken
Re: Issue 366525 in chromium: Observing 2 layers in sign-in box.
Re: Issue 358268 in chromium: Helper extension shows up on every single
page load even when hotwording is not enabled
Re: Issue 365701 in chromium: [meta] Regressions from layer squashing
--
--
Automated mail from issue updates at http://crbug.com/
Subscription options: http://groups.google.com/a/chromium.org/group/chromium-bugs

To unsubscribe from this group and stop receiving emails from it, send an email to chromium-bugs+***@chromium.org.
c***@googlecode.com
2014-04-29 11:11:51 UTC
Permalink
Your project notifications generated too many emails to send
individually. Here are the subject lines of the emails you would have
received:

Re: Issue 365904 in chromium: WebGL Context Lost/Restore tests are flaky on
the GPU bots
Re: Issue 367160 in chromium: Scrollbar up/down button moves more than one
line in select element
Re: Issue 368107 in chromium: Enabling impl-side painting caused flakiness
in context lost tests on GPU bots
Re: Issue 365904 in chromium: WebGL Context Lost/Restore tests are flaky on
the GPU bots
Re: Issue 354046 in chromium: Remove NOTIFICATION_EXTENSION_UNLOADED
Re: Issue 352942 in chromium: Regression: navigator.maxTouchPoints = 1 in
Chrome Canary Desktop on Windows 7 (no touch capability)
Re: Issue 364904 in chromium: media keys aren't discovered on chrome 35 beta
Re: Issue 302437 in chromium: Feature: Extend the Commands API to support
global shortcuts
Re: Issue 329878 in chromium: Need to re-add the keybinding documentation
for apps
Re: Issue 366409 in chromium: Add mime_type_handler manifest key for
extensions.
Re: Issue 110814 in chromium: Share a single video rendering thread per
process
Issue 368188 in chromium: Since v36.0.1963.0 Tampermonkey extension is
crashing immediately after start
Re: Issue 354046 in chromium: Remove NOTIFICATION_EXTENSION_UNLOADED
Re: Issue 110814 in chromium: Share a single video rendering thread per
process
Re: Issue 366409 in chromium: Add mime_type_handler manifest key for
extensions.
Re: Issue 368114 in chromium: Crash when playing youtube videos
Re: Issue 367375 in chromium: Touch doesn't work.
Re: Issue 366184 in chromium: Windows 8 mode fails to display correctly
Re: Issue 224072 in chromium: Remove all of PyAuto
Re: Issue 224072 in chromium: Remove all of PyAuto
Re: Issue 361045 in chromium: Use tracing event instead of
InspectorInstrumentation for Timeline events
Re: Issue 368186 in chromium: Entering the suspend mode while the video is
running(pause mode).
Re: Issue 367768 in chromium: login.live.com passwords fail to save
correctly
Re: Issue 301900 in chromium: Chrome_Win: Crash Report : Stack Signature :
GrCrash(char const *)-465B79B
Re: Issue 362058 in chromium: ServiceWorker registration leaks process
reference
Re: Issue 359811 in chromium: Allow creating a SW instance without an
existing RenderProcess
Re: Issue 362060 in chromium: Don't shut down a ServiceWorker with ongoing
tasks from other documents
Re: Issue 229657 in chromium: Removed iframe's history should be removed
from the page
Re: Issue 324086 in chromium: Magnifying glass is broken to magnify/shrink
images if Chrome is not at 100% Zoom
Re: Issue 362060 in chromium: Don't shut down a ServiceWorker with ongoing
tasks from other documents
Re: Issue 301900 in chromium: Chrome_Win: Crash Report : Stack Signature :
GrCrash(char const *)-465B79B
Re: Issue 359811 in chromium: Allow creating a SW instance without an
existing RenderProcess
Re: Issue 362058 in chromium: ServiceWorker registration leaks process
reference
Re: Issue 230608 in chromium: history.replace doesn't work correctly for
empty iframe to non-empty
Re: Issue 368176 in chromium: chrome.usb.controlTransfer returns incorrect
data
Re: Issue 298218 in chromium: Chrome loses keyboard focus after switching
to another window
Issue 368189 in chromium: [QP Editing][2k3] : Extra placeholder added after
insertion of new slide having title placeholder
Re: Issue 347927 in chromium: Password Manager internals about: page (code
changes)
Re: Issue 282493 in chromium: Inspector tooltip covers content (Issue 89510
was not fixed but was closed)
Re: Issue 298218 in chromium: Chrome loses keyboard focus after switching
to another window
Re: Issue 366970 in chromium: Phantom mousemove events when task manager is
open
Re: Issue 347927 in chromium: Password Manager internals about: page (code
changes)
Re: Issue 364292 in chromium: The response from
Debugger.evaluateOnCallFrame does not match documentation
Re: Issue 356595 in chromium: Shape Tree clone
Re: Issue 364992 in chromium: CSS isn't loading properly
Issue 368191 in chromium: Translate dialog steals focus on page load
Issue 368192 in chromium: RenderTextMac crashes if given a bad Font.
Issue 368193 in chromium: [QP Editing][2k3] : File Specific - Whoops
occurs, when user insert the shape on newly added slide having title
placeholder
Issue 368194 in chromium: Window Controls are now ungrouped
Re: Issue 358681 in chromium: Invisible - paused in debugger - continue
icon when clicked
Issue 368195 in chromium: Text overlapping in slides in Chrome viewer
Issue 368197 in chromium: Password autofill: Text should not be selected
after user accepts suggestion
Re: Issue 368197 in chromium: Password autofill: Text should not be
selected after user accepts suggestion
Re: Issue 368197 in chromium: Password autofill: Text should not be
selected after user accepts suggestion
Re: Issue 368195 in chromium: Text overlapping in slides in Chrome viewer
Issue 368198 in chromium: ChromeOS browser windows are not transparent
anymore
Issue 368199 in chromium: Regression: Border of the omnibox for Pocket app
window does not display properly in Ash mode
Re: Issue 355901 in chromium: Iconography for Bluetooth pairing during OOBE
Re: Issue 340522 in chromium: Move DOM objects to oilpan
Re: Issue 313687 in chromium: Single level list - List alignment (Left,
Center, Right)
Re: Issue 313689 in chromium: Single level list - Delete list item
Re: Issue 313690 in chromium: Single level list - Edit list item
Re: Issue 42043 in chromium: Closing a tab with Quicktime plugin loaded
causes the plugin to crash
Re: Issue 313691 in chromium: Single level list - Backspace/Enter key
support in list
Re: Issue 313694 in chromium: Single level list - Select list item
Re: Issue 335540 in chromium: QP Editing - Insert new paragraph
Re: Issue 367810 in chromium: Restoring multiple tabs after a crash is slow
to unstable
Re: Issue 363559 in chromium: QP Editing : User is unable to enter the
text in slide for Placeholder having shapes in master
Re: Issue 367629 in chromium: Remove color profiles from exif-orientation
layout test images
Issue 368200 in chromium: Regression: Distortion observed on hovering 'page
switcher' of chrome:apps page while going fullscreen.
Re: Issue 367305 in chromium: Different results with image selection
(sizes/srcset)
Re: Issue 367629 in chromium: Remove color profiles from exif-orientation
layout test images
Re: Issue 368199 in chromium: Regression: Border of the omnibox for Pocket
app window does not display properly in Ash mode
Re: Issue 368193 in chromium: [QP Editing][2k3] : File Specific - Whoops
occurs, when user insert the shape on newly added slide having title
placeholder
Re: Issue 367305 in chromium: Different results with image selection
(sizes/srcset)
Re: Issue 108012 in chromium: IndexedDB should support storing File/Blob
objects
Re: Issue 108012 in chromium: IndexedDB should support storing File/Blob
objects
Re: Issue 367810 in chromium: Restoring multiple tabs after a crash is slow
to unstable
Re: Issue 368037 in chromium: gpu memory tests broken on mac bots
Re: Issue 354607 in chromium: Write automated tests for password sync and
reset for supervised users
Re: Issue 367698 in chromium: Crash on closing cookies and site info bubble
Issue 368201 in chromium: Regression: Blurred text is displayed on
clicking 'proactive sourcing', 'recruiting trends' etc options.
Re: Issue 368037 in chromium: gpu memory tests broken on mac bots
Re: Issue 348553 in chromium: ASSERTION FAILED: !m_isDelayingLoadEvent,
UNKNOWN in bool url::DoIsStandard<char>
Re: Issue 354607 in chromium: Write automated tests for password sync and
reset for supervised users
Re: Issue 368151 in chromium: Chrome crashes by closing the "cookies and
set by this page" popup
Re: Issue 363200 in chromium: Grey rectangle appears as wallpaper, dev
machine builds should use auto generated wallpaper resource.
Re: Issue 278027 in chromium: Chrome should check if the user is managed
periodically
Re: Issue 346763 in chromium: SigninProfile is not loaded after session
restore
Re: Issue 331299 in chromium: Change coding style of test runner library to
chromium's
Re: Issue 168080 in chromium: App shortcuts on Mac
Re: Issue 362870 in chromium: IE Popcorn benchmark slow due to
rasterization and time-in-js
Re: Issue 367040 in chromium: Map to FileSystem Resource not Working
Re: Issue 367810 in chromium: Restoring multiple tabs after a crash is slow
to unstable
Issue 368203 in chromium: During pinch-zoom, it happens extra addTiling
Re: Issue 354607 in chromium: Write automated tests for password sync and
reset for supervised users
Re: Issue 331299 in chromium: Change coding style of test runner library to
chromium's
Re: Issue 363909 in chromium: 0% regression in sizes at 263579:263587
Re: Issue 254066 in chromium: Use base::STLSetDifference() in place of
std::set_difference()
Re: Issue 168080 in chromium: App shortcuts on Mac
Re: Issue 367680 in chromium: Warning: unrecognized tool MASM while
converting to MSBuild
Re: Issue 278027 in chromium: Chrome should check if the user is managed
periodically
--
--
Automated mail from issue updates at http://crbug.com/
Subscription options: http://groups.google.com/a/chromium.org/group/chromium-bugs

To unsubscribe from this group and stop receiving emails from it, send an email to chromium-bugs+***@chromium.org.
c***@googlecode.com
2014-04-29 15:46:19 UTC
Permalink
Your project notifications generated too many emails to send
individually. Here are the subject lines of the emails you would have
received:

Re: Issue 246304 in chromium: Invoke new hover effects if an element is
added or moved underneath a visible mouse cursor
Re: Issue 246304 in chromium: Invoke new hover effects if an element is
added or moved underneath a visible mouse cursor
Re: Issue 367079 in chromium: [Mac] Regression : Image tooltip not getting
updated as we slide through images.
Re: Issue 253465 in chromium: Videos on Android do not play when the src is
set as a blob via create URL
Re: Issue 345726 in chromium: Blink assert in
WebCore::SegmentedString::append when loading plus.google.com/+TheVerge
Re: Issue 367588 in chromium: GN: in component build libskia does not link
Re: Issue 345726 in chromium: Blink assert in
WebCore::SegmentedString::append when loading plus.google.com/+TheVerge
Re: Issue 345726 in chromium: Blink assert in
WebCore::SegmentedString::append when loading plus.google.com/+TheVerge
Re: Issue 367961 in chromium: ASSERTION FAILED: !s.escaped()
Re: Issue 112937 in chromium: Implement support for the Network Information
API
Re: Issue 112937 in chromium: Implement support for the Network Information
API
Re: Issue 368167 in chromium: Chromium crashed when download pdf file
Re: Issue 367758 in chromium: [virtual keyboard] Underscore should be dash
Re: Issue 345726 in chromium: Blink assert in
WebCore::SegmentedString::append when loading plus.google.com/+TheVerge
Re: Issue 344519 in chromium: Persistent assert in normalFlowList
Re: Issue 337829 in chromium: Make Android telemetry_unittests chromium
tree closers
Re: Issue 368084 in chromium: Scrolling bars on login screen
Re: Issue 367849 in chromium: Seen white border line at the edges of the
screen.
Re: Issue 97647 in chromium: API for password-saving settings
Re: Issue 61621 in chromium: Unable to disable/enable built in password
manager from an extension
Re: Issue 61621 in chromium: Unable to disable/enable built in password
manager from an extension
Issue 368252 in chromium: Flash fullscreen within Hulu.com is not properly
stretched to fill screen.
Re: Issue 367725 in chromium: Assert during first run on windows with
custom user data dir
Re: Issue 367725 in chromium: Assert during first run on windows with
custom user data dir
Re: Issue 352942 in chromium: Regression: navigator.maxTouchPoints = 1 in
Chrome Canary Desktop on Windows 7 (no touch capability)
Re: Issue 286290 in chromium: Make WebRTC browser_tests test HD quality
Re: Issue 364584 in chromium: Touchview ignores volume keys
Re: Issue 358281 in chromium: when i open a tap it keeps opening n opening
new tags
Re: Issue 296071 in chromium: SVG: xlink:href to anchor does not cause
navigation
Re: Issue 259040 in chromium: Extensions with very long names push dialog
off screen
Re: Issue 286290 in chromium: Make WebRTC browser_tests test HD quality
Re: Issue 355901 in chromium: Iconography for Bluetooth pairing during OOBE
Re: Issue 365736 in chromium: TouchView: Remove rotate-icon from tray.
Update string
Re: Issue 363714 in chromium: Animate in the overview mode soft button
Re: Issue 308426 in chromium: Automated UI tests for Desktop Media Capture
Re: Issue 330429 in chromium: linux-aura: Test coverage for tab-dragging
Re: Issue 112937 in chromium: Implement support for the Network Information
API
Re: Issue 363591 in chromium: Disable auto-demo mode on test and dev images
Re: Issue 351917 in chromium: Linux Aura Task Manager frame buttons
misaligned.
Issue 368254 in chromium: Chrome OS image creator is failing on Windows
7+proxy
Re: Issue 368143 in chromium: Silverlight plugin crashes when trying to
stream Netflix
Re: Issue 365444 in chromium: Chrome_Mac: Crash Report - Silverlight crash
in _NPN_ReleaseObject
Issue 368255 in chromium: [virtual keyboard] Disable sounds in Fallback
keyboard in M36
Re: Issue 239179 in chromium: Use Python for page sets instead of JSON
Re: Issue 152314 in chromium: Acoustic Echo occurs on 22.0.1229.79 with
Pepper Flash, even when "Reduce Echo" is checkmarked
Re: Issue 366034 in chromium: Touch events don't reach pages with a handler
on the document/window
Re: Issue 239179 in chromium: Use Python for page sets instead of JSON
Re: Issue 368255 in chromium: [virtual keyboard] Disable sounds in Fallback
keyboard in M36
Re: Issue 146127 in chromium: "Request desktop site" is not inherited to
new tabs
Issue 368258 in chromium: [virtual keyboard] Remove numbers hint text from
COMPACT fallback vkey
Re: Issue 332536 in chromium: Hangs while opening new tab, Mac OS X 10.9.x
Re: Issue 367395 in chromium: Title tab drop down on chrome metro covers
tabs making it a huge pain to use.
Re: Issue 367320 in chromium: Results appearing multiple times in wmatrix
Re: Issue 367537 in chromium: CustomEvent with native type names are fired
as prefixed events
Re: Issue 365762 in chromium: Make PrefService the authoritative repository
of user-selected DSE
Re: Issue 367109 in chromium: Entering text into a cell into a file and
saving causes a roundtrip failure in Excel
Re: Issue 368040 in chromium: `cros flash` fails on local image files
Re: Issue 331339 in chromium: A PDF AirPrinted from Chrome is printed about
half the correct size.
Re: Issue 354444 in chromium: Use DidOverscrollParams in the browser
Re: Issue 365762 in chromium: Make PrefService the authoritative repository
of user-selected DSE
Issue 368259 in chromium: Drive operations that fail with '500' should be
retried
Re: Issue 352463 in chromium: Allow mocking of methods that take formal
parameters with aligned storage using MSVC
Issue 368260 in chromium: <button contenteditable="true"> broken if all
text erased
Re: Issue 367963 in chromium: devtools JS error prevents inspection over adb
Re: Issue 365222 in chromium: [2k3] : Slide with second layout gets
inserted even while inserting a new slide where the previous slide has
different layout.
Re: Issue 365687 in chromium: Remove Old Edit Commands and UTs
Issue 368261 in chromium: 2h incorrectly shown as 1:60h
Re: Issue 345726 in chromium: Blink assert in
WebCore::SegmentedString::append when loading plus.google.com/+TheVerge
Re: Issue 367060 in chromium: [rAc suggest]: No suggestions displayed for
Non-latin characters
Re: Issue 354607 in chromium: Write automated tests for password sync and
reset for supervised users
Re: Issue 354607 in chromium: Write automated tests for password sync and
reset for supervised users
Re: Issue 368178 in chromium: MAC - Permission bubble is not moving with
window resized position.
Re: Issue 364224 in chromium: Spike in renderer memory corruptions
Re: Issue 367728 in chromium: Dragging out tabs flashes content area
Re: Issue 315090 in chromium: Create tests for cast sending feature.
Re: Issue 258120 in chromium: "Open in..." not available for all PDFs
Issue 368264 in chromium: Suites should finish even with < 6 duts in a pool
Re: Issue 368261 in chromium: 2h incorrectly shown as 1:60h
Re: Issue 364030 in chromium: UI issue observed for 'middle name' input
field of 'Add an address' overlay on selecting 'Right to left' writing
direction.
Re: Issue 322183 in chromium: Race condition with setting an iframe
element's src attribute
Re: Issue 367763 in chromium: Daisy and Falco PFQ timeout during
TestPrepSuite on HWTest
Re: Issue 363564 in chromium: Regression:Chrome browser crashes when
exiting chrome from wrench after 'SSL Error 'tab is dragged out of window
Issue 368265 in chromium: Enable deferred image filters by default
Re: Issue 360512 in chromium: Chrome fails to acquire 720p or above from
Logitech HD Pro C920 on Windows
Re: Issue 349160 in chromium: Linux Aura builds don't report the correct
channel to UMA or for experiment variations
Re: Issue 366848 in chromium: Send screen info updates to the renderer
separately from resize
Re: Issue 349160 in chromium: Linux Aura builds don't report the correct
channel to UMA or for experiment variations
Re: Issue 357396 in chromium: OAuth2TokenService recreates account right
after removal
Re: Issue 367009 in chromium: Regression:Unnecessary border noticed for
Google accounts that have a profile image
Re: Issue 360512 in chromium: Chrome fails to acquire 720p or above from
Logitech HD Pro C920 on Windows
Re: Issue 349160 in chromium: Linux Aura builds don't report the correct
channel to UMA or for experiment variations
Re: Issue 365936 in chromium: Write a script capable of giving you host
history within a time interval
Re: Issue 325241 in chromium: Eliminate individual component gypi files
that iOS doesn't use being entirely under a "!ios" guard
Re: Issue 245539 in chromium: Read, write and modify PDF forms, annotations
and highlighting within default viewer
Re: Issue 368134 in chromium:
IndexedDBBrowserTestSingleProcess.RenderThreadShutdownTest is flaky on
linux_chromium_chromeos_rel
7 issues changed in chromium
Re: Issue 364468 in chromium: [virtual keyboard] Update the look and feel
of the system VK
Re: Issue 368184 in chromium: Geolocation API is not aligned with w3c
recommendation exactly
Issue 368267 in chromium: [virtual keyboard] Changing tabs should hide the
input view
Re: Issue 364468 in chromium: [virtual keyboard] Update the look and feel
of the system VK
13 issues changed in chromium
Re: Issue 367763 in chromium: Daisy and Falco PFQ timeout during
TestPrepSuite on HWTest
--
--
Automated mail from issue updates at http://crbug.com/
Subscription options: http://groups.google.com/a/chromium.org/group/chromium-bugs

To unsubscribe from this group and stop receiving emails from it, send an email to chromium-bugs+***@chromium.org.
c***@googlecode.com
2014-04-29 18:48:20 UTC
Permalink
Your project notifications generated too many emails to send
individually. Here are the subject lines of the emails you would have
received:

Re: Issue 354324 in chromium: Toggling bookmark bar visibility after
importing data has no effect
Re: Issue 368328 in chromium: 3% regression in
session_restore.cold.typical_25 at 266792:266814
Re: Issue 354634 in chromium: IsFirstRunSentinelPresent uses incorrect
user-data-dir; may DPCHECK.
Re: Issue 366857 in chromium: MSE videos are failing to load
Re: Issue 367725 in chromium: Assert during first run on windows with
custom user data dir
Re: Issue 344410 in chromium: Web MIDI: midi_manager_alsa requires
exclusive access to device
Re: Issue 345726 in chromium: Blink assert in
WebCore::SegmentedString::append when loading plus.google.com/+TheVerge
Re: Issue 367375 in chromium: Touch doesn't work in simple jQuery mobile or
angular app
Re: Issue 363543 in chromium: Track static initializers on Android bots
Re: Issue 366857 in chromium: MSE videos are failing to load
Re: Issue 133733 in chromium: Feature request: Filter developer tools'
network tab entries by regexp over URL (or more)
Re: Issue 362361 in chromium: RestoreOnStartupURLs policy is not applied
during initial sign in of a user
Re: Issue 364894 in chromium: Move CaptivePortalDetector to
src/components/captive_portal
Re: Issue 359940 in chromium: Regression: Transition of image moves from
its actual position on clicking 'Multi-Flip' option.
Re: Issue 261311 in chromium: Android test runner should symbolize by
default
Re: Issue 364894 in chromium: Move CaptivePortalDetector to
src/components/captive_portal
Re: Issue 367427 in chromium: Chrome says it isn't the default browser when
it is
Re: Issue 362108 in chromium: EC & BIOS Update for Pixel
Re: Issue 363543 in chromium: Track static initializers on Android bots
Re: Issue 284521 in chromium: Motion JPEG and Prerender do not mix
Re: Issue 368192 in chromium: RenderTextMac crashes if given a bad Font.
Issue 368335 in chromium: Ctrl+PgUp/Ctrl+PgDn do not switch between tabs
Re: Issue 368230 in chromium: Compile Failure on internal Chrome continuous
(8011) mac beta.
Re: Issue 345726 in chromium: Blink assert in
WebCore::SegmentedString::append when loading plus.google.com/+TheVerge
Re: Issue 358408 in chromium: Simple Chrome on CrOS workflow: support
building into CrOS image
Re: Issue 368185 in chromium: Cannot access the devices in Chaos lab
Re: Issue 366409 in chromium: Add mime_type_handler manifest key for
extensions.
Re: Issue 355603 in chromium: login_MultipleSessions failed with
DBusException
Re: Issue 354607 in chromium: Write automated tests for password sync and
reset for supervised users
Re: Issue 353470 in chromium: Regression:Frame of video is partially
visible.
Re: Issue 324086 in chromium: [Regression] Magnifying glass is broken to
magnify/shrink images if Chrome is not at 100% Zoom
Re: Issue 355603 in chromium: login_MultipleSessions failed with
DBusException
Re: Issue 368138 in chromium: Regression : " LoopDaLoop " app is not woking
Re: Issue 123334 in chromium: Tab Spinner should stop spinning at onload
event
Issue 368340 in chromium: tArea token parsed incorrectly in pre-biff8 files
Re: Issue 368201 in chromium: Regression: Blurred text is displayed on
clicking 'proactive sourcing', 'recruiting trends' etc options.
Re: Issue 368179 in chromium: Regression: Volume slider
in "www.youtube.com" is not seen to "full" though the volume is set to full.
Re: Issue 368201 in chromium: Regression: Blurred text is displayed on
clicking 'proactive sourcing', 'recruiting trends' etc options.
Re: Issue 362796 in chromium: Remove the
kEnableBrowserPluginForAllViewTypes switch
Issue 368341 in chromium: parse full names better in autofill
Re: Issue 353470 in chromium: Regression:Frame of video is partially
visible.
Re: Issue 366096 in chromium: Window flickering on other display when
dragging across displays.
Re: Issue 367981 in chromium: Suboptimal V8/GC sheduling during touch event
sequence
Re: Issue 362603 in chromium: Screen tearing on certain pages
Re: Issue 366605 in chromium: Windows lose overview transform but overview
is not exited when exiting maximize mode.
Re: Issue 368334 in chromium: AppShell: Remove Chrome resource dependencies
from src/extensions
Re: Issue 359940 in chromium: Regression: Transition of image moves from
its actual position on clicking 'Multi-Flip' option.
Re: Issue 359841 in chromium: tap-to-click setting disabled when switching
scroll direction
Re: Issue 367976 in chromium: Feedback: chrome://slow enabled with
multi-profiles does not report to feedback server
Re: Issue 364792 in chromium: [Chaos Lab] Automate routers in row4-rack3.
Re: Issue 368200 in chromium: [Mac] Regression: Distortion observed on
hovering 'page switcher' of chrome://apps page while going fullscreen.
Re: Issue 358408 in chromium: Simple Chrome on CrOS workflow: support
building into CrOS image
Re: Issue 368334 in chromium: AppShell: Remove Chrome resource dependencies
from src/extensions
Re: Issue 21245 in chromium: "Confirm form resubmission" dialog shows for
GET requests to the same URL as a previous POST
Re: Issue 337425 in chromium: Memory leaks when manipulating images.
Re: Issue 360229 in chromium: Cancelling VPN authentication dialog prevents
ever connecting to VPN again
Issue 368342 in chromium: Get link_freon kernel to include dmabuf/fence,
atomic flip, KMS changes
Re: Issue 364808 in chromium: CoreAnimation: Tabs freeze and console
logs "CoreAnimation: failed to allocate N bytes"
Re: Issue 346842 in chromium: handle leaks from HDCOffscreen::draw
Issue 368343 in chromium: New Apps permission/API to access signed-in
user's email
Re: Issue 366096 in chromium: Window flickering on other display when
dragging across displays.
Re: Issue 346842 in chromium: handle leaks from HDCOffscreen::draw
Re: Issue 346842 in chromium: handle leaks from HDCOffscreen::draw
Issue 368345 in chromium: AW3632 dongle doesn't connect to network
Re: Issue 362881 in chromium: Disable only internal keyboard and touchpad
when touchview is engaged.
Re: Issue 346842 in chromium: handle leaks from HDCOffscreen::draw
Issue 368346 in chromium: WTF HashMap incorrectly reports contains(0) as
true after any addition
Re: Issue 362450 in chromium: Clicking the middle mouse button causes the
page to scroll down a few lines.
Re: Issue 339070 in chromium: 3G Dongle: 3 more ZTE dongles to support.
Re: Issue 367646 in chromium: Screenshare "Stop sharing" button
transparency makes the text hard to read
Re: Issue 368230 in chromium: Compile Failure on internal Chrome continuous
(8010 & 8011) mac beta.
Issue 368348 in chromium: build29-a1 is offline
Issue 368347 in chromium: Testing please ignore
Re: Issue 368230 in chromium: Compile Failure on internal Chrome continuous
(8010 & 8011) mac beta.
Re: Issue 354944 in chromium: Dut goes offline in test, within minutes of a
successful verification
Issue 368349 in chromium: Super-janky scrolling on codesearch
Re: Issue 368078 in chromium: Pixel - Google Presentations unusably slow
Re: Issue 304028 in chromium: Drop down arrow is moving while resize the
window.
Re: Issue 360054 in chromium: Add DrMemory bots to WebRTC standalone
waterfall
Re: Issue 355843 in chromium: TreeCloser: build failure in DebugSymbols
600sec timeout
Re: Issue 368348 in chromium: build29-a1 is offline
Re: Issue 364716 in chromium: WebViewPlugin returns a null layerTreeView.
Re: Issue 363554 in chromium: Remove manycam from WebRTC internal bots
Re: Issue 367857 in chromium: vm972-m1 is offline
Re: Issue 367698 in chromium: Crash on closing cookies and site info bubble
Re: Issue 352942 in chromium: Regression: navigator.maxTouchPoints = 1 in
Chrome Canary Desktop on Windows 7 (no touch capability)
Re: Issue 367747 in chromium: Silk pages not producing enough frames
Re: Issue 367986 in chromium: Restrict tgkill and kill to the process'
thread group. Disallow tkill.
Re: Issue 368345 in chromium: AW3632 dongle doesn't connect to network
Re: Issue 364479 in chromium: [Mac] Regression : Unable to move Feedback
app with mouse drag when feedback app is opened from newly created user.
Re: Issue 367986 in chromium: Restrict tgkill and kill to the process'
thread group. Disallow tkill.
Re: Issue 367646 in chromium: Screenshare "Stop sharing" button
transparency makes the text hard to read
Re: Issue 368341 in chromium: parse full names better in autofill
Re: Issue 358408 in chromium: Simple Chrome on CrOS workflow: support
building into CrOS image
Re: Issue 345075 in chromium: Close open tabs when account is removed from
Chrome
Re: Issue 368330 in chromium: Render crashes when clicking on "Retry" -
Extension Load Error
Re: Issue 354944 in chromium: Dut goes offline in test, within minutes of a
successful verification
Re: Issue 367698 in chromium: Crash on closing cookies and site info bubble
Re: Issue 363750 in chromium: CoreAnimation: Download shelf does not have
anti-aliased text
Re: Issue 368330 in chromium: Render crashes when clicking on "Retry" -
Extension Load Error
Re: Issue 327170 in chromium: Put GPU bots on main waterfall, make tree
closers
Re: Issue 368010 in chromium: Remove support for remote access of cros
telemetry
--
--
Automated mail from issue updates at http://crbug.com/
Subscription options: http://groups.google.com/a/chromium.org/group/chromium-bugs

To unsubscribe from this group and stop receiving emails from it, send an email to chromium-bugs+***@chromium.org.
c***@googlecode.com
2014-04-30 22:19:12 UTC
Permalink
Your project notifications generated too many emails to send
individually. Here are the subject lines of the emails you would have
received:

Re: Issue 304111 in chromium: Toolbar gets shifted when user selects ,
drags and drops the selected text outside document canvas, after moving it
here and there
Re: Issue 368730 in chromium: All my type looks like boxes with Dingbats in
them...
Issue 368838 in chromium: Gmail messages have invisible date/time text when
annotated as potential event
Re: Issue 366318 in chromium: Webfonts bug is NOT fixed in Chrome 34
Re: Issue 366875 in chromium: Enable bugdroid for apps/libapps repo
Re: Issue 368838 in chromium: Gmail messages have invisible date/time text
when annotated as potential event
Re: Issue 367216 in chromium: Broken canvas animation/rendering on Android
Re: Issue 107188 in chromium: Speech bubble detaches from the input element
by mouse wheel
Re: Issue 364581 in chromium: chrome.bluetooth.connect vs
chrome.sockets.tcp design
Re: Issue 165847 in chromium: Bug with DisableInactiveRendering and speech
bubbles
Re: Issue 349475 in chromium: JS API: Remove addProfile / removeProfile
Re: Issue 366875 in chromium: Enable bugdroid for apps/libapps repo
Re: Issue 350851 in chromium: [clang-format] function call breaking after
bracket and several arguments per line
Re: Issue 282693 in chromium: Keyboard shortcuts are not easily discoverable
Re: Issue 230556 in chromium: [Chromium] Bad speech bubble placement for
&lt;input speech dir=rtl&gt;
Re: Issue 368838 in chromium: Gmail messages have invisible date/time text
when annotated as potential event
Re: Issue 367523 in chromium: Spammed by "Would you like to translate this
page"
Re: Issue 349262 in chromium: Need a way to CQ try jobs which require new
or changed pixel tests' results
Re: Issue 338338 in chromium: Remove webkit_glue abstraction layer
Re: Issue 335036 in chromium: If user try to drag & drop a file in a new
tab, some times "about:blank" is displayed.
Re: Issue 350183 in chromium: Remove modal spinner and replace with
infinite progress indicator
Re: Issue 224282 in chromium: "Microphone Settings" option doesn't work in
Speech Input
Re: Issue 338338 in chromium: Remove webkit_glue abstraction layer
Re: Issue 349475 in chromium: JS API: Remove addProfile / removeProfile
Re: Issue 364581 in chromium: chrome.bluetooth.connect vs
chrome.sockets.tcp design
Re: Issue 363983 in chromium: Make Public Sessions accessible when
ShowUserNamesOnSignIn is off
Issue 368841 in chromium: 4%-42% regression in blink_perf and cc_perftests
at 267058:267100
Re: Issue 368841 in chromium: 4%-42% regression in blink_perf and
cc_perftests at 267058:267100
Re: Issue 200243 in chromium: Certificate validity dates do not include
time zone information
Re: Issue 368838 in chromium: Gmail messages have invisible date/time text
when annotated as potential event
Re: Issue 368841 in chromium: 4%-42% regression in blink_perf and
cc_perftests at 267058:267100
Re: Issue 363983 in chromium: Make Public Sessions accessible when
ShowUserNamesOnSignIn is off
Re: Issue 368071 in chromium: minijail: Handle lack of seccomp when the -S
flag is used
Re: Issue 367841 in chromium: 15% regression in blink_perf at 264773:264789
Re: Issue 368078 in chromium: Pixel - Google Presentations unusably slow
Re: Issue 362917 in chromium: 57%-93% regression in startup.cold.blank_page
at 263003:263153
Re: Issue 360890 in chromium: power_LoadTest: No longer getting
MeasurementLogger results.
Re: Issue 368704 in chromium: Graphics meltdown + unrecorded crash + tabs
not reloaded properly
Re: Issue 320139 in chromium: Dont call repaint during layout
Re: Issue 368843 in chromium: 2%-3% regression in
tab_capture_performance_tests at 266980:266982
Issue 368843 in chromium: 2%-3% regression in tab_capture_performance_tests
at 266980:266982
Re: Issue 314899 in chromium: SocketPpapiTest.Multicast
Re: Issue 244653 in chromium: Failing plugin-related browser tests on Win64
build
Re: Issue 368071 in chromium: minijail: Handle lack of seccomp when the -S
flag is used
Re: Issue 368078 in chromium: Pixel - Google Presentations unusably slow
Re: Issue 366304 in chromium: Cleanup: remove code for Apps APIs in Pepper
Re: Issue 368843 in chromium: 2%-3% regression in
tab_capture_performance_tests at 266980:266982
Re: Issue 364720 in chromium: TRYONLY=linux
Re: Issue 366304 in chromium: Cleanup: remove code for Apps APIs in Pepper
Re: Issue 244653 in chromium: Failing plugin-related browser tests on Win64
build
Re: Issue 314899 in chromium: SocketPpapiTest.Multicast
Re: Issue 368695 in chromium: Version 36.0.1964.2 dev-m Always on top
cannot access auto-hide taskbar
Re: Issue 363822 in chromium: Set up GitWeb/ViewVC instance to compare
performance to Gitiles Blame
Re: Issue 366177 in chromium: Reenable qav perf tests at a lower priority
than the bvts
Re: Issue 360274 in chromium: Fix FD leaks in broker process
Re: Issue 338448 in chromium: Ctrl + Enter searches for last thing typed,
even after change tab
Re: Issue 360274 in chromium: Fix FD leaks in broker process
Re: Issue 339578 in chromium: HPACK support for SPDY4 & HTTP/2
Re: Issue 147294 in chromium: Enable all aspects of scissoring/partial swap
on Android
Re: Issue 357355 in chromium: UMA stats for Settings: Internet
Re: Issue 339578 in chromium: HPACK support for SPDY4 & HTTP/2
Re: Issue 364737 in chromium: Wireless keyboard no longer working
Re: Issue 363451 in chromium: Notification not displayed on change of
display resolution
Re: Issue 360655 in chromium: Chopping 1 pixel from an odd frame in
VideoCaptureController is sub-optimal
Re: Issue 368723 in chromium: Core Estimator crashes tab on systems with
high core counts
Re: Issue 360655 in chromium: Chopping 1 pixel from an odd frame in
VideoCaptureController is sub-optimal
Issue 368848 in chromium: Unable to reorder bookmarks by drag+drop on Linux
Aura
Re: Issue 367438 in chromium: with today canary gmail checker extension
stops working!
Re: Issue 360655 in chromium: Chopping 1 pixel from an odd frame in
VideoCaptureController is sub-optimal
Re: Issue 338155 in chromium: Feature
request: "chrome://flags/#enable-transparent-app-windows"
Re: Issue 368712 in chromium: Please upgrade Mac bisect builders vm82-a4,
vm83-a4, vm84-a4 and vm85-a4) to 10.8.5/Xcode 5.1
Issue 368850 in chromium: Repaint storms on the image search prototype
Issue 368851 in chromium: Add a buildbot recipe_module to interact with the
master (implies: get properties of parent-build)
Re: Issue 368851 in chromium: Add a buildbot recipe_module to interact with
the master (implies: get properties of parent-build)
Re: Issue 367582 in chromium: Bluetooth menu says "No Matches Found"
despite showing matches.
Re: Issue 366526 in chromium: Map chromeos2-row{1..5}-rack{8..11)-rpm1 to
the second hydra.
Re: Issue 368328 in chromium: 3% regression in
session_restore.cold.typical_25 at 266792:266814
Issue 368852 in chromium: Launching a trybot with --buildbot and --debug on
master-paladin fails
Re: Issue 367432 in chromium: Tabs do not close while trying to load page
Re: Issue 368723 in chromium: Core Estimator crashes tab on systems with
high core counts
Re: Issue 320139 in chromium: Dont call repaint during layout
Re: Issue 366567 in chromium: [Mac] Browser will not full-screen while a
print dialog is open in another tab.
Re: Issue 357615 in chromium: Identify top_10_mobile renderer private_dirty
regressions on Android between r248472 and r258971 and avoid any future
regression
Re: Issue 319484 in chromium: channelsign does not copy over
ChromeOS-test-xxx.tar.xz images needed by paygen
Re: Issue 358576 in chromium: Some tests in TileManagerPerfTest.ManageTiles
are noisy
Re: Issue 365977 in chromium: MacViews: Port the Views' app launcher to Mac
Re: Issue 358576 in chromium: Some tests in TileManagerPerfTest.ManageTiles
are noisy
Re: Issue 366567 in chromium: [Mac] Browser will not full-screen while a
print dialog is open in another tab.
Re: Issue 367524 in chromium: Chrome pdf plugin navigates to incorrect
place from bookmark
Issue 368854 in chromium: Repaint storms on the local universal prototype
Re: Issue 366935 in chromium: Standardize EGL_CHROMIUM_get_sync_values
Re: Issue 347333 in chromium: Linux Aura : White color shown across the
borders of the link title when a link is being dragged out to get opened in
a new tab
Re: Issue 347359 in chromium: Linux Aura : White colored background is seen
when a bookmark is being dragged
Re: Issue 365977 in chromium: MacViews: Port the Views' app launcher to Mac
Re: Issue 367210 in chromium: Chrome_Mac: Crash Report -
WebCore::MediaValues::calculateViewportWidth
Re: Issue 357217 in chromium: frame_lengths is missing an improvement
direction
Re: Issue 319484 in chromium: channelsign does not copy over
ChromeOS-test-xxx.tar.xz images needed by paygen
Issue 368855 in chromium: chrome.processes.getProcessIdForTab sometimes
doesn't return
Issue 368856 in chromium: Folder text and app icon text does not transition
nicely
Re: Issue 368658 in chromium: [Android-WebRTC] Crash occurs receiving the
video and audio data from the sender
Re: Issue 347333 in chromium: Linux Aura : White color shown across the
borders of the link title when a link is being dragged out to get opened in
a new tab
Issue 368857 in chromium: Render crashes when pressing "ctrl + p/ ctrl
+shift+p" on some of the Google maps street views
--
--
Automated mail from issue updates at http://crbug.com/
Subscription options: http://groups.google.com/a/chromium.org/group/chromium-bugs

To unsubscribe from this group and stop receiving emails from it, send an email to chromium-bugs+***@chromium.org.
c***@googlecode.com
2014-05-02 17:17:47 UTC
Permalink
Your project notifications generated too many emails to send
individually. Here are the subject lines of the emails you would have
received:

Re: Issue 369511 in chromium: Flickering artifacts after animation completes
Re: Issue 369331 in chromium: Blink roll 172911:172975 regression: cast
extension pop-up is all blank
Re: Issue 369511 in chromium: Flickering artifacts after animation completes
Re: Issue 334683 in chromium: 4 more "1 of everything" android bots for perf
Re: Issue 363482 in chromium: Chrome + Aura has weird menu placement when
using two monitors of different resolutions.
Re: Issue 368718 in chromium: Leak in
HpackHuffmanAggregatorTest.EncoderLRUQueue
Re: Issue 368935 in chromium: Performance regression on mobile
mail.google.com
Re: Issue 369375 in chromium: Delete media/base/yuv_convert.h
Re: Issue 368881 in chromium: Signer should not double sign with different
keys
Re: Issue 368857 in chromium: Render crashes when pressing "ctrl + p/ ctrl
+shift+p" on some of the Google maps street views
Re: Issue 367923 in chromium: Remove bookmark prompt code
Re: Issue 286030 in chromium: Touch handles do not disappear consistently
when mouse moves
Re: Issue 367923 in chromium: Remove bookmark prompt code
Re: Issue 365012 in chromium: Mojo View Manager
Re: Issue 286030 in chromium: Touch handles do not disappear consistently
when mouse moves
Re: Issue 324086 in chromium: [Regression] Magnifying glass is broken to
magnify/shrink images if Chrome is not at 100% Zoom
Issue 369531 in chromium: Move LoadProgressTracker to the browser process
Re: Issue 338091 in chromium: Use base::ThreadTime [if supported] for cc
perf tests
Re: Issue 325569 in chromium: RenderObject::setNeedsLayout should not mark
the layer as needing full repaint
Re: Issue 368096 in chromium: Demo mode crashes (or restarts?) when you
open Files app
Re: Issue 365701 in chromium: [meta] Regressions from layer squashing
Re: Issue 369413 in chromium: Regression : Youtube video options
like 'Large player, fullscreen,volume,etc vanishes when hovered away.
Re: Issue 304177 in chromium: Optimize layout when a positioned element
needs both moving and repainting on style change
Re: Issue 369484 in chromium: Regression: WebGL experiment content becomes
blank on going Fullscreen and exiting.
Re: Issue 365701 in chromium: [meta] Regressions from layer squashing
Re: Issue 369511 in chromium: Flickering artifacts after animation completes
Re: Issue 368653 in chromium: Chrome App Window Title in Print Preview
Re: Issue 368575 in chromium: New Window + Print Dialog + Close - Hangs
initiating tab/window.
Re: Issue 359428 in chromium: Add support for in-memory zipping and
unzipping
Re: Issue 367685 in chromium: Pronto Sheet formula_tests.formula_string DCP
test is failing in debug mode
Re: Issue 363418 in chromium: Thinkpad T420s/T430s not being recognized as
optimus laptop
Re: Issue 369511 in chromium: Flickering artifacts after animation completes
Re: Issue 351995 in chromium: Keyboard Shortcuts don't work after scrolling
on a page
Re: Issue 367022 in chromium: Regression : Image of the "Shadow" profile
icon not seen after switcing profiles.
Re: Issue 369374 in chromium: Mojo build fails in a flaky manner
Issue 369533 in chromium: iOS bots have been red for a while
Re: Issue 364830 in chromium: REGRESSION(r244226): Webp image regression in
Chrome 34
Re: Issue 369338 in chromium: Stumpy 0x05 TPM Error
Re: Issue 249741 in chromium: An error in the adm file for LBS might cause
incorrect policy parsing
Re: Issue 367022 in chromium: Regression : Image of the "Shadow" profile
icon not seen after switcing profiles.
Re: Issue 369374 in chromium: Mojo build fails in a flaky manner
Re: Issue 359428 in chromium: Add support for in-memory zipping and
unzipping
Re: Issue 364925 in chromium: Some Videos fail to play or missing video
track when hardware-accelerated video decode is 'On'
Re: Issue 175652 in chromium: myIpaddress() and myIpAddressEx() always
return "127.0.0.1" on ChromeOS
Re: Issue 367379 in chromium: Provide unit tests for HTTP utility classes
and functions in Buffet
Re: Issue 362613 in chromium: Chrome OS asynchronous Socket support
Re: Issue 151045 in chromium: Add mid-stream config change support to
GPUVideoDecoder
Re: Issue 367381 in chromium: Provide unit tests for GCD device
registration workflow in Buffet
Re: Issue 366708 in chromium: Remove sleep/retry loop from buffet's
FinishRegistration method
Re: Issue 368935 in chromium: Performance regression on mobile
mail.google.com
Re: Issue 367900 in chromium: Use SettingsWindow for History and Extensions
with settings-window enabled
Re: Issue 364224 in chromium: Spike in renderer memory corruptions
Re: Issue 361269 in chromium: Improved version of Bluetooth Pairing dialog
with visual design more consistent with CrOS virtual keyboard
Re: Issue 346817 in chromium: USB image has empty partition marked with
retry count of 15.
Re: Issue 312885 in chromium: UI for surfacing more content at the bottom
of the NTP and Zero Query
Re: Issue 151045 in chromium: Add mid-stream config change support to
GPUVideoDecoder
Re: Issue 289887 in chromium: Make trackpad pinch gestures send
(overridable) wheel events
Re: Issue 239179 in chromium: Use Python for page sets instead of JSON
Re: Issue 239179 in chromium: Use Python for page sets instead of JSON
Re: Issue 367037 in chromium: Shared memory-related tab crash
Re: Issue 367650 in chromium: "Save target/link as..." via context menu on
target which is HTTP authenticated fails
Re: Issue 364224 in chromium: Spike in renderer memory corruptions
Re: Issue 369331 in chromium: Blink roll 172911:172975 regression: cast
extension pop-up is all blank
Re: Issue 289887 in chromium: Make trackpad pinch gestures send
(overridable) wheel events
Re: Issue 327768 in chromium: Fix Android lint issues
Issue 369535 in chromium: possible hardware failure on vm392-m4
Re: Issue 368078 in chromium: Pixel - Google Presentations unusably slow
Re: Issue 369338 in chromium: Stumpy 0x05 TPM Error
Re: Issue 338698 in chromium: Mobile gmail allows horizontal scrolling into
blank space
Re: Issue 368078 in chromium: Pixel - Google Presentations unusably slow
Re: Issue 327768 in chromium: Fix Android lint issues
Issue 369536 in chromium: Create one AttachmentUploader per profile
Re: Issue 364830 in chromium: REGRESSION(r244226): Webp image regression in
Chrome 34
Re: Issue 308652 in chromium: Add had_to_approximate flag or some
checkerboarding-quantity measure to smoothness
Issue 369537 in chromium: platform_CryptohomeFio does not work
Re: Issue 369312 in chromium: SiteIsolationPolicy doesn't block illegal
cross-site HTML documents starting with "<!DOCTYPE html"
Re: Issue 368881 in chromium: paygen doesn't correctly handle multiple mp
keysets
Re: Issue 369536 in chromium: Create one AttachmentUploader per profile
Re: Issue 366320 in chromium: Touch text selection handles and context menu
interfere
Re: Issue 327903 in chromium: Thai Omnibox input doesn't automatically
select inline autocompletion text.
Re: Issue 309573 in chromium: Setting CR_URL to None should disable it
Re: Issue 106450 in chromium: Some tests in
TextfieldViewsModelTest.EditString_ComplexScript disabled under Win XP
Re: Issue 366786 in chromium: RenderTextWin DCHECK fails with Meiryo
[UI] "ffi", bad partial glyph selection appearance.
Re: Issue 309573 in chromium: Setting CR_URL to None should disable it
Re: Issue 308652 in chromium: Add had_to_approximate flag or some
checkerboarding-quantity measure to smoothness
Re: Issue 106450 in chromium: Some tests in
TextfieldViewsModelTest.EditString_ComplexScript disabled under Win XP
Re: Issue 366786 in chromium: RenderTextWin DCHECK fails with Meiryo
[UI] "ffi", bad partial glyph selection appearance.
Re: Issue 327903 in chromium: Thai Omnibox input doesn't automatically
select inline autocompletion text.
Re: Issue 286030 in chromium: Touch handles do not disappear consistently
when mouse moves
Re: Issue 369176 in chromium: Many Telemetry tests run on Chrome OS are not
sending results to perf dashboard.
Re: Issue 369535 in chromium: possible hardware failure on vm392-m4
Re: Issue 112836 in chromium: Profiles menu keeps disappearing when tabs
are loading
Re: Issue 368497 in chromium: Project Mirror: Locking can fail with
onbeforeunload events
Re: Issue 369084 in chromium: problem with connection to
https://206.65.171.137 from chrome versions (working fine on other
browsers) working on chrome when starting fiddler with https decrypt.
Re: Issue 71741 in chromium: Find-in-page does not
allow 'diacritic-sensitive' search : do we need case-sensitive search as
in Firefox?
Re: Issue 119472 in chromium: New user added silently on Mac OS Lion
Re: Issue 316556 in chromium: [Regression] Mouse wheel horizontal scroll
does not work anymore
Re: Issue 347492 in chromium: REGRESSION[New Profile Management]:Sign in
with "Choose wthat to Sync" doesnot open Advaned Sync Settings Pop-up...
Re: Issue 112836 in chromium: Profiles menu keeps disappearing when tabs
are loading
Re: Issue 347995 in chromium: Mirror: chrome signin page stuck with spinner
Re: Issue 291198 in chromium: DNS_PROBE_FINISHED_NXDOMAIN being observed
Re: Issue 369533 in chromium: iOS bots have been red for a while
--
--
Automated mail from issue updates at http://crbug.com/
Subscription options: http://groups.google.com/a/chromium.org/group/chromium-bugs

To unsubscribe from this group and stop receiving emails from it, send an email to chromium-bugs+***@chromium.org.
c***@googlecode.com
2014-05-02 18:07:39 UTC
Permalink
Your project notifications generated too many emails to send
individually. Here are the subject lines of the emails you would have
received:

Re: Issue 369097 in chromium: Tab crash when accessing Google Drive
Re: Issue 369461 in chromium: testRepaint in telemetry unittests is flaky
Re: Issue 365092 in chromium: SecureShell's nacl_helper process spins at
95% CPU after target hosts unreachable
Re: Issue 369533 in chromium: iOS bots have been red for a while
Re: Issue 367655 in chromium: url info bar becomes unclear
Re: Issue 369477 in chromium: Regression:TAB focus never gets to close
button('X') of 'Chrome Apps & Extensions Developer Tool' on
chrome://extensions
Re: Issue 367376 in chromium: Moar branch builders?
Re: Issue 367256 in chromium: file downloaded via QUIC got truncated
without error.
Re: Issue 359050 in chromium: System tray should not allow opening browser
windows when supervised user creation is in progress
Re: Issue 369535 in chromium: possible hardware failure on vm392-m4
Re: Issue 367773 in chromium: 12% regression in page_cycler.intl_hi_ru at
265941:266054
Re: Issue 361269 in chromium: Improved version of Bluetooth Pairing dialog
with visual design more consistent with CrOS virtual keyboard
Re: Issue 334683 in chromium: 4 more "1 of everything" android bots for perf
Re: Issue 351614 in chromium: Apps ignore favicons set via <link rel="icon">
Re: Issue 369426 in chromium: Missing BVT/AU test for 5807.3.0 - Lost the
RPC connection
Re: Issue 368504 in chromium: Account panel disappears on new Google Maps
with Layer Squashing
Re: Issue 369484 in chromium: Regression: WebGL experiment content becomes
blank on going Fullscreen and exiting.
Re: Issue 100063 in chromium: Investigate why Lion users get HighDPI images
Re: Issue 369535 in chromium: possible hardware failure on vm392-m4
Re: Issue 369541 in chromium: limit the selectable countries in rAc dialog
as per HTML markup
Re: Issue 369535 in chromium: possible hardware failure on vm392-m4
Re: Issue 369533 in chromium: iOS bots have been red for a while
Re: Issue 369331 in chromium: Blink roll 172911:172975 regression: cast
extension pop-up is all blank
Re: Issue 365147 in chromium: Video Will Not Resize to Full Screen
Re: Issue 346236 in chromium: Remove the HTMLVideoElement-specific prefixed
fullscreen API
Issue 369545 in chromium: UMA metric reporting for user-initiated wifi scan
Re: Issue 369277 in chromium: mac-64 chrome browser web pages often become
unresponsive
Re: Issue 369535 in chromium: possible hardware failure on vm392-m4
Re: Issue 253249 in chromium: Warn about non-secure POST targets in secure
pages
Re: Issue 368504 in chromium: Account panel disappears on new Google Maps
with Layer Squashing
Re: Issue 369438 in chromium: Regression:On hovering mouse input text field
vanishes after some time.
Re: Issue 349001 in chromium: [virtual keyboard] Display the keyboard at a
custom size based on different criteria
Re: Issue 359000 in chromium: Hover leave event not firing when window is
half-covered
Re: Issue 369098 in chromium: "Add to Calendar" links now invisible in
Gmail messages
Re: Issue 369503 in chromium: MicroTaskSuppressionScope doesn't suppress
microtasks
Re: Issue 369535 in chromium: possible hardware failure on vm392-m4
Re: Issue 369510 in chromium: Extensions Integration Test broken on Windows
due to os.path inconsistency
Re: Issue 359000 in chromium: Hover leave event not firing when window is
half-covered
Re: Issue 369510 in chromium: Extensions Integration Test broken on Windows
due to os.path inconsistency
Re: Issue 368409 in chromium: Issue with Content Security Policy and self
attribute.
Re: Issue 369413 in chromium: Regression : Youtube video options
like 'Large player, fullscreen,volume,etc vanishes when hovered away.
Re: Issue 368504 in chromium: Account panel disappears on new Google Maps
with Layer Squashing
Re: Issue 352271 in chromium: Google+ Notification - Post scrolling bar is
below extension scroll bar
Issue 369547 in chromium: New UI Reported Bug: "mosh" (mobile shell) cannot
be opened from launcher
Re: Issue 369510 in chromium: Extensions Integration Test broken on Windows
due to os.path inconsistency
Re: Issue 359000 in chromium: Hover leave event not firing when window is
half-covered
Re: Issue 369535 in chromium: possible hardware failure on vm392-m4
Re: Issue 352271 in chromium: Google+ Notification - Post scrolling bar is
below extension scroll bar
Re: Issue 357755 in chromium: Create a stress suite for the stress rack
Re: Issue 368504 in chromium: Account panel disappears on new Google Maps
with Layer Squashing
Re: Issue 369037 in chromium: Layer squashing: scrolling large files in
DevTools leads to visual artifacts
Re: Issue 331438 in chromium: Creating a WebAudio SourceBufferNode leaks an
audio stream
Re: Issue 360477 in chromium: REGRESSION:Browser Crashes on Dragging a
Bookmark from "Other Bookmarks" in BMB and hovering over Tab Strip
Issue 369548 in chromium: Logo for Software Cleanup Tool needs update
Re: Issue 351058 in chromium: Extension pop-up click action disabled after
automatically refreshing - Mac
Re: Issue 352271 in chromium: Google+ Notification - Post scrolling bar is
below extension scroll bar
Re: Issue 368504 in chromium: Account panel disappears on new Google Maps
with Layer Squashing
Re: Issue 369381 in chromium: Gmail renders incorrectly on high-DPI displays
Re: Issue 358383 in chromium: Add tough_webgl_cases to Perf bots
Re: Issue 368096 in chromium: Demo mode crashes (or restarts?) when you
open Files app
Re: Issue 369419 in chromium: Two tests failing after "FCMify
text-based-repaint layout tests"
Re: Issue 369510 in chromium: Extensions Integration Test broken on Windows
due to os.path inconsistency
Issue 369550 in chromium: Cache Kiosk App Crx when the app is added from
kiosk management UI.
Re: Issue 368597 in chromium: modemmanager-next: huawei plugin should treat
CFUN 0 as low power state
Re: Issue 369550 in chromium: Cache Kiosk App Crx when the app is added
from kiosk management UI.
Re: Issue 369314 in chromium: Error building stumpy_moblab: lddtree:
Argument list too long
Re: Issue 74590 in chromium: Support domain parameter for digest
authentication
Re: Issue 360477 in chromium: REGRESSION:Browser Crashes on Dragging a
Bookmark from "Other Bookmarks" in BMB and hovering over Tab Strip
Re: Issue 369472 in chromium: TTS breaks in browser after 350 characters
Re: Issue 352271 in chromium: Google+ Notification - Post scrolling bar is
below extension scroll bar
Re: Issue 367376 in chromium: Moar branch builders?
Re: Issue 369387 in chromium: Omnibox Swype-Like Keyboard Should Auto-Add
Word Break
Re: Issue 253249 in chromium: Warn about non-secure form submission in
secure pages
Re: Issue 369510 in chromium: Extensions Integration Test broken on Windows
due to os.path inconsistency
Issue 369552 in chromium: Install and launch kiosk App offline from the
cache during first time use
Re: Issue 369552 in chromium: Install and launch kiosk App offline from the
cache during first time use
Issue 369554 in chromium: Cannot scroll page while Paused in Debugger
Re: Issue 350813 in chromium: Chrome Uses Bandwidth even on closing it
Re: Issue 369510 in chromium: Extensions Integration Test broken on Windows
due to os.path inconsistency
Re: Issue 368527 in chromium: Add libdrm api for transform on scanout
Re: Issue 334683 in chromium: 4 more "1 of everything" android bots for perf
Re: Issue 369358 in chromium: .click on buttons causes repaint
Re: Issue 350688 in chromium: Touch function on Dell 2240T GONE in Chrome OS
Re: Issue 368655 in chromium: WebCore::BitmapImage should report if the
image has a color profile
Re: Issue 368881 in chromium: paygen doesn't correctly handle multiple mp
keysets
Issue 369557 in chromium: drm: exynos: Sort out the mixer plane formats
Re: Issue 350688 in chromium: Touch function on Dell 2240T GONE in Chrome OS
Re: Issue 369481 in chromium: Regression: 'GPU memory' exceeds the max
limit value
Re: Issue 349001 in chromium: [virtual keyboard] Display the keyboard at a
custom size based on different criteria
Re: Issue 368694 in chromium: Teach gfx::Screen about color profiles
Re: Issue 367376 in chromium: Reduce automated load on chromeos branch
builders.
Re: Issue 367022 in chromium: Regression : Image of the "Shadow" profile
icon not seen after switcing profiles.
Re: Issue 368279 in chromium: Context.drawImage after resize big image draw
only zeros(absolutely black data)
Re: Issue 369358 in chromium: .click on buttons causes repaint
Re: Issue 366096 in chromium: Window flickering on other display when
dragging across displays.
Re: Issue 368854 in chromium: Repaint storms on the local universal
prototype
Re: Issue 351959 in chromium: Project Mirror: Clicking secondary account
name deletes account instead of switching to it
Re: Issue 368504 in chromium: Account panel disappears on new Google Maps
with Layer Squashing
Re: Issue 369501 in chromium: Mac [10.9.2]: Left side options appears blank
on chrome://settings page.
Re: Issue 44872 in chromium: Unmanaged CSS colors
Re: Issue 344341 in chromium: Extension pages can't access iframe content
due to cross origin policies
Re: Issue 44872 in chromium: Unmanaged CSS colors
--
--
Automated mail from issue updates at http://crbug.com/
Subscription options: http://groups.google.com/a/chromium.org/group/chromium-bugs

To unsubscribe from this group and stop receiving emails from it, send an email to chromium-bugs+***@chromium.org.
c***@googlecode.com
2014-05-02 20:28:24 UTC
Permalink
Your project notifications generated too many emails to send
individually. Here are the subject lines of the emails you would have
received:

Re: Issue 368414 in chromium: "Communicate with extension" permission shown
for hotword extension every time user opens incognito window and goes to
google.com
Re: Issue 369608 in chromium: Missing crash stack on reftest?
Re: Issue 369356 in chromium: extension icons are reset on restart
Re: Issue 367262 in chromium: Non-SFI NaCl: Disallow RWX page permissions,
for security hardening
Issue 369610 in chromium: Document and automate device bringup process
Issue 369611 in chromium: telemetry_UnitTests failing on perf bots
Re: Issue 369608 in chromium: Missing crash stack on reftest?
Re: Issue 369331 in chromium: Blink roll 172911:172975 regression: cast
extension pop-up is all blank
Re: Issue 160674 in chromium: zoom up/down gets out of sync
Re: Issue 369606 in chromium: Core Dump on master debug build.
Re: Issue 369423 in chromium: git.RunGit() did not retry internal server
errors
Re: Issue 368935 in chromium: Mobile GMail scrolls on main after universal
accelerated overflow scroll was enabled
Re: Issue 369331 in chromium: Blink roll 172911:172975 regression: cast
extension pop-up is all blank
Re: Issue 369423 in chromium: git.RunGit() did not retry internal server
errors
Re: Issue 339341 in chromium: Javascript onunload and onbeforeunload events
are not working in chrome for android
Re: Issue 369608 in chromium: Missing crash stack on reftest?
Re: Issue 369487 in chromium: Eclipse gyp generator does not correctly
detect relative compiler path to clang
Re: Issue 369331 in chromium: Blink roll 172911:172975 regression: cast
extension pop-up is all blank
Re: Issue 344566 in chromium: Ability to automatically combine multiple
permission warnings
Re: Issue 368935 in chromium: Mobile GMail scrolls on main after universal
accelerated overflow scroll was enabled
Issue 369612 in chromium: Enter one-line summary
Re: Issue 369608 in chromium: Missing crash stack on reftest?
Issue 369613 in chromium: syncing browser action extensions causes shelf to
get size reduced to bare minimum
Issue 369615 in chromium: Crash in ~GraphicsContext
Re: Issue 368935 in chromium: Mobile GMail scrolls on main after universal
accelerated overflow scroll was enabled
Re: Issue 251973 in chromium: Make layout test snapshotting code
asynchronous
Re: Issue 369615 in chromium: Crash in ~GraphicsContext
Re: Issue 369615 in chromium: Crash in ~GraphicsContext
Re: Issue 269552 in chromium: CSS linear-gradient 1px banding
Re: Issue 368801 in chromium: SSO Sign-in fails for Chrome Sync when using
chrome://chrome-signin
Re: Issue 142588 in chromium: Chrome in Windows 8 build 8400
Re: Issue 369571 in chromium: tpm_clear -p <password> segfaults
Re: Issue 369608 in chromium: Missing crash stack on reftest?
Re: Issue 369615 in chromium: Crash in ~GraphicsContext, missing a
restore().
Issue 369616 in chromium: FAFT: Check state of WP switch before running
certain tests
Re: Issue 368427 in chromium: WWW-Authenticate windows auto-fill wrong data
Re: Issue 369176 in chromium: Many Telemetry tests run on Chrome OS are not
sending results to perf dashboard.
Issue 369617 in chromium: Click on notification closes tray bubble instead
of notification when both are displayed.
Re: Issue 316303 in chromium: Docserver: some API properties are only for
specific platforms
Re: Issue 369615 in chromium: Crash in ~GraphicsContext, missing a
restore().
Issue 369618 in chromium: In telemetry the web page replay fails when the
site is running on non 80 http port. Add an option in browser options to
allow telemetry to also work for servers running on local ports.
Re: Issue 362658 in chromium: 2% regression in kraken at 263214:263236
Re: Issue 338706 in chromium: Support Win64 to Win32 system install
upgrades and downgrades
Re: Issue 369356 in chromium: extension icons are reset on restart
Re: Issue 316303 in chromium: Docserver: some API properties are only for
specific platforms
Re: Issue 369426 in chromium: Missing BVT/AU test for 5807.3.0 - Lost the
RPC connection
Re: Issue 369615 in chromium: Crash in ~GraphicsContext, missing a
restore().
Re: Issue 369461 in chromium: testRepaint in telemetry unittests is flaky
Re: Issue 367640 in chromium: Regression:UI glitch observed when you click
on Chrome Autofill settings option on the autofill page.
Re: Issue 369608 in chromium: Missing crash stack on reftest?
Re: Issue 367885 in chromium: chromite unittest not run on CQ
Re: Issue 369385 in chromium: lint-test-expectations warning about
non-existent path for a virtual test suite may cause build errors
Re: Issue 369385 in chromium: lint-test-expectations warning about
non-existent path for a virtual test suite may cause build errors
Re: Issue 348626 in chromium: Class not registered error when relaunching
Canary
Re: Issue 369325 in chromium: Webkit Linux (valgrind layout) taking too
long to run tests due to insufficient parallelism
Re: Issue 367256 in chromium: file downloaded via QUIC got truncated
without error.
Re: Issue 364399 in chromium: Regression:Blank or garbage values are shown
in zoom levels after applying language to browser
Re: Issue 369608 in chromium: Missing crash stack on reftest?
Re: Issue 364399 in chromium: Regression:Blank or garbage values are shown
in zoom levels after applying language to browser
Re: Issue 345134 in chromium: Time out error on some /alerts page
Re: Issue 321433 in chromium: Suite of icons/images to use for security
warnings
Re: Issue 367940 in chromium: Touch Firmware test perser crash
Re: Issue 367885 in chromium: chromite unittest not run on CQ
Re: Issue 291198 in chromium: DNS_PROBE_FINISHED_NXDOMAIN being observed
Re: Issue 338706 in chromium: Support Win64 to Win32 system install
upgrades and downgrades
Re: Issue 369608 in chromium: Missing crash stack on reftest?
Re: Issue 348626 in chromium: Class not registered error when relaunching
Canary
Re: Issue 349590 in chromium: Chrome_ChromeOS: Crash Report -
net::::PKIXVerifyCert
Re: Issue 348626 in chromium: Class not registered error when relaunching
Canary
Re: Issue 316556 in chromium: [Regression] Mouse wheel horizontal scroll
does not work anymore
Re: Issue 112836 in chromium: Profiles menu keeps disappearing when tabs
are loading
Re: Issue 369608 in chromium: Missing crash stack on reftest?
Re: Issue 354731 in chromium: Frequent gclient revert/sync/update flakes
are annoying
Re: Issue 368935 in chromium: Mobile GMail scrolls on main after universal
accelerated overflow scroll was enabled
Re: Issue 369615 in chromium: Crash in ~GraphicsContext, missing a
restore().
Re: Issue 368497 in chromium: Project Mirror: Locking can fail with
onbeforeunload events
Re: Issue 367885 in chromium: chromite unittest not run on CQ
Re: Issue 367885 in chromium: chromite unittest not run on CQ
Re: Issue 369472 in chromium: TTS breaks in browser after 350 characters
Re: Issue 369596 in chromium: Refactor gles2_cmd_decoder_unittest.cc into
components.
Re: Issue 369615 in chromium: Crash in ~GraphicsContext, missing a
restore().
Re: Issue 368497 in chromium: Project Mirror: Locking can fail with
onbeforeunload events
Re: Issue 369608 in chromium: Missing crash stack on reftest?
Re: Issue 367262 in chromium: Non-SFI NaCl: Disallow RWX page permissions,
for security hardening
Re: Issue 368504 in chromium: Account panel disappears on new Google Maps
with Layer Squashing
Re: Issue 369579 in chromium: Route input directly instead of through the
compositor thread
Re: Issue 349312 in chromium: Feature: perf dashboard should take chrome
version inputs
Re: Issue 291198 in chromium: DNS_PROBE_FINISHED_NXDOMAIN being observed
Re: Issue 368497 in chromium: Project Mirror: Locking can fail with
onbeforeunload events
Re: Issue 368736 in chromium: Group report page unable to show graph
Re: Issue 369176 in chromium: Many Telemetry tests run on Chrome OS are not
sending results to perf dashboard.
Re: Issue 369606 in chromium: Core Dump on master debug build.
Re: Issue 369569 in chromium: ios Device and ios simulator builder keep
failing on gclient runhooks
Re: Issue 340886 in chromium: haswell gpu errenously blacklisted?
Re: Issue 351959 in chromium: Project Mirror: Clicking secondary account
name deletes account instead of switching to it
Issue 369624 in chromium: "Buildbot stdio" link points to the graph itself
sometimes.
Re: Issue 158246 in chromium: Improve unit tests for
SafeBrowsingProtocolManager
Re: Issue 369176 in chromium: Many Telemetry tests run on Chrome OS are not
sending results to perf dashboard.
Re: Issue 338706 in chromium: Support Win64 to Win32 system install
upgrades and downgrades
Re: Issue 369176 in chromium: Many Telemetry tests run on Chrome OS are not
sending results to perf dashboard.
Re: Issue 340886 in chromium: haswell gpu errenously blacklisted?
Re: Issue 358213 in chromium: Pull server-backed state keys into Chrome via
session_manager DBus interface
--
--
Automated mail from issue updates at http://crbug.com/
Subscription options: http://groups.google.com/a/chromium.org/group/chromium-bugs

To unsubscribe from this group and stop receiving emails from it, send an email to chromium-bugs+***@chromium.org.
c***@googlecode.com
2014-05-02 21:55:15 UTC
Permalink
Your project notifications generated too many emails to send
individually. Here are the subject lines of the emails you would have
received:

Re: Issue 369633 in chromium: text rendering issues on
http://www.penny-arcade.com
Re: Issue 369634 in chromium: layer rendering issues on penny-arcade.com
Re: Issue 239365 in chromium: Hide 2 menu items on Drive gear menu
Re: Issue 342023 in chromium: Rendering issues when viewing street view
pictures
Re: Issue 338706 in chromium: Support Win64 to Win32 system install
upgrades and downgrades
Re: Issue 369535 in chromium: possible hardware failure on vm392-m4
Re: Issue 367542 in chromium: Shockwave Flash crashes when viewing some
content
Re: Issue 353970 in chromium: Graphical corruption while loading large
tryserver output
Re: Issue 369632 in chromium: blink_perf flaky on perf bots with reference
build
Re: Issue 369611 in chromium: telemetry_UnitTests failing on perf bots
Re: Issue 367036 in chromium: Chromium OS Wallpaper can't be changed
Issue 369639 in chromium: jsgamebench flaky on GPU Perf bots
Re: Issue 331971 in chromium: Console clips long error messages with no way
to see the whole text
Re: Issue 369634 in chromium: layer rendering issues on penny-arcade.com
Re: Issue 369634 in chromium: layer rendering issues on penny-arcade.com
Issue 369640 in chromium: Keyboard layout choice ignored after OOBE
Re: Issue 349705 in chromium: Delay in displaying drop-down list on AMD GPU
card linux aura
Issue 369641 in chromium: support more parameters for functions
Re: Issue 354158 in chromium: Kill off URLRequestJobManager
Re: Issue 356974 in chromium: Need a mechanism to put the recipe invocation
configuration near the master/slave definitions.
Re: Issue 361339 in chromium: calling window.location.replace from a
promise's then causes a crash
Issue 369643 in chromium: GN-ize Mojo.
Re: Issue 333317 in chromium: Create an URLString type to be a lightweight,
unparsed URL representation
Re: Issue 369533 in chromium: iOS bots have been red for a while
Re: Issue 369563 in chromium: cbuildbot step failing on ChromiumOS bots
with no module named net_configs
Re: Issue 364701 in chromium: Consider storing the Text node child of
<style> elements in an AtomicString
Re: Issue 369270 in chromium: 160% regression in media.mse_cases at
266468:266496
Re: Issue 365777 in chromium: Text to Speech not working on XE303 once it
was updated to chrome ver 34
Re: Issue 357530 in chromium: Background flicker is observed, while playing
a sliverlight video with --disable-gpu
Re: Issue 369634 in chromium: layer rendering issues on penny-arcade.com
Re: Issue 358675 in chromium: Once paused, video cannot be played again in
the full screen
Re: Issue 369634 in chromium: layer rendering issues on penny-arcade.com
Re: Issue 369314 in chromium: Error building stumpy_moblab: lddtree:
Argument list too long
Re: Issue 369633 in chromium: text rendering issues on
http://www.penny-arcade.com
Re: Issue 369634 in chromium: layer rendering issues on penny-arcade.com
Issue 369647 in chromium: Docserver integration test failing.
Issue 369646 in chromium: Set window.document.title to reflect the host to
which the client is connected
Re: Issue 369633 in chromium: text rendering issues on
http://www.penny-arcade.com
Re: Issue 368500 in chromium: Copy/paste from URL bar no longer includes
http:// prefix
Re: Issue 369510 in chromium: Extensions Integration Test broken on Windows
due to os.path inconsistency
Re: Issue 369647 in chromium: Docserver integration test failing.
Re: Issue 349983 in chromium: Implement the ManagedBookmarks policy for iOS
Re: Issue 364230 in chromium: Unable to play resolution change videos in
ARM devices
Issue 369648 in chromium: Browser-side impl-side painting DCHECK
Re: Issue 367734 in chromium: Error installing extension on Windows 7
Re: Issue 369648 in chromium: Browser-side impl-side painting DCHECK
Re: Issue 369634 in chromium: layer rendering issues on penny-arcade.com
Re: Issue 338570 in chromium: Cannot pair BT Mouse - SDP table not present
in D-Bus properties
Re: Issue 369648 in chromium: Browser Impl-side painting without
main_frame_before_draw_enabled DCHECKs
Re: Issue 361047 in chromium: Opening / Unmounting ZIP archive does reset
state of file manager windows
Re: Issue 369510 in chromium: Extensions Integration Test broken on Windows
due to os.path inconsistency
Re: Issue 369634 in chromium: layer rendering issues on penny-arcade.com
Issue 369651 in chromium: webkit app region of an element is ignored when
make the element visible in a timeout function
Issue 369652 in chromium: Browser impl-side painting draws from
missing/deleted resource
Issue 369653 in chromium: Browser impl-side painting draws from
missing/deleted resource
Re: Issue 364297 in chromium: app_shell: Configure network at startup
Re: Issue 369634 in chromium: layer rendering issues on penny-arcade.com
Issue 369655 in chromium: Combine GestureTap with GestureShowPress
Issue 369654 in chromium: Track subframe session history in browser process
Re: Issue 369633 in chromium: text rendering issues on
http://www.penny-arcade.com
Re: Issue 369634 in chromium: layer rendering issues on penny-arcade.com
with layer squashing
Issue 369656 in chromium: Re-enable ActivityLog database unittest
Re: Issue 365777 in chromium: Text to Speech not working on XE303 once it
was updated to chrome ver 34
Re: Issue 369651 in chromium: webkit app region of an element is ignored
when make the element visible in a timeout function
Re: Issue 369314 in chromium: Error building stumpy_moblab: lddtree:
Argument list too long
Re: Issue 367895 in chromium: Graph broken (DOM_modify-element-classname)
Issue 369657 in chromium: Improve the way Extensions deal with long file
names.
Re: Issue 367734 in chromium: Error installing extension on Windows 7
Issue 369658 in chromium: DASH MSE/EME video are not working on ARM
Re: Issue 367036 in chromium: Chromium OS Wallpaper can't be changed
Issue 369659 in chromium: Create an app_shell-only brillo profile
Re: Issue 369653 in chromium: Browser impl-side painting draws from
missing/deleted resource
Issue 369660 in chromium: Show a non intrusive notification when an app
acts as a server using chrome.socket API
Issue 369661 in chromium: Move page ID allocation into the browser process
Re: Issue 368767 in chromium: smoothness.tough_animation_cases broken on
Mac 10.6 Perf (5)
Re: Issue 358927 in chromium: [Stress Test] Create a suspend/resume stress
test for power
Re: Issue 369661 in chromium: Move page ID allocation into the browser
process
Re: Issue 368935 in chromium: Mobile GMail scrolls on main after universal
accelerated overflow scroll was enabled
Issue 369662 in chromium: Keypad on external keyboards is no longer
supported
Re: Issue 368935 in chromium: Mobile GMail scrolls on main after universal
accelerated overflow scroll was enabled
Re: Issue 369662 in chromium: Keypad on external keyboards is no longer
supported
Re: Issue 369653 in chromium: Browser impl-side painting draws from
missing/deleted resource
Issue 369663 in chromium: Gmail renders white squares
Issue 369664 in chromium: Date links in Gmail no longer render
Re: Issue 303251 in chromium: Update testharness.js
Re: Issue 369511 in chromium: Flickering artifacts after animation completes
Re: Issue 347532 in chromium: CHECK failure in
CHECK(isolate->microtask_pending()) failed: ../src/execution.cc(358)
Re: Issue 342692 in chromium: Same alert appearing multiple times on
dashboard
Re: Issue 368752 in chromium: GPU try server doesn't properly tests DEPS
changes to swarming_client
Re: Issue 277080 in chromium: Remove support for the hspace/vspace
attributes on table
Re: Issue 367306 in chromium: Changing default Google base URL from HTTP to
HTTPS causes strange telemetry failures
Re: Issue 368935 in chromium: Mobile GMail scrolls on main after universal
accelerated overflow scroll was enabled
Re: Issue 368752 in chromium: GPU try server doesn't properly tests DEPS
changes to swarming_client
Re: Issue 357530 in chromium: Background flicker is observed, while playing
a sliverlight video with --disable-gpu
Re: Issue 369507 in chromium: Blank page is shown if user opens link in new
tab
Issue 369665 in chromium: Git Try +1 on Succeed
Re: Issue 368328 in chromium: 3% regression in
session_restore.cold.typical_25 at 266792:266814
Re: Issue 245726 in chromium: chrome.systemIndicator API needs 'setTitle'
method
Re: Issue 349311 in chromium: Feature: Show data by Chrome milestone.
Re: Issue 366011 in chromium: [parrot] glbench reboots intermittently
Re: Issue 338091 in chromium: Use base::ThreadTime [if supported] for cc
perf tests
Issue 369666 in chromium: download_from_google_storage fails with undefined
local variable
--
--
Automated mail from issue updates at http://crbug.com/
Subscription options: http://groups.google.com/a/chromium.org/group/chromium-bugs

To unsubscribe from this group and stop receiving emails from it, send an email to chromium-bugs+***@chromium.org.
c***@googlecode.com
2014-05-02 22:54:21 UTC
Permalink
Your project notifications generated too many emails to send
individually. Here are the subject lines of the emails you would have
received:

Re: Issue 339784 in chromium: Making sheriff's lives better: A dashboard
showing the frequency of bot failures and their causes
Re: Issue 163795 in chromium: Implement Web MIDI API
Re: Issue 369436 in chromium: Says cannont open the real www.google.ca
Re: Issue 369597 in chromium: Leak inside
gfx::NSImageToSkBitmapWithColorSpace
Re: Issue 314185 in chromium: Enable impl-side painting on Aura (browser
compositor)
Re: Issue 369653 in chromium: Browser impl-side painting draws from
missing/deleted resource
Re: Issue 369648 in chromium: Browser Impl-side painting without
main_frame_before_draw_enabled DCHECKs
Re: Issue 366515 in chromium: Regression:Chrome browser crashes via
clicking on 'Global accessibility mode' toggle button on
chrome://accessiblity
Re: Issue 369634 in chromium: layer rendering issues on penny-arcade.com
with layer squashing
Re: Issue 369597 in chromium: Leak inside
gfx::NSImageToSkBitmapWithColorSpace
Re: Issue 369634 in chromium: layer rendering issues on penny-arcade.com
with layer squashing
Re: Issue 365701 in chromium: [meta] Regressions from layer squashing
Re: Issue 369664 in chromium: Date links in Gmail no longer render
Re: Issue 297040 in chromium:
EndToEndTests/EndToEndTest.LargePostNoPacketLoss/1 and 0 are flaky on linux
valgrind bot
Re: Issue 326342 in chromium: Allow filing bugs to other issue trackers.
Re: Issue 354172 in chromium: clearData method is not available, while docs
show it as available
Re: Issue 365852 in chromium: Google Calendar crashes in compositor on
Canary
Re: Issue 369597 in chromium: Leak inside
gfx::NSImageToSkBitmapWithColorSpace
Re: Issue 368504 in chromium: Account panel disappears on new Google Maps
with Layer Squashing
Re: Issue 322151 in chromium: DevanagarI lending - line spacing problem.
Issue 369677 in chromium: Ethernet Icon in Tray
Re: Issue 369668 in chromium: 2 scrollbars visible on ChromeOS
Re: Issue 343215 in chromium: pagecycler: filter out zeros
Re: Issue 330461 in chromium: liblouis copy actions run on every builld
because `git reset` turns ctime changes into mtime changes -> should set
core.trustctime to false
Re: Issue 358143 in chromium: chromium is unable to handle that X server is
terminated and save its state
Re: Issue 343215 in chromium: pagecycler: filter out zeros
Re: Issue 369452 in chromium: Chromium Website
Re: Issue 163795 in chromium: Implement Web MIDI API
Re: Issue 369668 in chromium: 2 scrollbars visible on ChromeOS
Re: Issue 369607 in chromium: Can't view website
Re: Issue 369612 in chromium: Enter one-line summary
Re: Issue 348820 in chromium: Add a platform provider that reads policy
from MDM on iOS
Re: Issue 349312 in chromium: Feature: perf dashboard should take chrome
version inputs
Re: Issue 339776 in chromium: Crash id's are not showing up in
chrome://crashes
Re: Issue 369507 in chromium: Blank page is shown if user opens link in new
tab
Re: Issue 354172 in chromium: clearData method is not available, while docs
show it as available
Re: Issue 369678 in chromium: 2% regression in page_cycler.bloat at
267123:267134
Issue 369678 in chromium: 2% regression in page_cycler.bloat at
267123:267134
Re: Issue 369678 in chromium: 2% regression in page_cycler.bloat at
267123:267134
Re: Issue 369237 in chromium: 6%-40% regression in page_cycler at
267186:267277
Re: Issue 369286 in chromium: Chrome address bar null byte overflow
complete crash
Re: Issue 365245 in chromium: 1% regression in kraken at 264350:264375
Issue 369679 in chromium: Echo dependency on extension page
Re: Issue 367277 in chromium: Reminders in Google Calendar don't render
their times
Re: Issue 369664 in chromium: Date links in Gmail no longer render
Re: Issue 364224 in chromium: Spike in renderer memory corruptions
Re: Issue 369665 in chromium: Git Try +1 on Succeed
Re: Issue 365423 in chromium: UNKNOWN in
WebCore::GraphicsLayer::addChildInternal
Re: Issue 368718 in chromium: Leak in
HpackHuffmanAggregatorTest.EncoderLRUQueue
Re: Issue 330461 in chromium: liblouis copy actions run on every builld
because `git reset` turns ctime changes into mtime changes -> should set
core.trustctime to false
Re: Issue 229252 in chromium: Report more specific errors from
base::CreatePlatformFile
Re: Issue 288697 in chromium: Propagate time zone updates to the web apps
Re: Issue 356673 in chromium: Cast extension "on" state for CWS promo
images needs to be updated
Issue 369681 in chromium: www.goodreads.com
Re: Issue 239034 in chromium: BadStatus line failure from FAFT Bios suite
Re: Issue 368406 in chromium: Common partitionAlloc OOM crashes
Re: Issue 74637 in chromium: chrome internal page URLs fail to render when
URL is dragged and dropped on to webgl content area
Re: Issue 364589 in chromium: recent chromium versions incorrectly prefer
fixed fonts if available
Re: Issue 338069 in chromium: Would we be able to remove all the references
to googleurl from chromium-build-tools?
Re: Issue 369683 in chromium: 5%-8% regression in indexeddb_perf at
264376:264456
Issue 369683 in chromium: 5%-8% regression in indexeddb_perf at
264376:264456
Re: Issue 368293 in chromium: extra quotes around fontFamily strings that
contain a space
Re: Issue 369683 in chromium: 5%-8% regression in indexeddb_perf at
264376:264456
Issue 369684 in chromium: PDF viewer / download window should offer the
option of alternate viewer apps
Re: Issue 351447 in chromium: No alert on linux-release
Re: Issue 369684 in chromium: PDF viewer / download window should offer the
option of alternate viewer apps
Re: Issue 364224 in chromium: Spike in renderer memory corruptions
Re: Issue 368935 in chromium: Mobile GMail scrolls on main after universal
accelerated overflow scroll was enabled
Issue 369685 in chromium: iFrame handling in permissions bubbles
Re: Issue 366515 in chromium: Regression:Chrome browser crashes via
clicking on 'Global accessibility mode' toggle button on
chrome://accessiblity
Re: Issue 365210 in chromium: 22679% regression in blink_perf at
237294:253532
Issue 369686 in chromium: Sync invalidations not received when Chrome for
Android is backgrounded
Issue 369687 in chromium: 6%-48% regression in page_cycler.morejs at
266427:266783
Re: Issue 369687 in chromium: 6%-48% regression in page_cycler.morejs at
266427:266783
Re: Issue 369687 in chromium: 6%-48% regression in page_cycler.morejs at
266427:266783
Re: Issue 335907 in chromium: SpeechSynthesisUtterance is stopping
Re: Issue 135888 in chromium: Support CSS shaders with Chrome for Android
Re: Issue 369314 in chromium: Error building stumpy_moblab: lddtree:
Argument list too long
Issue 369688 in chromium: ERR_EMPTY_RESPONSE on www.goodreads.com
Re: Issue 335907 in chromium: SpeechSynthesisUtterance is stopping
Issue 369689 in chromium: Windows shouldn't stay maximized when switching
to much larger monitor
Issue 369690 in chromium: 10%-16% regression in blink_perf at 267254:267377
Re: Issue 369690 in chromium: 10%-16% regression in blink_perf at
267254:267377
Re: Issue 330461 in chromium: liblouis copy actions run on every builld
because `git reset` turns ctime changes into mtime changes -> should set
core.trustctime to false
Re: Issue 368935 in chromium: Mobile GMail scrolls on main after universal
accelerated overflow scroll was enabled
Re: Issue 369690 in chromium: 10%-16% regression in blink_perf at
267254:267377
Re: Issue 369314 in chromium: Error building stumpy_moblab: lddtree:
Argument list too long
Re: Issue 369692 in chromium: 10%-11% regression in cc_perftests at
267445:267463
Issue 369692 in chromium: 10%-11% regression in cc_perftests at
267445:267463
Issue 369691 in chromium: CQ failure messages not including board name or
link to logs now
Re: Issue 332601 in chromium: Selecting "cros-daisy" telemetry results
causes "data missing" for graphs for other platforms.
Re: Issue 369503 in chromium: MicroTaskSuppressionScope doesn't suppress
microtasks
Re: Issue 245380 in chromium: Attempting to drawImage with a webgl canvas
as source causes it to disappear
Re: Issue 360891 in chromium: Javascript run via V8 Microtask callback has
no "entered" DOM Window
Issue 369693 in chromium: [devtools] Elements panel search does not
pre-load the selection
Re: Issue 369692 in chromium: 10%-11% regression in cc_perftests at
267445:267463
Issue 369695 in chromium: 11% regression in blink_perf at 267204:267232
Re: Issue 369695 in chromium: 11% regression in blink_perf at 267204:267232
Re: Issue 369695 in chromium: 11% regression in blink_perf at 267204:267232
Issue 369697 in chromium: 10% regression in blink_perf at 267204:267232
Re: Issue 369697 in chromium: 10% regression in blink_perf at 267204:267232
Re: Issue 369697 in chromium: 10% regression in blink_perf at 267204:267232
--
--
Automated mail from issue updates at http://crbug.com/
Subscription options: http://groups.google.com/a/chromium.org/group/chromium-bugs

To unsubscribe from this group and stop receiving emails from it, send an email to chromium-bugs+***@chromium.org.
c***@googlecode.com
2014-05-05 15:42:34 UTC
Permalink
Your project notifications generated too many emails to send
individually. Here are the subject lines of the emails you would have
received:

Re: Issue 368686 in chromium: [CSS Shapes] shape-outside polygon can fail
when line-top intersects a vertex
Re: Issue 364584 in chromium: Touchview ignores volume keys
Re: Issue 369703 in chromium: Page's constructor should take name as
optional argument
Re: Issue 368504 in chromium: Account panel disappears on new Google Maps
with Layer Squashing
Re: Issue 370020 in chromium: German initramfs messages could be improved
Re: Issue 369972 in chromium: Options from "Learn More" page disappear
while mouse hovering on them
Re: Issue 363482 in chromium: Chrome + Aura has weird menu placement when
using two monitors of different resolutions.
Re: Issue 368132 in chromium: Password not saved correctly
Re: Issue 369565 in chromium: M36 label is missing in feedback server.
Re: Issue 349810 in chromium: 2%-5% regression in
chromium-rel-mac9/startup.warm.dirty.blank_page/window_display_time,chromium-rel-mac9/startup.warm.dirty.blank_page/open_tabs_time,chromium-rel-mac9/startup.warm.dirty.blank_page/messageloop_start_time
at 255113:255117
Re: Issue 348653 in chromium: 5%-7% regression in
chromium-rel-mac9/cc_perftests/invalidation/50x50,chromium-rel-mac9/cc_perftests/invalidation/25x50
at 254436:254448
Re: Issue 252180 in chromium: Form action tel triggers
ERR_UNKNOWN_URL_SCHEME in Chrome for Android
Re: Issue 370022 in chromium: switching virtual desktops leaves artifacts
from the previous desktop
Re: Issue 369932 in chromium: Browser crashes after killing developer tools
and then closing all browser windows
Re: Issue 127016 in chromium: Bluetooth: Need to be able to add HID devices
at OOBE (UI)
Re: Issue 25293 in chromium: Chrome does not expect image/x-png MIME type
Re: Issue 363568 in chromium: WebSpeech API Speech Synthesis Playback Error
in 32 Bit Linux Machines
Re: Issue 127016 in chromium: Bluetooth: Need to be able to add HID devices
at OOBE (UI)
Re: Issue 369035 in chromium: Layout Test
inspector/profiler/cpu-profiler-profiling.html is flaky
Issue 370023 in chromium: Autofill not working
Re: Issue 358213 in chromium: Pull server-backed state keys into Chrome via
session_manager DBus interface
Re: Issue 369932 in chromium: Browser crashes after killing developer tools
and then closing all browser windows
Re: Issue 319377 in chromium: WaitFor.eventsHandled() method is not robust
for a test that adds more than one command
Re: Issue 348589 in chromium: 10%-12% regression in
chromium-rel-win7-dual/blink_perf/Parser_innerHTML-setter,chromium-rel-win8-dual/blink_perf/Parser_query-selector-all-class-first,chromium-rel-win8-dual/blink_perf/Parser_innerHTML-setter
at 254335:254362
Re: Issue 363568 in chromium: WebSpeech API Speech Synthesis Playback Error
in 32 Bit Linux Machines
Re: Issue 269719 in chromium: Calling getUserMedia() multiple times on an
HTTP page reprompts for permission each time
Re: Issue 263333 in chromium: crash in media::AudioManagerBase::Shutdown
Re: Issue 351668 in chromium: 10%-29% regression in
chromium-rel-win7-dual/indexeddb_perf/commit_charge,chromium-rel-win7-dual/indexeddb_perf/vm_final_size_renderer,chromium-rel-win7-dual/indexeddb_perf/vm_working_set_final_size_renderer,chromium-rel-win7-dual/indexeddb_perf/vm_working_set_final_size_total
at 256284:256297
Re: Issue 351641 in chromium: 31%-34% regression in
chromium-rel-xp-dual/indexeddb_perf/vm_peak_size_renderer,chromium-rel-win7-dual/indexeddb_perf/vm_peak_size_renderer,chromium-rel-win7-dual/indexeddb_perf/working_set_peak_size_renderer,chromium-rel-xp-dual/indexeddb_perf/working_set_peak_size_renderer,chromium-rel-xp-dual/indexeddb_perf/V8_OsMemoryAllocated
at 256175:256247
Re: Issue 369472 in chromium: TTS breaks in browser after 350 characters
Re: Issue 369917 in chromium: Find-in box is opening while pressing reload
button from the keyboard.
Re: Issue 363568 in chromium: WebSpeech API Speech Synthesis Playback Error
in 32 Bit Linux Machines
Re: Issue 369533 in chromium: iOS bots have been red for a while
Re: Issue 355081 in chromium: lots of bots are not reporting results to the
flakiness dashboard since March 4th
Re: Issue 369955 in chromium: Crash when editing a bookmark
Re: Issue 360477 in chromium: REGRESSION:Browser Crashes on Dragging a
Bookmark from "Other Bookmarks" in BMB and hovering over Tab Strip
Re: Issue 239179 in chromium: Use Python for page sets instead of JSON
Re: Issue 263333 in chromium: crash in media::AudioManagerBase::Shutdown
Issue 370026 in chromium: [virtual keyboard] Bring back voice input to the
VK
Re: Issue 269719 in chromium: Calling getUserMedia() multiple times on an
HTTP page reprompts for permission each time
Re: Issue 335907 in chromium: SpeechSynthesisUtterance is stopping
Re: Issue 343386 in chromium: Security violation exceptions are raised at
incorrect points in the code
Re: Issue 335907 in chromium: SpeechSynthesisUtterance is stopping
Re: Issue 367853 in chromium: 14% regression in
page_cycler.tough_layout_cases at 266313:266326
Re: Issue 368711 in chromium: Unable to scroll after refresh on page with
dynamically generated content
Re: Issue 351397 in chromium: 6%-26% regression in
linux-release/smoothness.tough_canvas_cases/jank,linux-oilpan-release/scheduler.tough_scheduling_cases/touch_scroll_latency_discrepancy,linux-release/scheduler.tough_scheduling_cases/touch_scroll_latency_discrepancy,chromium-rel-xp-dual/scheduler.tough_scheduling_cases/touch_scroll_latency_discrepancy
at 255947:255971
Re: Issue 369899 in chromium: Regression: Contents of webpage flickers on
resizing the window.
Re: Issue 367897 in chromium: 11% regression in blink_perf at 262197:262335
Re: Issue 369405 in chromium: Can't pay bills on comcast.com with Chrome 36
Re: Issue 369868 in chromium: [TouchView] FS RemoteDesktop in TouchView
mode causes problems on return to normal mode
Re: Issue 367284 in chromium: 3% regression in indexeddb_perf at
265665:265686
Re: Issue 367178 in chromium: 1% regression in mach_ports at 265956:265978
Re: Issue 350004 in chromium: 8%-32% regression in
chromium-rel-win7-x64-dual/cc_perftests/execute_tasks_task_graph_runner/2_1_0,chromium-rel-win7-x64-dual/cc_perftests/execute_tasks_task_graph_runner/2_1_1,chromium-rel-win7-x64-dual/cc_perftests/execute_tasks_task_graph_runner/0_32_0
at 254774:254852
Re: Issue 367178 in chromium: 1% regression in mach_ports at 265956:265978
Re: Issue 367140 in chromium: 49% regression in blink_perf at 264359:264383
Re: Issue 348100 in chromium: 10%-19% regression in
chromium-rel-mac9/cc_perftests/layer_tree_host_frame_time/heavy_page,chromium-rel-mac6/cc_perftests/layer_tree_host_frame_time/heavy_page,chromium-rel-win7-dual/cc_perftests/layer_tree_host_frame_time/heavy_page,chromium-rel-mac7-gpu-intel/cc_perftests/layer_tree_host_frame_time/heavy_page
at 253868:253921
Re: Issue 367140 in chromium: 49% regression in blink_perf at 264359:264383
Re: Issue 367908 in chromium: 10% regression in blink_perf at 262487:262607
Re: Issue 367820 in chromium: 2% regression in
startup.warm.dirty.blank_page at 266258:266293
Re: Issue 346796 in chromium: 25% regression in
memory.mobile_memory/vm_private_dirty_final_total at 252646:252752
Re: Issue 367794 in chromium: 18% regression in indexeddb_perf at
264376:264384
Issue 370027 in chromium: Consistent problems with JS GC in Google Docs
Re: Issue 367823 in chromium: 11% regression in blink_perf at 253757:258710
Re: Issue 367823 in chromium: 11% regression in blink_perf at 253757:258710
Re: Issue 368742 in chromium: Using data scheme in WebRTC
Re: Issue 348020 in chromium: 55%-78% regression in
chromium-rel-win7-dual/startup.cold.blank_page/messageloop_start_time,chromium-rel-win7-dual/session_restore.cold.typical_25/messageloop_start_time,chromium-rel-win7-dual/startup.cold.dirty.blank_page/window_display_time,chromium-rel-win7-dual/startup.cold.dirty.blank_page/messageloop_start_time
at 253695:253723
Re: Issue 367255 in chromium: 104% regression in startup.cold.blank_page at
264005:264104
Re: Issue 370007 in chromium: Session ID empty
Re: Issue 367255 in chromium: 104% regression in startup.cold.blank_page at
264005:264104
Re: Issue 233336 in chromium: Printers defaulting to A4 not Letter
Re: Issue 367773 in chromium: 12% regression in page_cycler.intl_hi_ru at
265941:266054
Re: Issue 370027 in chromium: Consistent problems with JS GC in Google Docs
Re: Issue 346548 in chromium: 7%-8% regression in
page_cycler.*/working_set_peak_size_{gpu,renderer} on win7 at 252250:252405
Re: Issue 367773 in chromium: 12% regression in page_cycler.intl_hi_ru at
265941:266054
Re: Issue 370027 in chromium: Consistent problems with JS GC in Google Docs
Re: Issue 367956 in chromium: 4% regression in dromaeo.domcoremodify at
265633:265640
Issue 370029 in chromium: cellStyle name not escaped
Re: Issue 367904 in chromium: 3% regression in dromaeo.domcoreattr at
262652:262847
Re: Issue 367804 in chromium: 16% regression in blink_perf at 264722:264750
Re: Issue 370027 in chromium: Consistent problems with JS GC in Google Docs
Re: Issue 370027 in chromium: Consistent problems with JS GC in Google Docs
Re: Issue 369486 in chromium: [RAL] Repaint of SVG RenderObjects broken
Re: Issue 367875 in chromium: 3% regression in indexeddb_perf at
265918:265924
Re: Issue 367841 in chromium: 15% regression in blink_perf at 264773:264789
Re: Issue 367841 in chromium: 15% regression in blink_perf at 264773:264789
Re: Issue 367119 in chromium: 57% regression in
scheduler.tough_scheduling_cases at 265563:266011
Re: Issue 352123 in chromium: 2%-45% regression in
smoothness.tough_canvas_cases jank and frame_times at 256284:256373
Re: Issue 369369 in chromium: Unclosable right-click pop-ups occasionally
persist.
Re: Issue 353880 in chromium: 4%-5% regression in kraken at 257630:257631
Re: Issue 367043 in chromium: [Proteus -- Settings API] -- Manage Extension
under Default Search Engine does not navigate to chrome://extensions
Re: Issue 367022 in chromium: Regression : Image of the "Shadow" profile
icon not seen after switcing profiles.
Re: Issue 238366 in chromium: DOMImplementation.createDocument should
return an XMLDocument
Re: Issue 351397 in chromium: 6%-26% regression in
linux-release/smoothness.tough_canvas_cases/jank,linux-oilpan-release/scheduler.tough_scheduling_cases/touch_scroll_latency_discrepancy,linux-release/scheduler.tough_scheduling_cases/touch_scroll_latency_discrepancy,chromium-rel-xp-dual/scheduler.tough_scheduling_cases/touch_scroll_latency_discrepancy
at 255947:255971
Re: Issue 367119 in chromium: 57% regression in
scheduler.tough_scheduling_cases at 265563:266011
Re: Issue 369495 in chromium: Regression: Recent profile icon changes broke
taskbar profile shortcut painting
Re: Issue 367267 in chromium: 49% regression in indexeddb_perf at
266144:266150
Re: Issue 367267 in chromium: 49% regression in indexeddb_perf at
266144:266150
Re: Issue 341608 in chromium: [Project Mirror] Profile icons are vertically
stretched
Re: Issue 369853 in chromium: Omnibox chip should not hide when it's too
long to fit
Re: Issue 349065 in chromium: PageInfo bubble does not always show (Mac)
Re: Issue 367826 in chromium: 4% regression in dromaeo.jslibstyleprototype
at 260774:260864
Re: Issue 367826 in chromium: 4% regression in dromaeo.jslibstyleprototype
at 260774:260864
--
--
Automated mail from issue updates at http://crbug.com/
Subscription options: http://groups.google.com/a/chromium.org/group/chromium-bugs

To unsubscribe from this group and stop receiving emails from it, send an email to chromium-bugs+***@chromium.org.
c***@googlecode.com
2014-05-05 22:53:01 UTC
Permalink
Your project notifications generated too many emails to send
individually. Here are the subject lines of the emails you would have
received:

Re: Issue 367226 in chromium: linker errors
Re: Issue 360048 in chromium: Rotate webcam video to match internal display
rotation.
Issue 370200 in chromium: shill: cellular: Use Cellular::type_ to
distinguish entries in the mobile operator database.
Re: Issue 366982 in chromium: Regression: complex :host style not being
applied when class on host changes
Issue 370201 in chromium: Project Mirror : Already added account via Gmail
content area will be gone once we add an account through Chrome mirror .
WAI ?
Re: Issue 361009 in chromium: Bookmarks menu should not disappear after
item order change
Issue 370202 in chromium: Create a frame for hosting content in athena
Re: Issue 360664 in chromium: Cleanup ContentView/CoreViewCore relationship
Re: Issue 370145 in chromium: Uninit error from many content_browsertests
Re: Issue 353592 in chromium: Move manifest parsing from
ppapi/native_client plugin to components/nacl/renderer
Re: Issue 369188 in chromium: dump_vpd_log shouldn't print errors to stdout
Re: Issue 361486 in chromium: High CPU usage and low fps
Re: Issue 370201 in chromium: Project Mirror : Already added account via
Gmail content area will be gone once we add an account through Chrome
mirror . WAI ?
Re: Issue 356823 in chromium: Courier New looks very bad when DirectWrite
is on
Re: Issue 368413 in chromium: Refactor client id / low entropy source code
out of MetricsService into a helper class
Re: Issue 368413 in chromium: Refactor client id / low entropy source code
out of MetricsService into a helper class
Re: Issue 353592 in chromium: Move manifest parsing from
ppapi/native_client plugin to components/nacl/renderer
Re: Issue 369671 in chromium: telemetry_CrosTests failure
Re: Issue 352243 in chromium: MVNO: Remove all old ways of determine
network operator
Re: Issue 359078 in chromium: Enable bluez sixaxis plugin
Re: Issue 352795 in chromium: Need to fix exynos clocks
Re: Issue 338825 in chromium: WebRTC session causes Chrome crash while
processing a new offer
Re: Issue 366363 in chromium: 15%-16% regression in blink_perf at
264773:264796
Re: Issue 367703 in chromium: Background-attachment fixed + retina = no
image
Re: Issue 364479 in chromium: [Mac] Regression : Unable to move Feedback
app with mouse drag when feedback app is opened from newly created user.
Re: Issue 367230 in chromium: Alternative way of obj_int_extract
Issue 370204 in chromium: Figure out how to get Ares playing well with both
Athena and Ash
Re: Issue 366983 in chromium: DirectWrite uses wrong font when referred
font doesn't exist
Re: Issue 363131 in chromium: Chrome Flicks when using CSS transition
Issue 370205 in chromium: Breakpad MinidumpWriterTest.MinidumpSizeLimit is
flaky
Re: Issue 357874 in chromium: FInder switches to selected desktopcapture
tab/window
Re: Issue 353603 in chromium: Drive Spreadsheets No Longer have access to
Comments
Re: Issue 336989 in chromium: Automate MSE HW decoding on ARM devices for
H264 and VP8
Re: Issue 370180 in chromium: filepicker shows over wrong window when
window.focus() is used
Re: Issue 366441 in chromium: 57%-91% regression in
session_restore.warm.typical_25 at 264962:264965
Issue 370207 in chromium: git cl upload should automatically trigger
try-jobs by default
Issue 370206 in chromium: Leak inside WebCore::BidiResolver
Re: Issue 369174 in chromium: The shutdown of Chrome does not occur in fact
in some occasion.
Re: Issue 370207 in chromium: git cl upload should automatically trigger
try-jobs by default
Issue 370208 in chromium: Renderer-based UMA metrics aren't updated in
chrome://histograms on Android
Re: Issue 365346 in chromium: ECHO: enable third party promo codes
Issue 370209 in chromium: Mouse click events not working correctly in
Overview Mode
Re: Issue 370113 in chromium: On restart Google Docs and Sheets tabs taking
up 100% of CPU
Re: Issue 365737 in chromium: Support remote installation of extensions and
apps
Re: Issue 370207 in chromium: git cl upload should automatically trigger
try-jobs by default
Re: Issue 353603 in chromium: Drive Spreadsheets No Longer have access to
Comments
Issue 370210 in chromium: Leak in
WebCore::InternalsGeolocation::setGeolocationClientMock
Re: Issue 367931 in chromium: memory leak causes whole browser crash with
chrome.tabs.captureVisibleTab
Re: Issue 367931 in chromium: memory leak causes whole browser crash with
chrome.tabs.captureVisibleTab
Re: Issue 370210 in chromium: Leak in
WebCore::InternalsGeolocation::setGeolocationClientMock
Re: Issue 361618 in chromium: ShaderToy fails to load on Windows M34
Re: Issue 370151 in chromium: [TouchView] Animations produce flashes
Re: Issue 353426 in chromium: Chrome Crashes on startup
Re: Issue 367931 in chromium: memory leak causes whole browser crash with
chrome.tabs.captureVisibleTab
Re: Issue 370127 in chromium: vm900-m1 is offline
Re: Issue 369911 in chromium: Chrome 34 behind proxy does not handle
session cookie authentication surrogate correctly.
Re: Issue 366755 in chromium: 4% regression in cc_perftests at 265640:265654
Re: Issue 365741 in chromium: Can't type folder name with Virtual Keyboard
Re: Issue 369257 in chromium: Data race in
SkFontConfigInterface::GetSingletonDirectInterface()
Re: Issue 370145 in chromium: Uninit error from many content_browsertests
Re: Issue 360988 in chromium: --disable-ipv6 doesn't work
Re: Issue 366756 in chromium: 1%-7% regression in
dromaeo.jslibmodifyprototype at 265647:265663
Re: Issue 365741 in chromium: Can't type folder name with Virtual Keyboard
Re: Issue 290451 in chromium: Use of uninit value in
content::WebKitTestRunner::CaptureDump
Re: Issue 367820 in chromium: 2% regression in
startup.warm.dirty.blank_page at 266258:266293
Re: Issue 290451 in chromium: Use of uninit value in
content::WebKitTestRunner::CaptureDump
Re: Issue 368081 in chromium: Project Mirror: Android Chrome continually
triggers device management prompt
Re: Issue 370164 in chromium: Can't close Developer Tools in TouchView
Re: Issue 354565 in chromium: 17% regression in jsgamebench at 256254:256421
Re: Issue 290451 in chromium: Use of uninit value in
content::WebKitTestRunner::CaptureDump
Re: Issue 365737 in chromium: Support remote installation of extensions and
apps
Re: Issue 366983 in chromium: DirectWrite uses wrong font when referred
font doesn't exist
Re: Issue 370205 in chromium: Breakpad MinidumpWriterTest.MinidumpSizeLimit
is flaky
Re: Issue 330670 in chromium: TreeCloser:
MinidumpWriterTest.MinidumpSizeLimit failed.
Re: Issue 369257 in chromium: Data race in
SkFontConfigInterface::GetSingletonDirectInterface()
Re: Issue 366810 in chromium: 140% regression in cc_perftests at
264721:264744
Re: Issue 365737 in chromium: Support remote installation of extensions and
apps
Re: Issue 370145 in chromium: Uninit error from many content_browsertests
Re: Issue 366815 in chromium: 1% regression in media.tough_media_cases at
265311:265332
Re: Issue 370145 in chromium: Uninit error from many content_browsertests
Re: Issue 366815 in chromium: 1% regression in media.tough_media_cases at
265311:265332
Re: Issue 370145 in chromium: Uninit error from many content_browsertests
Re: Issue 366820 in chromium: 19%-34% regression in indexeddb_perf at
263594:263602
Re: Issue 358728 in chromium: Telemetry: Timed out going through login
screen
Re: Issue 370081 in chromium: Pressing backspace repeatedly enters text
Issue 370212 in chromium: setup_board gives !!! [Errno url error] unknown
url type: 'gs'
Re: Issue 364808 in chromium: CoreAnimation: Tabs freeze and console
logs "CoreAnimation: failed to allocate N bytes"
Re: Issue 290451 in chromium: Use of uninit value in
content::WebKitTestRunner::CaptureDump
Issue 370213 in chromium: [Chaos Lab] Consolidate DUTs in Chaos Lab
Issue 370214 in chromium: Implement a JS requestAnimationFrame like API in
Pepper
Re: Issue 370214 in chromium: Implement a JS requestAnimationFrame like API
in Pepper
Re: Issue 223198 in chromium: Deprecate x-webkit-speech and
onwebkitspeechchange
Re: Issue 370214 in chromium: Implement a JS requestAnimationFrame like API
in Pepper
Re: Issue 368741 in chromium: ScopedFD considers values less than -1 to be
valid
Re: Issue 290451 in chromium: Use of uninit value in
content::WebKitTestRunner::CaptureDump
Re: Issue 370151 in chromium: [TouchView] Animations produce flashes
Re: Issue 353533 in chromium: Tooltips are parented to WindowTreeHosts that
host small windows.
Re: Issue 365737 in chromium: Support remote installation of extensions and
apps
Re: Issue 319516 in chromium: "Chrome - Notifications" flickers and then
goes away when desktop mouse focus set to follow
Re: Issue 370081 in chromium: Pressing backspace repeatedly enters text
Re: Issue 370189 in chromium: Disable orientation setting if it can't stick
Re: Issue 369505 in chromium: Lock rotation when screen is manually rotated.
--
--
Automated mail from issue updates at http://crbug.com/
Subscription options: http://groups.google.com/a/chromium.org/group/chromium-bugs

To unsubscribe from this group and stop receiving emails from it, send an email to chromium-bugs+***@chromium.org.
c***@googlecode.com
2014-05-06 18:16:33 UTC
Permalink
Your project notifications generated too many emails to send
individually. Here are the subject lines of the emails you would have
received:

Re: Issue 369966 in chromium: REGRESSION:Browser Crashes on Clicking on
Report An Issue Button
Re: Issue 357498 in chromium: Window with "Thanks for your feedback" is not
invoked automatically after sending feedback.
Re: Issue 362450 in chromium: Clicking the middle mouse button causes the
page to scroll down a few lines.
Issue 370498 in chromium: Time input shows validation exception for correct
time
Re: Issue 363433 in chromium: WebM BlockGroups without BlockDuration, yet
with TrackEntry DefaultDurations, are allowed. Should they be?
Re: Issue 369879 in chromium: Math search redirects to IP
Re: Issue 370058 in chromium: Cannot terminate devserver with Ctrl-C
Re: Issue 366219 in chromium: 1%-52% regression in
rasterize_and_record_micro.key_silk_cases at 264549:265535
Re: Issue 357100 in chromium: App List folder can have 1 item
Re: Issue 313438 in chromium: Lets rip out the SVG instance tree
Re: Issue 355120 in chromium: Add UMA stats for folders in Launcher
Re: Issue 370497 in chromium: Supervised user PasswordChange* and
CreateAndRemoveSupervisedUser tests are flaky
Re: Issue 370058 in chromium: Cannot terminate devserver with Ctrl-C
Issue 370499 in chromium: rebaseline-o-matic gets stuck on a detached branch
Re: Issue 369868 in chromium: [TouchView] FS RemoteDesktop in TouchView
mode causes problems on return to normal mode
Re: Issue 370390 in chromium: Regression: TAB key doesn't function at all
or it halts on 'Proceed anyway' button and then it doesn't traverse further
Re: Issue 360242 in chromium: DevTools: add emmet abbreviations to Styles
Pane & Sources
Re: Issue 368373 in chromium: Infinite hang on OOBE for a network with
proxy; can't login
Re: Issue 370489 in chromium: Shadowing between JS properties is broken
after reconfiguration
Re: Issue 370390 in chromium: Regression: TAB key doesn't function at all
or it halts on 'Proceed anyway' button and then it doesn't traverse further
Re: Issue 368065 in chromium: 57%-298% regression in blink_perf at
262200:263553
Re: Issue 72612 in chromium: Add support for OES_vertex_array_object to
command buffer?
Re: Issue 362806 in chromium: [Ptz] Unable to come out of full screen using
touch
Re: Issue 365012 in chromium: Mojo View Manager
Re: Issue 368919 in chromium: conformance/extensions/oes-texture-float.html
fails on win try bots
Re: Issue 370390 in chromium: Regression: TAB key doesn't function at all
or it halts on 'Proceed anyway' button and then it doesn't traverse further
Re: Issue 369879 in chromium: Math search redirects to IP
Re: Issue 370495 in chromium: gtalk: compile time error when using gcc 4.9
Re: Issue 365012 in chromium: Mojo View Manager
Re: Issue 368919 in chromium: conformance/extensions/oes-texture-float.html
fails on win try bots
4 issues changed in chromium
Re: Issue 370487 in chromium: Stumpy_moblab paladin build_packages Flake
Re: Issue 367383 in chromium: [Cast] Remove kVideoFrameSentToEncoder
Re: Issue 348091 in chromium: 5%-18% regression in mac startup at
253964:253992
Re: Issue 369879 in chromium: Math search redirects to IP
Re: Issue 369129 in chromium: testMeasurementSmoke 7.5% flaky on mac due
to "FATAL:video_capture_impl.cc(140)] Check failed: removed. Removing a
non-existent client."
Re: Issue 246777 in chromium: CrOS new dialog style positioning changes
Re: Issue 370265 in chromium: Understanding the test results in wmatrix
across different suites
Re: Issue 370375 in chromium: Component extensions shouldn't be
auto-whitelisted to every API.
Re: Issue 358556 in chromium: Try recipes fail 'svn export' on windows
Re: Issue 346361 in chromium: 2%-25% regression in page_cycler
page_load_time at 252195:252412
Re: Issue 362823 in chromium: Lots of duplicate alerts on dashboard homepage
Re: Issue 246491 in chromium: Omnibox requests keyboard suggestions off
Re: Issue 346576 in chromium: Cast: aesKey and aesIvMask should be set to
the transport
Re: Issue 365012 in chromium: Mojo View Manager
Issue 370502 in chromium: no audio on some youtubes with speakers set to 5.1
Re: Issue 365012 in chromium: Mojo View Manager
Re: Issue 370366 in chromium: In chrome://extensions distorted overlay
of "Keyboard shortcuts" seen after adding few extensions .
Re: Issue 369966 in chromium: REGRESSION:Browser Crashes on Clicking on
Report An Issue Button
Issue 370505 in chromium: display: -webkit-flex does not reflow height
properly
Re: Issue 370451 in chromium: Session for user cannot be started after
reset to initial state
Re: Issue 368388 in chromium: Blinking notification window for Google+
Re: Issue 355679 in chromium: 50% regression in
thread_times.key_mobile_sites at 258711:258732
Re: Issue 369373 in chromium: Provision hangs for 2 hours
Re: Issue 370487 in chromium: Stumpy_moblab paladin build_packages Flake
Re: Issue 366911 in chromium: Cast freezes if receiver starts late
Issue 370506 in chromium: Enable SSE instructions in the sysroot wrapper
Re: Issue 356268 in chromium: Keyboard overlay performance issues
Re: Issue 369662 in chromium: Keypad on external keyboards is no longer
supported, special keys are mis-mapped
Re: Issue 370492 in chromium: Font rendering looks ugly after pinch to
zoom, then zooming back out.
Re: Issue 363404 in chromium: user.eclass stores the board-specific
user/group search path at build time, but does not declare board
dependencies
Re: Issue 366205 in chromium: ozone: DRI implementation is too slow
Re: Issue 320139 in chromium: Dont call repaint during layout
Re: Issue 354968 in chromium: 14% regression in cc_perftests at
258367:258463
Re: Issue 368919 in chromium: conformance/extensions/oes-texture-float.html
fails on win try bots
2 issues changed in chromium
Re: Issue 370486 in chromium: Make board checks actionable
Re: Issue 351168 in chromium: ozone: evdev: Support touchpad
Re: Issue 340465 in chromium: ozone: Support input devices without X11
Re: Issue 355046 in chromium: ozone: Support touch calibration on pixel
Re: Issue 323965 in chromium: ozone mouse support
Re: Issue 340465 in chromium: ozone: Support input devices without X11
Re: Issue 361341 in chromium: ozone: fix build with chromeos==1 use_ozone==1
Re: Issue 355110 in chromium: ozone: pixel touchscreen y-axis not calibrated
Re: Issue 369662 in chromium: Keypad on external keyboards is no longer
supported, special keys are mis-mapped
Re: Issue 369323 in chromium: Crash on Debug build when stopping video
capturing
Re: Issue 369129 in chromium: testMeasurementSmoke 7.5% flaky on mac due
to "FATAL:video_capture_impl.cc(140)] Check failed: removed. Removing a
non-existent client."
Issue 370509 in chromium: chrome.logPrivate API doesn't parse timezone.
Re: Issue 364465 in chromium: Cloud Printer Driver fails with Error status
(used to work)
Re: Issue 362444 in chromium: Feedback app turns blank after quitting
browser and browser behaves unresponsive
Re: Issue 369767 in chromium: renderer target is missing a dependency on
cast_logging_proto
Re: Issue 363543 in chromium: Track static initializers on Android bots
Re: Issue 370394 in chromium: Cell borders are lost after RT
Re: Issue 351658 in chromium: CHECK failure in CHECK(op <
BinaryOpIC::State::FIRST_TOKEN || op > BinaryOpIC::State::LAST_TOKEN)
failed: ../src/type
Re: Issue 318632 in chromium: Require new audio baseline due to changed V8
behavior
Re: Issue 363103 in chromium: Built-in functions on Array.prototype need to
throw on non-writable elements
Re: Issue 311164 in chromium: Array.pop() when the last element is
non-configurable must throw.
Re: Issue 359742 in chromium: ozone/evdev: Handle SYN_DROPPED etc correctly
Re: Issue 328418 in chromium: Make /bisect.py more resilient in the case of
500 errors.
Re: Issue 366911 in chromium: Cast freezes if receiver starts late
Issue 370511 in chromium: [Incorrectly functioning] : Text formatting is
not retained in placeholder/text box/shape when user deletes text in the
first placeholder shifts focus to another placeholder.
Re: Issue 363750 in chromium: CoreAnimation: Download shelf does not have
anti-aliased text
Issue 370512 in chromium: Progress notification not represented in
accessible name of notifications
Re: Issue 369373 in chromium: Provision hangs for 2 hours
Issue 370513 in chromium: Tab dragging speed on Linux Aura regressed
Re: Issue 355114 in chromium: ozone: swiping from the bottom bezel is broken
Re: Issue 370513 in chromium: Tab dragging speed on Linux Aura regressed
Re: Issue 370512 in chromium: Progress notification not represented in
accessible name of notifications
Re: Issue 367372 in chromium: ARM deives
-- "quipper::PerfSerializer::SerializeEvent" crashed randomly
Re: Issue 369373 in chromium: Provision hangs for 2 hours
Re: Issue 368095 in chromium: Chrome_Mac: Crash Report - V8_Fatal
Re: Issue 366911 in chromium: Cast freezes if receiver starts late
--
--
Automated mail from issue updates at http://crbug.com/
Subscription options: http://groups.google.com/a/chromium.org/group/chromium-bugs

To unsubscribe from this group and stop receiving emails from it, send an email to chromium-bugs+***@chromium.org.
c***@googlecode.com
2014-05-09 12:36:33 UTC
Permalink
Your project notifications generated too many emails to send
individually. Here are the subject lines of the emails you would have
received:

Re: Issue 357763 in chromium: Use Safe Browsing API 2.3
Re: Issue 365732 in chromium: Return value of
ExtensionFunction::Run/RunImpl and input to SendResponse is unclear and
confusing
Issue 371767 in chromium: Attached files take more than 10 minutes to
round-trip
Re: Issue 349036 in chromium: QuickSheet Legacy Core Time Formatting
Incorrect
Re: Issue 370739 in chromium: Unistalling a font on the OS causes websites
using a like-named font to become corrupt.
Re: Issue 338295 in chromium: Shape selection remains even on mouse up
Re: Issue 323873 in chromium: Deleting individual items from
chrome://history UI fails if items are in archived history file
Re: Issue 367903 in chromium: Layout Test
web-animations-api/timeline-time.html is flaky
Re: Issue 371283 in chromium: Chameleon: When detecting the connected port,
wait input video stable before get the output name from xrandr
Re: Issue 367372 in chromium: ARM deives
-- "quipper::PerfSerializer::SerializeEvent" crashed randomly
Re: Issue 371763 in chromium: Distortion is seen on gmail while trying to
close the chat window.
Re: Issue 331339 in chromium: A PDF AirPrinted from Chrome is printed about
half the correct size.
Re: Issue 331339 in chromium: A PDF AirPrinted from Chrome is printed about
half the correct size.
Re: Issue 371355 in chromium: Chromium crashes on right click - > save as
Re: Issue 357163 in chromium: Move Node hierarchy to Oilpan using
transition types
Re: Issue 357163 in chromium: Move Node hierarchy to Oilpan using
transition types
Re: Issue 370212 in chromium: setup_board gives !!! [Errno url error]
unknown url type: 'gs'
Re: Issue 370897 in chromium: Extension API tests time out instead of
failing in most cases (sometimes spuriously pass)
Re: Issue 364754 in chromium: gl_helper_unittests crash on Android
Re: Issue 364754 in chromium: gl_helper_unittests crash on Android
Re: Issue 331339 in chromium: A PDF AirPrinted from Chrome is printed about
half the correct size.
Re: Issue 345690 in chromium: LanguageState should be owned by
TranslateManager
Re: Issue 367598 in chromium: App windows in Windows non-Glass still have
titles
Re: Issue 370897 in chromium: Extension API tests time out instead of
failing in most cases (sometimes spuriously pass)
Re: Issue 361115 in chromium: Rename TranslateTabHelper to
ChromeTranslateClient
Issue 371770 in chromium: Currency sign appears at incorrect position for
negative numbers.
Re: Issue 331782 in chromium: Fix translate namespace
Re: Issue 331780 in chromium: Move language_detection to core/
Issue 371771 in chromium: Explicitly disconnected network doesn't
autoconnect on logout/login.
Re: Issue 354650 in chromium: Put all code in //components/signin into the
signin namespace
Re: Issue 357163 in chromium: Move Node hierarchy to Oilpan using
transition types
Re: Issue 358027 in chromium: Componentize FakeSigninManager
Re: Issue 365520 in chromium: platform2 dep issue with dbusxx-xml2cpp
Re: Issue 371771 in chromium: Explicitly disconnected network doesn't
autoconnect on logout/login.
Re: Issue 367598 in chromium: App windows in Windows non-Glass still have
titles
Re: Issue 358026 in chromium: Componentize SigninManager unittest
Re: Issue 334002 in chromium: Componentize FakeProfileOAuth2TokenService
Re: Issue 358155 in chromium: Componentize AccountReconcilor unittest
Re: Issue 334002 in chromium: Componentize FakeProfileOAuth2TokenService
Re: Issue 365379 in chromium: Non managed networks can still auto connect
after log out and log in of a session, when Auto connect is set to true.
Re: Issue 334002 in chromium: Componentize FakeProfileOAuth2TokenService
Re: Issue 359122 in chromium: Componentize SigninTracker unittest
Re: Issue 370517 in chromium: Change title of suspicious extensions bubble
dialog
Re: Issue 10658 in chromium: chrome.exe still running after closing all
Chrome windows
Re: Issue 359123 in chromium: Add iOS-specific implementation of
ProfileOAuth2TokenService
Re: Issue 256746 in chromium: Bluetooth: AVRCP support
Re: Issue 362608 in chromium: Separate out icu dependencies from net/ and
url/
Re: Issue 370466 in chromium: [virtual keyboard] Tapping the Chrome/hotdog
menu button should hide the keyboard.
Re: Issue 370517 in chromium: Change title of suspicious extensions bubble
dialog
Re: Issue 370466 in chromium: [virtual keyboard] Tapping the Chrome/hotdog
menu button should hide the keyboard.
Re: Issue 367366 in chromium: Support key rotation in EME
Re: Issue 362608 in chromium: Separate out icu dependencies from net/ and
url/
Re: Issue 370434 in chromium: Move code from components/bookmarks/core/...
to components/bookmarks/...
Re: Issue 370435 in chromium: Move test support code from
components/bookmarks/core/test to components/bookmarks/core/browser
Re: Issue 370433 in chromium: Move bookmarks component code in the
bookmarks namespace
Re: Issue 367834 in chromium: Componentize bookmarks unit test:
bookmark_model_unittest.cc
Re: Issue 367366 in chromium: Support key rotation in EME
Issue 371774 in chromium: After Selecting Row/Column Header Unable To Apply
Formatting On Complete Row/Column
Re: Issue 371712 in chromium: Regression: Images overlaps on clicking
slider button.
Issue 371776 in chromium: Enterprise enrollment fails on Mario
Re: Issue 351305 in chromium: Cannot type é on a CA_FR keyboard in Chrome
Latest AURA
Re: Issue 371753 in chromium: While playing video, menu options disappear
after going for "Small Player".
Issue 371777 in chromium: Test that expected error messages are indeed
thrown in ExtensionWebRequestApiTest
Re: Issue 355415 in chromium: Unable to toggle bold in cell, incorrect menu
Re: Issue 370890 in chromium: conflicting accounts
Re: Issue 371774 in chromium: After Selecting Row/Column Header Unable To
Apply Formatting On Complete Row/Column
Re: Issue 371704 in chromium: Content of new mail window opened through
notification turns gray blanked.
Re: Issue 167939 in chromium: Textarea's handles can be used when textarea
is visibility:hidden and fire mouseover events
Re: Issue 371750 in chromium: Google+ Photos App is broken
Re: Issue 370842 in chromium: Select tag works differently on windows and
on Android
Re: Issue 371755 in chromium: Regression:chrome://omnibox Tab crashes
via 'Reload'
Issue 371779 in chromium:
http://build.chromium.org/p/tryserver.chromium/builders/win_chromium_rel/builds/13784/steps/telemetry_perf_unittests/logs/testMeasurementSmoke
is flaky
Re: Issue 367837 in chromium: Componentize bookmarks unit test:
bookmark_utils_unittest.cc
Re: Issue 371549 in chromium: Repeatedly repeated same hash URL
history/popstate by onclick on same URL
Re: Issue 371299 in chromium: Pseudo element appearing in the wrong place
(::before and ::first-letter)
Re: Issue 371746 in chromium: Would be nice to understand when Blink
features came/went
Re: Issue 371549 in chromium: Repeatedly repeated same hash URL
history/popstate by onclick on same URL
Re: Issue 370482 in chromium: 2910%-6422% regression in
scheduler.tough_scheduling_cases at 268373:268411
Re: Issue 371137 in chromium: 29% regression in
smoothness.tough_canvas_cases at 267198:267631
Re: Issue 369402 in chromium: [Crash] "whoops.." error when user Upsaves
(10 or >10 slides) PPT files and scrolls across the thumbnail
Re: Issue 370838 in chromium: Flexbox toggle collapse bug. After toggle
collapse, the column height is not adjusted in Chrome.
Re: Issue 351995 in chromium: Keyboard Shortcuts don't work after scrolling
on a page
Re: Issue 371749 in chromium: Android Upstream FYI bots broken
Re: Issue 371749 in chromium: Android Upstream FYI bots broken
Re: Issue 359565 in chromium: ☂ Componentise //chrome/browser/bookmarks
Re: Issue 371763 in chromium: Distortion is seen on gmail while trying to
close the chat window.
Re: Issue 370850 in chromium: ☂ Componentize //chrome/browser/history
Re: Issue 358106 in chromium: [Sheet RT Open crash]: " File Open failed:
uex " error in opening of sheet file(.xls)
Re: Issue 350720 in chromium: Tab with Google Doc eats 1000+ MB of memory
from mmap-v8-other.
Re: Issue 369920 in chromium: [QP Editing]Undo\Redo : Whoops occurs, if we
perform delete slide and undo slide operation quickly for files having many
slides
Re: Issue 371762 in chromium: Observing flicker(black and grey small boxes)
after closing tab.
Re: Issue 350720 in chromium: Tab with Google Doc eats 1000+ MB of memory
from mmap-v8-other.
Re: Issue 370027 in chromium: Consistent problems with JS GC in Google Docs
Issue 371783 in chromium: After clicking on Print icon, Print preview not
displayed in "www.sbs.com"
Re: Issue 370948 in chromium: Subframe with 100% height does not print
correctly in Chrome
Re: Issue 362442 in chromium: In guest mode, chromeVox is not verbalizing.
Re: Issue 278540 in chromium: Rename experimental.accessibility API
Re: Issue 278540 in chromium: Rename experimental.accessibility API
Re: Issue 366642 in chromium: Unable to open large zip file in file manager
app
Re: Issue 370707 in chromium: Files.app: Cannot open zip archive.
Re: Issue 362442 in chromium: In guest mode, chromeVox is not verbalizing.
Re: Issue 261628 in chromium: New save password UI
--
--
Automated mail from issue updates at http://crbug.com/
Subscription options: http://groups.google.com/a/chromium.org/group/chromium-bugs

To unsubscribe from this group and stop receiving emails from it, send an email to chromium-bugs+***@chromium.org.
c***@googlecode.com
2014-05-09 22:31:32 UTC
Permalink
Your project notifications generated too many emails to send
individually. Here are the subject lines of the emails you would have
received:

Re: Issue 348626 in chromium: Class not registered error when relaunching
Canary
Re: Issue 353501 in chromium: Chrome causing incoming calls to go straight
to loudspeaker?
Issue 372038 in chromium: Customer reports connection to Cisco ASA drops
after 130 minutes
Re: Issue 342023 in chromium: Rendering issues when viewing street view
pictures
Re: Issue 371959 in chromium: Uninit read at
webrtc::PeerConnection::DoInitialize
Re: Issue 371995 in chromium: 8%-100% regression in
scheduler.tough_scheduling_cases at 262131:264004
Issue 372039 in chromium: Whitelist experimental bookmarks extensions for
fileSystem and fileSystem.write
Re: Issue 335493 in chromium: [Dump without crash]
browser_sync::DataTypeController::RecordUnrecoverableError - canary/dev
sync breakpad uploads
Re: Issue 371755 in chromium: Regression:chrome://omnibox Tab crashes
via 'Reload'
Re: Issue 353937 in chromium: WebGL in iframes does not print
Re: Issue 371734 in chromium: Please enable EV treatment for Actalis
Re: Issue 371734 in chromium: Please enable EV treatment for Actalis
Re: Issue 368033 in chromium: cq failure: A branch named 'patch_branch'
already exists.
Issue 372040 in chromium: Is it necessary to mask exceptions from
importKey() when unwrapping keys?
Re: Issue 315863 in chromium: CQ does not check whether user uploaded new
version of a patch during CQ run
Re: Issue 371980 in chromium: Guard power_manager package
behind "power_manager" USE flag
Re: Issue 292237 in chromium: nexus 4 rebooting with chrome beta
Re: Issue 369853 in chromium: Omnibox chip should not hide when it's too
long to fit
Re: Issue 365012 in chromium: Mojo View Manager
Re: Issue 371620 in chromium: Please install pyopenssl (and openssl if need
be) on the slaves in -a6
Re: Issue 370549 in chromium: Cleanup src/platform and excise stale
projects from manifest
Re: Issue 367885 in chromium: chromite unittest not run on CQ
Re: Issue 371478 in chromium: ozone/freon: make X11 optional for chromeos
builds
Re: Issue 370460 in chromium: Second and improper default gateway added
upon establishing OpenVPN connection
Re: Issue 371620 in chromium: Please install pyopenssl (and openssl if need
be) on the slaves in -a6
Issue 372041 in chromium: script to list machines repair failed for a time
duration
Re: Issue 354861 in chromium: WWE Network Full Screen Scaling Issue
Re: Issue 371776 in chromium: Enterprise enrollment fails on Mario
Re: Issue 370460 in chromium: Second and improper default gateway added
upon establishing OpenVPN connection
Re: Issue 370520 in chromium: CRASH: media::ConvertYUVAToARGB_MMX(unsigned
char const *,unsigned char const *,unsigned char const *,unsigned char
const *,unsigned char *,int,int,int,int,int,int,media::YUVType)
Re: Issue 342319 in chromium: Chrome does not call NotifyWinEvent with
EVENT_SYSTEM_ALERT at startup
Re: Issue 319523 in chromium: Win Aura detection of JAWS is flaky
Re: Issue 371147 in chromium: servod interrupted PTY write seems incorrect
Re: Issue 371603 in chromium: Autotest AFE: Fix admin page functionality
Re: Issue 360933 in chromium: Write an Autotest test that can test the
necessary behavior of servo actions
Issue 372043 in chromium: CFM unstable on dev channel 36.0.1981.2 dev
Re: Issue 372040 in chromium: Is it necessary to mask exceptions from
importKey() when unwrapping keys?
Re: Issue 369853 in chromium: Omnibox chip should not hide when it's too
long to fit
Re: Issue 342319 in chromium: Chrome does not call NotifyWinEvent with
EVENT_SYSTEM_ALERT at startup
Re: Issue 370520 in chromium: CRASH: media::ConvertYUVAToARGB_MMX(unsigned
char const *,unsigned char const *,unsigned char const *,unsigned char
const *,unsigned char *,int,int,int,int,int,int,media::YUVType)
Re: Issue 319523 in chromium: Win Aura detection of JAWS is flaky
Re: Issue 365012 in chromium: Mojo View Manager
Re: Issue 308675 in chromium: Port GpuCrashTest to Telemetry and run on GPU
bots
Re: Issue 365904 in chromium: WebGL Context Lost/Restore tests are flaky on
the GPU bots
Re: Issue 372017 in chromium: Linux Tests (dbg)(1)(32) browser_tests
failures in ExtensionWebstorePrivateApiTest
Re: Issue 371764 in chromium: net: add (*.)postfinance.ch to HSTS preloaded
list
Re: Issue 372017 in chromium: Linux Tests (dbg)(1)(32) browser_tests
failures in ExtensionWebstorePrivateApiTest
Re: Issue 370283 in chromium: Merge existing platform2 components code into
src/platform2
Re: Issue 371289 in chromium: browser_tests should not call
session_manager's StopSession D-Bus method
Re: Issue 162183 in chromium: Redirect in XHR destination url causes XHR to
be canceled
Re: Issue 371868 in chromium: maps_002 fails on GPU.FYI Win7 NVIDIA bots
(Debug and Release)
Re: Issue 372009 in chromium: Chrome uninstall landing page 404
Issue 372044 in chromium: Hosts mysteriously rebooting during a test
Re: Issue 309294 in chromium: REGRESSION(r127163): Respect clearance set on
ancestors when placing floats
Re: Issue 368027 in chromium: Position of Linux App Launcher when installed
for the first time and when installing app from Chrome Web Store
Re: Issue 320743 in chromium: margin-bottom ignored, causing simple page to
render different than IE or Firefox
Re: Issue 372036 in chromium: optimize png files for 36
Re: Issue 372043 in chromium: CFM unstable on dev channel 36.0.1981.2 dev
Issue 372045 in chromium: Define a wrapping URL scheme to use for the
SiteInstance of a Service Workers so that RPHImpl can assign them to the
right process
Re: Issue 370987 in chromium: Update recording for Maps GPU test
Re: Issue 364937 in chromium: window.screen should not be replaceable
Re: Issue 371501 in chromium: Implement chrome.audio apis on linux chrome
Re: Issue 265753 in chromium: Remove src/webkit
Re: Issue 237249 in chromium: Split chrome.dll into chrome_browser.dll and
chrome_child.dll
Re: Issue 338338 in chromium: Remove webkit_glue abstraction layer
Re: Issue 369377 in chromium: Land QO 36.105.n.n end of milestone release
in CrOS tip of tree.
Re: Issue 356791 in chromium: Prototype/test Domain Reliability /
Navigation Error Logging with Google sites
Re: Issue 338338 in chromium: Remove webkit_glue abstraction layer
Re: Issue 356791 in chromium: Prototype/test Domain Reliability /
Navigation Error Logging with Google sites
Re: Issue 237249 in chromium: Split chrome.dll into chrome_browser.dll and
chrome_child.dll
Re: Issue 371501 in chromium: Implement chrome.audio apis on linux chrome
Re: Issue 265753 in chromium: Remove src/webkit
Re: Issue 372036 in chromium: optimize png files for 36
Re: Issue 368147 in chromium: Unable to scroll Settings page if mouse does
not have scroll wheel
Re: Issue 273094 in chromium: Fedora 19
Re: Issue 364937 in chromium: window.screen should not be replaceable
Re: Issue 239048 in chromium: libpeerconnection.log file created in CWD
Re: Issue 371513 in chromium: android_clang_dbg trybot has compile issues
Re: Issue 364937 in chromium: window.screen should not be replaceable
Re: Issue 351994 in chromium: Moblab: Give moblab user sudo access
Re: Issue 358570 in chromium: Google Play Music for Chrome - Mini-Player
doesn't work
Re: Issue 369853 in chromium: Omnibox chip should not hide when it's too
long to fit
Re: Issue 336805 in chromium: Require a reason when locking a host
Re: Issue 269920 in chromium: Take care of SELinux details on install
Issue 372046 in chromium: Change in DOM node pattern in gmail endure test
at 264107:264314
Re: Issue 372046 in chromium: Change in DOM node pattern in gmail endure
test at 264107:264314
Re: Issue 364937 in chromium: window.screen should not be replaceable
Re: Issue 371530 in chromium: Page scrolling gets janky after a while
Re: Issue 251214 in chromium: No option for "other systems" when
downloading Chrome
Re: Issue 372017 in chromium: Linux Tests (dbg)(1)(32) browser_tests
failures in ExtensionWebstorePrivateApiTest
Re: Issue 351994 in chromium: Moblab: Give moblab user sudo access
Re: Issue 372046 in chromium: Change in DOM node pattern in gmail endure
test at 264107:264314
Re: Issue 353937 in chromium: WebGL in iframes does not print
Re: Issue 337606 in chromium: Chrome 32.0.1700.76: Flash Video (Youtube)
is "Choppy" & Jerky
Re: Issue 371928 in chromium: 10.6%-11.3% regression in cc_perftests at
269128:269163
Re: Issue 336805 in chromium: Require a reason when locking a host
Issue 372047 in chromium: No UMA for incognito extensions
Re: Issue 305376 in chromium: Remove -webkit-line-clamp
Re: Issue 371603 in chromium: Autotest AFE: Fix admin page functionality
Re: Issue 372045 in chromium: Define a wrapping URL scheme to use for the
SiteInstance of a Service Worker so that RPHImpl can assign it to the right
process
Issue 372048 in chromium: Disable auto-hide of toolbar when TalkBack is on
Issue 372049 in chromium: Enable PPAPI browser_tests under ARM Non-SFI NaCl
--
--
Automated mail from issue updates at http://crbug.com/
Subscription options: http://groups.google.com/a/chromium.org/group/chromium-bugs

To unsubscribe from this group and stop receiving emails from it, send an email to chromium-bugs+***@chromium.org.
c***@googlecode.com
2014-05-13 13:05:36 UTC
Permalink
Your project notifications generated too many emails to send
individually. Here are the subject lines of the emails you would have
received:

Issue 372771 in chromium: 8ms per frame under
updateLayerPositionsAfterScroll on MBP scrolling bit.ly/blinkon2
Re: Issue 369903 in chromium: Chrome should expose a relation between the
main window and all active alerts
Re: Issue 371314 in chromium: conflicting accounts
Re: Issue 370890 in chromium: conflicting accounts
Re: Issue 372771 in chromium: 8ms per frame under
updateLayerPositionsAfterScroll on MBP scrolling bit.ly/blinkon2
Re: Issue 372755 in chromium: Options on translate pop-up are not getting
changed even after translation.
Issue 372772 in chromium: Chrome hangs wwhile "Downloading Proxy Script"
Re: Issue 369015 in chromium: Drag and drop of flash(swf) files does not
work (+ reason why)
Re: Issue 372772 in chromium: Chrome hangs wwhile "Downloading Proxy Script"
Re: Issue 367114 in chromium: Ability to use finch experiments to control
webrtc internal features
Re: Issue 372771 in chromium: 8ms per frame under
updateLayerPositionsAfterScroll on MBP scrolling bit.ly/blinkon2
Re: Issue 372772 in chromium: Chrome hangs while "Downloading Proxy Script"
Re: Issue 371287 in chromium: Network stays connected on logout if
autoconnect is disabled.
Re: Issue 371061 in chromium: Hotrod regressed on M36
Re: Issue 372688 in chromium: After saving a image,observing missing
buttons in camera app..
Re: Issue 372771 in chromium: 8ms per frame under
updateLayerPositionsAfterScroll on MBP scrolling bit.ly/blinkon2
Re: Issue 355952 in chromium: Fix and re-enable key_silk_cases benchmarks
on android
Issue 372776 in chromium: Websocket data frames received after connection
close frame?!
Issue 372777 in chromium: focus() on iframe triggers focusout
Re: Issue 361491 in chromium: Software estimation of power consumption
doesn't produce sane results on morejs
Re: Issue 341435 in chromium: "Origin" header dynamic test failing on the
win_blink_rel bot
Re: Issue 372759 in chromium: Add performance tests for Service Worker
Re: Issue 361491 in chromium: Software estimation of power consumption
doesn't produce sane results on morejs
Re: Issue 372018 in chromium: some pages are not displayed correctly when
open to a tab
Re: Issue 372721 in chromium: White coloured patch is observed around
profile "Avatar"
Re: Issue 360034 in chromium: [Regression] Indentation get increased
between text for the 2k3 files which has two content slide layout
Re: Issue 226445 in chromium: Middle-click behaves differently than right
click->open in new tab leading to a crash
Re: Issue 370592 in chromium: [Pinch-to-zoom] Enable scroll into view to
work with the inner viewport for OSK
Re: Issue 372777 in chromium: focus() on iframe triggers focusout
Re: Issue 370592 in chromium: [Pinch-to-zoom] Enable scroll into view to
work with the inner viewport for OSK
Issue 372778 in chromium: From validation pop up position is not proper
Re: Issue 372489 in chromium: page_cycler.moz failing on N4 with error 255
Issue 372779 in chromium: Regression: Flickering is observed
on 'change:time' text, after clicking on 'pointer icon' button in
http://jsfiddle.net/zR3uW/3/
Re: Issue 372770 in chromium: Regression: Video doesn't play
in "www.airindia.com" website.
Re: Issue 370002 in chromium: Left/Center/Right Allignment buttons on
MenuBar not getting updated on "Undo/Redo" operation in pptx file
Re: Issue 303251 in chromium: Update testharness.js
Re: Issue 371891 in chromium: Enterprise wildcard login check fails
Re: Issue 372721 in chromium: White coloured patch is observed around
profile "Avatar"
Re: Issue 371376 in chromium: Short time for show window for proxy
authorization
Re: Issue 372779 in chromium: Regression: Flickering is observed
on 'change:time' text, after clicking on 'pointer icon' button in
http://jsfiddle.net/zR3uW/3/
Re: Issue 372418 in chromium: Mac DeviceMonitorMac: race between |
susped_observer_| destruction and use in Device Thread.
Re: Issue 372778 in chromium: From validation pop up position is not proper
Re: Issue 369495 in chromium: Regression: Recent profile icon changes broke
taskbar profile shortcut painting
Re: Issue 372779 in chromium: Regression: Flickering is observed
on 'change:time' text, after clicking on 'pointer icon' button in
http://jsfiddle.net/zR3uW/3/
Re: Issue 365786 in chromium: Alt+Tab should exit overview mode
Re: Issue 341608 in chromium: [Project Mirror] Profile icons are vertically
stretched
Re: Issue 368289 in chromium: "ERROR: SetCellContent requires an updated
cell text" issue reported by GA
Re: Issue 372695 in chromium: Chrome_Mac: Crash Report - [Memory
corruption] base::`anonymous namespace'::oom_killer_memalign
Re: Issue 369495 in chromium: Regression: Recent profile icon changes broke
taskbar profile shortcut painting
Issue 372781 in chromium: 'Zoom' option issue observed for Google images.
Re: Issue 372781 in chromium: 'Zoom' option issue observed for Google
images.
Issue 372782 in chromium: [Document Specific] Speaker notes are not visible
Re: Issue 369495 in chromium: Regression: Recent profile icon changes broke
taskbar profile shortcut painting
Re: Issue 372781 in chromium: 'Zoom' option issue observed for Google
images.
Issue 372783 in chromium: Regression: Print preview does not appear in the
first instance for New message in Gmail
Re: Issue 371875 in chromium: [Aura] Can't long press drag links in Unified
GR
Issue 372784 in chromium: Regression:Network error page flashes before
loading and after few seconds page automatically reloads
Re: Issue 372402 in chromium: Tab crash is observed on refreshing the
chrome://omnibox page.
Re: Issue 372489 in chromium: page_cycler.moz failing on N4 with error 255
Re: Issue 372402 in chromium: Tab crash is observed on refreshing the
chrome://omnibox page.
Re: Issue 372754 in chromium: Enable deadlock detection in ThreadSanitizer
by default
Issue 372785 in chromium: Scrolling via mouse wheel is not smooth.
Re: Issue 370837 in chromium: arm/depthcharge: Support legacy boot
Re: Issue 365643 in chromium: Crash occurs when user presses delete in text
box, changes formatting ,and types a character.
Re: Issue 363020 in chromium: Crash occurs when user enters some data
deletes it and clicks enter.
Issue 372786 in chromium: Crash occures when user keeps file Idle for more
than 7/8 hours revisit the same file & try to edit the file
Re: Issue 372783 in chromium: Regression: Print preview does not appear in
the first instance for New message in Gmail
Re: Issue 372783 in chromium: Regression: Print preview does not appear in
the first instance for New message in Gmail
Re: Issue 372785 in chromium: Scrolling via mouse wheel is not smooth.
Re: Issue 371376 in chromium: Short time for show window for proxy
authorization
Re: Issue 372779 in chromium: Regression: Flickering is observed
on 'change:time' text, after clicking on 'pointer icon' button in
http://jsfiddle.net/zR3uW/3/
Re: Issue 234505 in chromium: DevTools should allow inspecting flattened
Shadow DOM trees
Re: Issue 370989 in chromium: Lines missing when printing pages
Re: Issue 372778 in chromium: From validation pop up position is not proper
Re: Issue 372635 in chromium: telemetry_unittests and
telemetry_perf_unittests flaky on Linux ChromeOS
Re: Issue 365269 in chromium: Loading images disappearing
Re: Issue 372749 in chromium: ServiceWorker: Change IDL Arrays to ES Arrays
Re: Issue 372782 in chromium: [Document Specific] Speaker notes are not
visible
Re: Issue 287805 in chromium: MediaStream API: MediaStreamTrack should
support the new constraints API
Re: Issue 372489 in chromium: page_cycler.moz failing on N4 with error 255
Re: Issue 357163 in chromium: Move Node hierarchy to Oilpan using
transition types
Issue 372787 in chromium: fast/block/lineboxcontain/glyphs.html broken with
subpixel font scaling
Re: Issue 372713 in chromium: Browser Crash Recovery bubble is not fit
inside the browser window
Re: Issue 370212 in chromium: setup_board gives !!! [Errno url error]
unknown url type: 'gs'
Re: Issue 372489 in chromium: page_cycler.moz failing on N4 with error 255
Re: Issue 372489 in chromium: page_cycler.moz failing on N4 with error 255
Re: Issue 371136 in chromium: HttpServer shouldn't crash simply because of
non-HTTP/1.1 request
Re: Issue 371136 in chromium: HttpServer shouldn't crash simply because of
non-HTTP/1.1 request
Re: Issue 372560 in chromium: Intermittent test timeouts caused by
inability to bind listening socket
Re: Issue 372226 in chromium: Uninit error from
WebCore::PinchViewport::PinchViewport
Re: Issue 368389 in chromium: PDF viewer dragged from normal monitor to
retina display are blurry
Re: Issue 372489 in chromium: page_cycler.moz failing on N4 with error 255
Issue 372788 in chromium: Promises: should not cache results of thenables,
only promises
Re: Issue 346626 in chromium: Enable Android x64 Build
Re: Issue 354405 in chromium: Chrome on Arm64 tracking bug
Re: Issue 362847 in chromium: [Linux ChromiumOS Tests]
WallpaperManagerBrowserTest.DisplayChange became flaky
Re: Issue 372788 in chromium: Promises: should not cache results of
thenables, only promises
Re: Issue 362847 in chromium: [Linux ChromiumOS Tests]
WallpaperManagerBrowserTest.DisplayChange became flaky
Re: Issue 372226 in chromium: Uninit error from
WebCore::PinchViewport::PinchViewport
Re: Issue 354405 in chromium: Chrome on Arm64 tracking bug
Re: Issue 346626 in chromium: Enable Android x64 Build
Issue 372789 in chromium: Regression: Apache basic auth saved password is
not filled in
--
--
Automated mail from issue updates at http://crbug.com/
Subscription options: http://groups.google.com/a/chromium.org/group/chromium-bugs

To unsubscribe from this group and stop receiving emails from it, send an email to chromium-bugs+***@chromium.org.
c***@googlecode.com
2014-05-13 23:27:53 UTC
Permalink
Your project notifications generated too many emails to send
individually. Here are the subject lines of the emails you would have
received:

Re: Issue 364677 in chromium: Text highlighting is laggy
Re: Issue 371532 in chromium: public manifests do not initialize
FETCHCOMMAND_GS in sdk leading to binpkgs not being used
Re: Issue 365496 in chromium: Remove gerrit-over-ssh code from
my_activity.py
Re: Issue 234173 in chromium: Share browser-side scheduling logic between
apps
Re: Issue 373026 in chromium: 4.5% regression in
smoothness.tough_canvas_cases at 265423:265605
Issue 373026 in chromium: 4.5% regression in smoothness.tough_canvas_cases
at 265423:265605
Re: Issue 373023 in chromium: Webview in kiosk does not fire 'newwindow'
event.
Re: Issue 365992 in chromium: Renderer hang when HTTP auth prompt is
displayed for minimized window
Re: Issue 339558 in chromium: Chrome Apps: Add option to Chrome frame to
allow color theming
Re: Issue 373027 in chromium: 14.4% regression in
smoothness.tough_canvas_cases at 265139:265223
Issue 373027 in chromium: 14.4% regression in smoothness.tough_canvas_cases
at 265139:265223
Re: Issue 373027 in chromium: 14.4% regression in
smoothness.tough_canvas_cases at 265139:265223
Re: Issue 362111 in chromium: Create a PRESUBMIT hook for the dhcpcd.conf
in chromeos-admin
Re: Issue 373028 in chromium: 5.2% regression in
smoothness.tough_canvas_cases at 265224:265422
Issue 373028 in chromium: 5.2% regression in smoothness.tough_canvas_cases
at 265224:265422
Re: Issue 373028 in chromium: 5.2% regression in
smoothness.tough_canvas_cases at 265224:265422
Re: Issue 372983 in chromium: Allow incremental release builds for
non-official builds.
Re: Issue 346616 in chromium: Two calls to getUserMedia with different
resolution constraints result in two identical streams
Re: Issue 367306 in chromium: Changing default Google base URL from HTTP to
HTTPS causes strange telemetry failures
Re: Issue 371651 in chromium: Various SVG tests flaky, failing after
https://codereview.chromium.org/262963003
Issue 373029 in chromium: Chromeperf is down.
Re: Issue 365741 in chromium: Can't type folder name with Virtual Keyboard
Re: Issue 371152 in chromium: chrome://setting -> Enable "Ok Google" to
start a voice search , option is seen only after a page refresh
Re: Issue 345804 in chromium: Show error bubble when the hotwording
component is not available
Re: Issue 372951 in chromium: Chrome not filling locale properly for
feedback
Re: Issue 372572 in chromium: chromite: cbuildbot_unittest fails on
x86-generic PFQ
Re: Issue 362272 in chromium: Hotwording doesn't work in the latest canary
build
Re: Issue 345871 in chromium: Send different CGI param to GWS when
hotwording is enabled
Re: Issue 372993 in chromium: Kernel crash/panic reboot the device to OOBE
instead of sign in screen for first time
Re: Issue 372973 in chromium: SyncErrorNotifierTest.PassphraseNotification
is crashing on Win7
Re: Issue 371592 in chromium: Remove
ContentViewRenderView::CompositeToBitmap or make it asynchronous.
Re: Issue 372562 in chromium: Pixel tests failing on Android GPU bot
Re: Issue 362111 in chromium: Create a PRESUBMIT hook for the dhcpcd.conf
in chromeos-admin
Issue 373032 in chromium: Only expose WebCrypto to secure origins
Re: Issue 372582 in chromium: Datatype error seen and open tabs not syncing
after re-signing back to Chrome.
Re: Issue 371152 in chromium: chrome://setting -> Enable "Ok Google" to
start a voice search , option is seen only after a page refresh
Re: Issue 368929 in chromium: 2% regression in dromaeo.domcoremodify at
263800:263810
5 issues changed in chromium
Re: Issue 244999 in chromium: Improve our logging of how often we fall back
to the local NTP and why
Re: Issue 373029 in chromium: Chromeperf is down.
Re: Issue 372640 in chromium: Cautotest AFE "Image (Build Name): " Does Not
Work
Re: Issue 370991 in chromium: ISE on chromeperf
Re: Issue 246693 in chromium: Testing: The local Google NTP should show the
appropriate logo
Re: Issue 246707 in chromium: Testing: Chrome should work even when the
instant URL returns a non-200 response
Re: Issue 248193 in chromium: Testing: Fallback to local NTP
Re: Issue 367744 in chromium: Screencapture notification is on top of apple
dock/windows taskbar when it comes out of hiding
Re: Issue 248214 in chromium: Testing: themes work
Re: Issue 372991 in chromium: Alex-canary hwtest failed with abort
Re: Issue 353266 in chromium: Externally loaded components should be
handled more cleanly
Re: Issue 355027 in chromium: Remove hotword pop up code from hotword
service.
Re: Issue 365206 in chromium: Default focus misplaced on
chrome://settings/clearBrowserData
Re: Issue 341611 in chromium: IsPolicyLocation should not include external
component extensions
Issue 373034 in chromium: Remove optin.js
Re: Issue 372159 in chromium: Chromium LKGR and LKCR is 900+ revs behind
Re: Issue 372743 in chromium: RenderLayer paint functions miss the cache
with abandon
Re: Issue 372159 in chromium: Chromium LKGR and LKCR is 900+ revs behind
Issue 373035 in chromium: Glimpse of black padding shown around the App
Launcher
Re: Issue 373035 in chromium: Glimpse of black padding shown around the App
Launcher
Re: Issue 373023 in chromium: Webview in kiosk does not fire 'newwindow'
event.
Re: Issue 372834 in chromium: Hotrod shows mouse cursor on M35
Re: Issue 372983 in chromium: Allow incremental release builds for
non-official builds.
Re: Issue 342884 in chromium: Hotrod setup and launch autotest
Re: Issue 356716 in chromium: chrome/browser/services/gcm should be
componentized
Re: Issue 370047 in chromium: 500 when not logged in: Alerts page throws
AssertionError trying to fetch internal-only data.
Re: Issue 370991 in chromium: ISE on chromeperf
Re: Issue 372640 in chromium: Cautotest AFE "Image (Build Name): " Does Not
Work
Re: Issue 356716 in chromium: chrome/browser/services/gcm should be
componentized
Re: Issue 373015 in chromium: Mobile gmail allows "vertical" scrolling into
blank space
Issue 373037 in chromium: Use sane default screen size in Chromoting Linux
Host if unpatched Xvfb is being used.
Re: Issue 368365 in chromium: Giant mouse cursor
Re: Issue 372983 in chromium: Allow incremental release builds for
non-official builds.
Re: Issue 373037 in chromium: Use sane default screen size in Chromoting
Linux Host if unpatched Xvfb is being used.
Re: Issue 373023 in chromium: Webview in kiosk does not fire 'newwindow'
event.
Re: Issue 365206 in chromium: Default focus misplaced on
chrome://settings/clearBrowserData
Re: Issue 368365 in chromium: Giant mouse cursor
Re: Issue 304341 in chromium: Move frame specific functionality from
RenderView(Host) to RenderFrame(Host)
Re: Issue 372834 in chromium: Hotrod shows mouse cursor on M35
Re: Issue 372651 in chromium: Disable chrome.webstore API for kiosk apps
Re: Issue 304341 in chromium: Move frame specific functionality from
RenderView(Host) to RenderFrame(Host)
Re: Issue 370540 in chromium: Add IPs for other dongles
Issue 373038 in chromium: Some instances of
MediaStreamDevicesControllerBrowserTest browsertests are failing. Fix them.
Re: Issue 372266 in chromium: Import Bookmarks and Settings greyed out
despite editing bookmarks being enabled
Re: Issue 356364 in chromium: Earth Mode is not enabled for Intel G41 or
G33 graphics chipsets
Re: Issue 372973 in chromium: SyncErrorNotifierTest.PassphraseNotification
is crashing on Win7
Issue 373039 in chromium: SourceBufferStream incorrectly uses DTS, not PTS,
in at least GetBufferedRanges()
Re: Issue 355683 in chromium: 395% regression in page_cycler.moz at
257680:257712
Re: Issue 371515 in chromium: Tab crash in testMeasurementSmoke on win
trybot
Re: Issue 373037 in chromium: Use sane default screen size in Chromoting
Linux Host if unpatched Xvfb is being used.
Re: Issue 361809 in chromium: ActionRunner cleanup
Re: Issue 370570 in chromium: Power management policy set by extension via
chrome.power gets dropped with multiprofile
Issue 373040 in chromium: Platform_Mosys test fails with timeout
Re: Issue 372704 in chromium: ServiceWorkerDatabase should return status
code instead of boolean
Re: Issue 303862 in chromium: Reenable tests disabled to turn ash on on
linux_aura
Re: Issue 300084 in chromium: Ash should be compiled into the desktop linux
binary
Re: Issue 372704 in chromium: ServiceWorkerDatabase should return status
code instead of boolean
Re: Issue 303862 in chromium: Reenable tests disabled to turn ash on on
linux_aura
Re: Issue 364141 in chromium: Upstream <appview>
Re: Issue 330264 in chromium: Tracking bug: Migrate BrowserPlugin to use
RenderFrame Architecture
Re: Issue 300084 in chromium: Ash should be compiled into the desktop linux
binary
Issue 373041 in chromium: replaceState forgotten after subframe navigations
Re: Issue 372333 in chromium: Content overlaps on clicking refresh button.
Re: Issue 356364 in chromium: Earth Mode is not enabled for Intel G41 or
G33 graphics chipsets
--
--
Automated mail from issue updates at http://crbug.com/
Subscription options: http://groups.google.com/a/chromium.org/group/chromium-bugs

To unsubscribe from this group and stop receiving emails from it, send an email to chromium-bugs+***@chromium.org.
Continue reading on narkive:
Loading...