Discussion:
102 messages from Google Code
(too old to reply)
c***@googlecode.com
2015-11-30 21:48:53 UTC
Permalink
Your project notifications generated too many emails to send
individually. Here are the subject lines of the emails you would have
received:

Issue 563698 in chromium: Pointer-lock permission falls partially off-window
Re: Issue 369044 in chromium: Disable hover on touch for sites with a width
<= device-width
Re: Issue 404161 in chromium: Promises should propagate UserGestureIndicator
Re: Issue 563664 in chromium: (chameleon test suites) Tests for snow DUT
at chromeos1-row5-rack5-host2 have no results on wmatrix dashboard
Re: Issue 549782 in chromium: Add wayland library to src/third_party
Re: Issue 399184 in chromium: registerProtocolHandler() does not create
proper handler url if we specify a relative url as handler
Re: Issue 400540 in chromium: Focus is locked to password field if we don't
select generated password on first attempt.
Re: Issue 562222 in chromium: Mac Overlays: Execute CGLTexImageIOSurface2D
lazily
Re: Issue 512704 in chromium: Unable to download a complete web application
and run it locally from within a Chrome packaged application
Re: Issue 563528 in chromium: R47 builds failing on Builder: Linux ChromeOS
Buildspec Test
Re: Issue 401896 in chromium: Implement support for contact meta extension
Re: Issue 550602 in chromium: Hangout screen freezes after screenshare is
clicked in a hangout call between pit and the desktop user
Re: Issue 517308 in chromium: security_test_image faild with wrong fs type
to mount recovery_image.bin
Re: Issue 528786 in chromium: Incognito Mode Loses Cookies/Session Once App
Loses Focus
Re: Issue 563625 in chromium: ChromiumOS SDK stopped running 1 month ago
Re: Issue 563625 in chromium: ChromiumOS SDK stopped running 1 month ago
Re: Issue 554527 in chromium: toolchain-llvm builder on chromiumos
waterfall isn't running
Re: Issue 554527 in chromium: toolchain-llvm builder on chromiumos
waterfall isn't running
Re: Issue 554527 in chromium: toolchain-llvm builder on chromiumos
waterfall isn't running
Re: Issue 543324 in chromium: Lots of flickering browsing sites using
Chrome version 46.0.2490.71
Re: Issue 560953 in chromium: chromite test BrilloDeployOperation flake
Re: Issue 472900 in chromium: crashpad uses base but is DEPS'd in
Re: Issue 468268 in chromium: Findit should analyze test-level failures
instead of step-level
Re: Issue 560549 in chromium: Clear All button in Android Storage UI.
Re: Issue 544889 in chromium: git cl upload super slow on Windows
Re: Issue 560476 in chromium: Reclaim vm683-m1
Re: Issue 557624 in chromium: showNotification throws TypeError when
NotificationActions action or title is empty
Re: Issue 544889 in chromium: git cl upload super slow on Windows
Re: Issue 158922 in chromium: Libvpx shares the compressor context between
threads in a possibly dangerous manner
Issue 563704 in chromium: DevTools: Cubic Bezier Editor - Live demo of
effects
Re: Issue 563294 in chromium: Remote tracing throws an exception in dev and
canary
Issue 563705 in chromium: Enable FeatureList sub-process plumbing to all
child processes
Re: Issue 563625 in chromium: ChromiumOS SDK stopped running 1 month ago
Re: Issue 484370 in chromium:
svg/custom/gradient-userSpaceOnUse-with-percentage.svg fails on Win Debug
Re: Issue 545870 in chromium: MD downloads: cards shift on search (or any
other page size changes)
Re: Issue 558622 in chromium: Remove SK_SUPPORT_LEGACY_LINEAR_GRADIENT_TABLE
Re: Issue 439817 in chromium: Chrome crashes when making lots of recursive
setIntervals
Re: Issue 447153 in chromium: Mouse/Pen pointer stopps working & disappears
Re: Issue 545234 in chromium: smooth scrolls should be disabled where it
doesn't help the user experience
Re: Issue 411687 in chromium: Gtalk plugin not working on ChromeOS
(Stumpy/Samsung Chromebox)
Re: Issue 563625 in chromium: ChromiumOS SDK stopped running 1 month ago
Re: Issue 560498 in chromium: First run experience for Aura Android
Re: Issue 472900 in chromium: crashpad uses base but is DEPS'd in
Re: Issue 563664 in chromium: (chameleon test suites) Tests for snow DUT
at chromeos1-row5-rack5-host2 have no results on wmatrix dashboard
Re: Issue 469165 in chromium: Occasionally cannot enter text in any input
fields
Re: Issue 189177 in chromium: ThreadSanitizer v2 reports races in
v8::Locker::Initialize
Re: Issue 319400 in chromium: Javascript exceptions in regular scope not
inherited by incognito scope
Re: Issue 561295 in chromium: The audio thread should not access
AbstractAudioContext::m_destinationNode
Re: Issue 561780 in chromium: [Chaos] Test startup failure due to init()
method argument mismatch
Re: Issue 472900 in chromium: crashpad uses base but is DEPS'd in
Re: Issue 558575 in chromium: Layout can cause content to scroll around
while the user is reading it.
Re: Issue 546107 in chromium: Add a mojo service to handle MediaDrm
provisioning.
Re: Issue 554501 in chromium: Password bubble not correctly drawing default
button until explicitly focused
Re: Issue 472900 in chromium: crashpad uses base but is DEPS'd in
Re: Issue 563705 in chromium: Enable FeatureList sub-process plumbing to
all child processes
Re: Issue 255442 in chromium: Gmail reply - Bold and Italic style stuck
Re: Issue 563625 in chromium: CrOS Repo Sync builder has been offline for
~1 month.
Re: Issue 256247 in chromium: iframe constrained by max-width in full screen
Re: Issue 562683 in chromium: Proximity auth: circular include dependency
between it and ble/cryptauth
Re: Issue 256300 in chromium: Chrome does not respond to the primary
selection changing.
Re: Issue 559527 in chromium: "telemetry_perf_unittests (with patch)" is
flaky
Re: Issue 562685 in chromium: proximity_auth target includes test headers
Re: Issue 251724 in chromium: Support application/http-index-format content
type
Re: Issue 549782 in chromium: Add wayland library to src/third_party
Re: Issue 539698 in chromium: Can't run autotest directly on DUT anymore
Re: Issue 563698 in chromium: Pointer-lock permission falls partially
off-window
Re: Issue 562231 in chromium: mac_chromium_10.10_rel_ng triggers on
Swarming with os: Mac-10.8
Re: Issue 551926 in chromium: Add atmega support for servo V3 into servod
Re: Issue 161068 in chromium: Should user gestures follow postMessage?
Re: Issue 563458 in chromium: 21.8% regression in blink_perf.bindings at
362055:362055
Re: Issue 561660 in chromium: chrome.runtime.onInstalled handler does not
fire when extension is re-enabled after new permissions
Re: Issue 528786 in chromium: Incognito Mode Loses Cookies/Session Once App
Loses Focus
Re: Issue 152399 in chromium: window.innerHeight incorrect after going into
fullscreen mode on OS X
Issue 563708 in chromium: ec: stm32: cleanup PWM pin initialization
Issue 563709 in chromium: 2183.6% regression in media.mse_cases at
361854:361866
Re: Issue 563709 in chromium: 2183.6% regression in media.mse_cases at
361854:361866
Re: Issue 563612 in chromium: Early return if CL already is present in
branch.
Re: Issue 558595 in chromium: buildbucket: integrate with swarming
Re: Issue 560226 in chromium: Can not use window.print() in sandboxed
Chrome App since Chrome v.46
Issue 563710 in chromium: Heap corruption on Mac OS X
Re: Issue 472900 in chromium: crashpad uses base but is DEPS'd in
Issue 563711 in chromium: Remove unused git mirrors
(external/wayland/weston, external/wayland/wayland)
Re: Issue 560847 in chromium: Git mirror for new third_party dependency
wayland/wayland-protocols
Re: Issue 549782 in chromium: Add wayland library to src/third_party
Re: Issue 563710 in chromium: Heap corruption on Mac OS X
Issue 563712 in chromium: [daisy] touchpad not working and VT2 brought back
to VT1 automatically
Re: Issue 559241 in chromium: Make update_scripts a trooperable failure
Re: Issue 504650 in chromium: Cmd-Tab does not work correctly with Apps
Re: Issue 559133 in chromium: -webkit-column-break-inside creates
unaccounted for margin at the bottom of columns
Re: Issue 563712 in chromium: [daisy] touchpad not working and VT2 brought
back to VT1 automatically
Re: Issue 548794 in chromium: Remove use of URLRequestJob refcounting in
ServiceWorkerControlleeRequestHandler
Issue 563714 in chromium: Upgrade ReadPixels to handle ES3 case of reading
into a PIXEL_PACK_BUFFER
Re: Issue 424646 in chromium: Chrome does not scroll using 3M ergo mouse
Re: Issue 548794 in chromium: Remove use of URLRequestJob refcounting in
ServiceWorkerControlleeRequestHandler
Re: Issue 550065 in chromium: Many -Wmicrosoft-cast warnings on the tot win
clang bots
Re: Issue 563694 in chromium: svg/hixie/perf/005.xml is failing in debug
mode
Re: Issue 558761 in chromium: [Stumpy] DisplayPort to HDMI ( Male to Female
) Adapter is not working
Re: Issue 424646 in chromium: Chrome does not scroll using 3M ergo mouse
Re: Issue 560509 in chromium: compositor artifacts, probably when the root
window size is different from display?
Re: Issue 558825 in chromium: Mouse's movement delay in facebook games
Re: Issue 555416 in chromium: Regression: First run bubble doesn't dismiss
after opening the NTP or clicking anywhere on pages .
Re: Issue 169937 in chromium: text-align: center + text-overflow: ellipsis
alignment
--
--
Automated mail from issue updates at http://crbug.com/
Subscription options: http://groups.google.com/a/chromium.org/group/chromium-bugs

---
You received this message because you are subscribed to the Google Groups "Chromium-bugs" group.
To unsubscribe from this group and stop receiving emails from it, send an email to chromium-bugs+***@chromium.org.
c***@googlecode.com
2015-11-30 22:52:07 UTC
Permalink
Your project notifications generated too many emails to send
individually. Here are the subject lines of the emails you would have
received:

Issue 563721 in chromium: Update Desktop People Settings
Re: Issue 560549 in chromium: Clear All button in Android Storage UI.
Re: Issue 542179 in chromium: App Intent thrown on every Browser click event
Re: Issue 563708 in chromium: ec: stm32: cleanup PWM pin initialization
Re: Issue 373560 in chromium: PacedSender may be inadvertently dropping
frames
Re: Issue 557638 in chromium: Cursor is not seen inside 'Add new Class' on
opening the 'Element Classes' in 'Devtools.
Re: Issue 505506 in chromium:
ExtensionSettingsWebUITest.testDeveloperModeNoExtensions flaky
Issue 563722 in chromium: Update Desktop User Manager
Re: Issue 561705 in chromium: Optimize Settings controls
Re: Issue 557638 in chromium: Cursor is not seen inside 'Add new Class' on
opening the 'Element Classes' in 'Devtools.
Re: Issue 563721 in chromium: Update Desktop People Settings
Re: Issue 531655 in chromium: [UI][Network] Chrome://settings page
sometimes does not reflect proper VPN status, after disconnecting VPN.
Re: Issue 538614 in chromium: Roll Clang past 247874
Re: Issue 499176 in chromium: ActivityLogApiTest.TriggerEvent hangs flakily
on Mac 10.6 Tests
Re: Issue 563233 in chromium: SSLLabs.com client test crashes
Re: Issue 340448 in chromium: component BITS downloads fail in some cases
Re: Issue 557422 in chromium: Replace Pass() with std::move() where possible
Re: Issue 340448 in chromium: component BITS downloads fail in some cases
Issue 563723 in chromium: Make data usage must be recorded only occur when
prefs::kDataUsageReportingEnabled is enabled.
Re: Issue 561834 in chromium: Several 'Operation not allowed' errors in
`adb_install_apk.py`
Re: Issue 514719 in chromium: multiple video tags with same SRC downloads
media file multiple times
Re: Issue 527940 in chromium: Chrome incorrectly renders pages after resume
Re: Issue 561834 in chromium: Several 'Operation not allowed' errors in
`adb_install_apk.py`
Re: Issue 563708 in chromium: ec: stm32: cleanup PWM pin initialization
Re: Issue 563716 in chromium: Stack traces from Telemetry runs aren't
symbolized on Mac
Re: Issue 561796 in chromium: "can't create
/data/local/chrome-command-line: Permission denied" when trying to run
tests on non-rooted Android
Re: Issue 422444 in chromium: InlineLoginUIBrowserTest.DifferentStorageId
browser test is flaky
Re: Issue 563580 in chromium: Clarify TV overscan UI
Re: Issue 563708 in chromium: ec: stm32: cleanup PWM pin initialization
Re: Issue 561796 in chromium: "can't create
/data/local/chrome-command-line: Permission denied" when trying to run
tests on non-rooted Android
Re: Issue 310456 in chromium: FTP not working behind Authenticating HTTP
Proxy using NTLM (Forefront TMG)
Re: Issue 562592 in chromium: bluetooth: Content Settings Enable/Disable
switch
Re: Issue 563696 in chromium: Chrome hangs while trying to close app.
Re: Issue 506115 in chromium: Chrome_Mac: With MacViews App Windows: Chrome
freezes under QuitWithAppsController::ButtonClick(int)
Issue 563724 in chromium: bluetooth: Content Settings for Web Bluetooth
Re: Issue 562592 in chromium: bluetooth: Content Settings Enable/Disable
switch
Re: Issue 333943 in chromium: Remove built-in support for FTP from Chrome
Re: Issue 310456 in chromium: FTP not working behind Authenticating HTTP
Proxy using NTLM (Forefront TMG)
Re: Issue 563710 in chromium: Heap corruption on Mac OS X
Re: Issue 506115 in chromium: Chrome_Mac: With MacViews App Windows: Chrome
freezes under QuitWithAppsController::ButtonClick(int)
Re: Issue 563716 in chromium: Stack traces from Telemetry runs aren't
symbolized on Mac
Re: Issue 561796 in chromium: "can't create
/data/local/chrome-command-line: Permission denied" when trying to run
tests on non-rooted Android
Re: Issue 506115 in chromium: Chrome_Mac: With MacViews App Windows: Chrome
freezes under QuitWithAppsController::ButtonClick(int)
Re: Issue 207003 in chromium: force ancillary ebuild repositories to strict
manifest
Re: Issue 546019 in chromium: Allow collected histogram data to live across
task boundaries.
Re: Issue 542417 in chromium: Handle MediaCrypto and encrypted stream in
AndroidVideoDecoderAccelerator.
Re: Issue 138542 in chromium: Migrate from base/basictypes.h standard types
to use stdint.h instead.
Re: Issue 488550 in chromium: Use the fixed size integers defined in
<stdint.h> rather than "basictypes.h" (i.e. uint8_t vs uint8) throughout
src/net/*
Issue 563725 in chromium: Webplot missing dependency "centroiding"
Re: Issue 460235 in chromium: ExternalProviderImplTest.InAppPayments fails
in Win/Mac/Linux 32 & 64 trunk 8011 builder
Re: Issue 557410 in chromium: cidb-scraping helper script
Re: Issue 563292 in chromium: Media Source eviction breaks during buffering
Re: Issue 552034 in chromium: Black Guest wallpaper
Re: Issue 472740 in chromium: Fix the cache lock.
Re: Issue 557430 in chromium: Investigate ERR_ABORTED regression
Issue 563726 in chromium: file input fires onchange event when the user
hits cancel after already selecting a file
Re: Issue 520135 in chromium: Update failed (error: 11) on Mac Chrome
Re: Issue 507691 in chromium: Sign-in flow flashes network error screen and
hangs on slow connections.
Re: Issue 563725 in chromium: Webplot missing dependency "centroiding"
Re: Issue 561834 in chromium: Several 'Operation not allowed' errors in
`adb_install_apk.py`
Re: Issue 563708 in chromium: ec: stm32: cleanup PWM pin initialization
Re: Issue 125888 in chromium: SSH extension doesn't permit use of IBUS
input method (and maybe also other input methods, not tested)
Re: Issue 218382 in chromium: hterm: incorrect handling of utf-8 input
Re: Issue 554501 in chromium: Password bubble not correctly drawing default
button until explicitly focused
Issue 563729 in chromium: Sign in dialog with 2 factor verification code
link is not visually clickable
Issue 563730 in chromium: Replace the use of WebInputEvent with ui::Event
in browser process
Re: Issue 563217 in chromium: Setting .async on dynamically created imports
does not make them async
Re: Issue 563528 in chromium: R47 builds failing on Builder: Linux ChromeOS
Buildspec Test
Re: Issue 561338 in chromium: Eliminate LegacyInterfaceTypeChecking
Re: Issue 472740 in chromium: Fix the cache lock.
Re: Issue 534306 in chromium: sink ID for media elements is forgotten when
src changes.
Re: Issue 560767 in chromium: Thin white line observed in
m.tvcast.naver.com in landscape mode.
Re: Issue 560767 in chromium: Thin white line observed in
m.tvcast.naver.com in landscape mode.
Re: Issue 456420 in chromium: Loading chrome://newtab/ with
--site-per-process returns incorrect VirtualURL to tests
Re: Issue 467125 in chromium: BrowserTest.ClearPendingOnFailUnlessNTP is
flaky in --site-per-process mode
Re: Issue 561105 in chromium: Security review: Mac shared memory via mach
primitives
Re: Issue 417518 in chromium: Get tests working with --site-per-process
Re: Issue 448592 in chromium: Get extension browsertests to pass in
--site-per-process mode
Re: Issue 560767 in chromium: Thin white line observed in
m.tvcast.naver.com in landscape mode.
Re: Issue 487437 in chromium: Screenshare doesn't show the contents of
the 'internal display' in Blaze-DVT
Re: Issue 557902 in chromium: Consider deferring resolving WebRtc's
incoming rotation indication to avoid a frame copy
Issue 563732 in chromium: Add support for integration testing of Cronet
Http2 support
Re: Issue 486040 in chromium: Support encrypted payloads for push messages
Re: Issue 563732 in chromium: Add support for integration testing of Cronet
Http2 support
Re: Issue 328431 in chromium: Add code folding/collapsing in Dev Tools
source editor for JS and CSS/SCSS files
Re: Issue 516342 in chromium: Expose bidirectional streaming API from Cronet
Re: Issue 557387 in chromium: Investigate increased memory usage from Mach
shared memory.
Re: Issue 557387 in chromium: Investigate increased memory usage from Mach
shared memory.
Re: Issue 546067 in chromium: Implement Mojo associated interfaces
Re: Issue 563330 in chromium: Unnecessary eye dropper is seen in ‘DevTools’.
Re: Issue 560592 in chromium: Add CommitOverlayPlanesCHROMIUM for showing
overlays without a swapbuffers
Issue 563733 in chromium: Evolve example_main into shell controller
Re: Issue 563333 in chromium: The size of the scroll bar changes
when 'Google apps' overlay is scrolled with mouse scroll.
Re: Issue 563716 in chromium: Stack traces from Telemetry runs aren't
symbolized on Mac
Re: Issue 420107 in chromium: WebAudio decodeAudioData needs to return a
promise
Issue 563734 in chromium: Context menu appears after clicking "Show in
toolbar"
Re: Issue 402007 in chromium: WebAudio deprecation issues
Re: Issue 562119 in chromium: WebKit Android (Nexus4) is red since 23
November
Re: Issue 561780 in chromium: [Chaos] Test startup failure due to init()
method argument mismatch
Re: Issue 556630 in chromium: [Chaos]Interop data for M48 Report card
Re: Issue 558179 in chromium: leak in
content::ServiceWorkerContextWrapper::ServiceWorkerContextWrapper
Re: Issue 563342 in chromium: internet getting disconnected for the current
webpage as i open dev tools
--
--
Automated mail from issue updates at http://crbug.com/
Subscription options: http://groups.google.com/a/chromium.org/group/chromium-bugs

---
You received this message because you are subscribed to the Google Groups "Chromium-bugs" group.
To unsubscribe from this group and stop receiving emails from it, send an email to chromium-bugs+***@chromium.org.
c***@googlecode.com
2015-12-01 15:38:48 UTC
Permalink
Your project notifications generated too many emails to send
individually. Here are the subject lines of the emails you would have
received:

Re: Issue 534743 in chromium: Wrong User Agent in HTTP Header Intermittently
Re: Issue 405534 in chromium: Input box positioning is shifting down from
SKIA update 12614
Issue 564024 in chromium: rambi-d-release-group canary fails BuildPackages
for sumo
Re: Issue 560486 in chromium: Ensure BrowserProcessImpl::IsShuttingDown
conditions hold during StartTearDown()
Re: Issue 555296 in chromium: 0.6% regression in sizes at 358271:358279
Issue 564025 in chromium: [Sync] Extension keeps coming back, after removal
Re: Issue 543537 in chromium: Images corrupted
Re: Issue 493783 in chromium: <feTile> generated content being clipped and
not repainted
Issue 564028 in chromium: Unaligned settings button placement in
notificaiton
Re: Issue 563918 in chromium: Re-look at deadline mode while scrolling.
Re: Issue 91230 in chromium: Multi-Profiles: Add support for custom avatar
Re: Issue 304031 in chromium: update office::doc to avoid using raw
pointers - styles
Re: Issue 513672 in chromium: Launch notification action buttons
Re: Issue 561772 in chromium: update_scripts step occasionally failing on
Windows bots
Issue 564031 in chromium: When zoomed out on dev tools, some variables do
not display correctly on popup tooltips
Re: Issue 455679 in chromium: Make interactive_ui_tests run under
ThreadSanitizer on Linux
Re: Issue 563448 in chromium: Eight layout tests continue to flake on
Android
Re: Issue 512704 in chromium: Unable to download a complete web application
and run it locally from within a Chrome packaged application
Re: Issue 552391 in chromium: Blame list on recipe-triggered builders has
holes and duplicates. Triggering build is fine.
Re: Issue 549126 in chromium: System does not recover from long term sleep
Re: Issue 537836 in chromium: gfx::Rect::Union
Re: Issue 561913 in chromium: Chrome Mobile Policy: describe your issue
Re: Issue 444023 in chromium: 18.4% regression in webrtc_perf_tests at
7809:7809
Re: Issue 559241 in chromium: Make update_scripts a trooperable failure
Re: Issue 448620 in chromium: Don't load SPI GPT on recovery mode in
depthcharge
Re: Issue 464312 in chromium: 19.4%-35.5% regression in webrtc_perf_tests
at 8595:8596
Re: Issue 446377 in chromium: Implement and verify modifications to GPT in
SPI NOR flash
Re: Issue 460564 in chromium: ozone: dri: support larger cursor than 64x64
Re: Issue 384146 in chromium: Expose UMA stats for histogram of read/write
sizes/latencies
Re: Issue 445773 in chromium: [Freon]Observing black screen for fraction of
second while ending gpu process..
Re: Issue 433433 in chromium: Support external GPT in vboot and futility
Re: Issue 534790 in chromium: chromiumbugs.appspot.com / Open Redirect
Re: Issue 531292 in chromium: Large amount of exceptions from ui: Not
implemented reached in std::string gpu::CollectDriverVersionNVidia()
Re: Issue 523145 in chromium: Refactor video capture IPC message classes to
use MessageRouter and IPC_MESSAGE_ROUTED_N
Re: Issue 442790 in chromium: Implement MTD UUID support to clean up kernel
command-line params
Issue 564032 in chromium: Bookmarks Bar: Folders appear pressed when
opening another folder
Re: Issue 208563 in chromium: cbootimage: EOF was never detected and
building a BCT failed.
Re: Issue 208563 in chromium: cbootimage: EOF was never detected and
building a BCT failed.
Re: Issue 563716 in chromium: Stack traces from Telemetry runs aren't
symbolized on Mac
Re: Issue 440322 in chromium: Cached favicons are kept even after clearing
cache.
Re: Issue 564023 in chromium: Failing Quic tests on the Android Cronet bots
Re: Issue 561417 in chromium: Mark as untranslateable strings that are not
used in policy templates.
Re: Issue 561417 in chromium: Mark as untranslateable strings that are not
used in policy templates.
Re: Issue 563927 in chromium: CrOS build broken
Re: Issue 561388 in chromium: FR - Policy to push Apps on device level
during a user session
Re: Issue 89924 in chromium: Download shelf should autohide for
Command+click and dropdown interactions
Re: Issue 451089 in chromium: Have DeviceStateRetrievalResponse imply dev
mode blocking
Re: Issue 563473 in chromium: 11.9%-43.2% regression in blink_perf.layout
at 361658:361691
Re: Issue 394069 in chromium: EnrollmentScreenTest.TestSuccess is flaky
Re: Issue 524269 in chromium: Mark retail mode policies as removed
Re: Issue 563473 in chromium: 11.9%-43.2% regression in blink_perf.layout
at 361658:361691
Issue 564034 in chromium: Demuxer::GetMemoryUsage() should run on media
thread
Re: Issue 564034 in chromium: Demuxer::GetMemoryUsage() should run on media
thread
Re: Issue 534790 in chromium: chromiumbugs.appspot.com / Open Redirect
Re: Issue 437454 in chromium: Clean up data races in cc_unittests
Re: Issue 563474 in chromium: 11.9%-43.2% regression in blink_perf.layout
at 361658:361691
Re: Issue 563473 in chromium: 11.9%-43.2% regression in blink_perf.layout
at 361658:361691
Re: Issue 328868 in chromium: ThreadSanitizer v2 reports false positives in
libnspr
Re: Issue 546584 in chromium: GUI freezes when disconnecting HDMI cable
from Chromebox
Re: Issue 391276 in chromium: Run cc_unittests under TSan v2
Re: Issue 563455 in chromium: 2.4%-4.4% regression in
page_cycler.intl_ar_fa_he at 361380:361556
Re: Issue 561883 in chromium: 2%-81.3% regression in webrtc_perf_tests at
10751
Re: Issue 106683 in chromium: DefaultSearchProvider can't be set as a
recommended policy
Re: Issue 543537 in chromium: Images corrupted
Re: Issue 563484 in chromium: 14.2%-23.9% regression in blink_perf.dom at
362048:362051
Re: Issue 563927 in chromium: CrOS build broken
Re: Issue 499878 in chromium:
NaClBrowserTestPnaclSubzero.PnaclErrorHandling flaky on XP bot
Re: Issue 548641 in chromium: Policies should be ignored outside their
supported_on version range.
Re: Issue 563484 in chromium: 14.2%-23.9% regression in blink_perf.dom at
362048:362051
Re: Issue 165414 in chromium: 7% PERF_REGRESS: chrome-data/data on Linux
Re: Issue 563487 in chromium: 1.3%-18.6% regression in
memory.long_running_idle_gmail at 361386:361617
Re: Issue 315328 in chromium: PnaclHeaderTest.TestHasPnaclHeader is flaky
Re: Issue 563488 in chromium: 1.5%-11.1% regression in
page_cycler.top_10_mobile at 361094:361528
Re: Issue 558707 in chromium: Roll HarfBuzz to 1.1.1
Re: Issue 563489 in chromium: 3.1%-4.3% regression in
power.throttled_plugins_pps_enabled at 361072:361093
Re: Issue 535247 in chromium: Changing the url/hash in a popup
(window.open) has side effect to requesting permission
Issue 564035 in chromium: Regression in 2d canvas benchmark (mindcat)
Re: Issue 563491 in chromium: 1.2%-1.8% regression in
rasterize_and_record_micro.top_25_smooth at 361423:361496
Re: Issue 460537 in chromium: Make Cultural Institute New Tab Page
Background into Wallpaper App
Re: Issue 552543 in chromium: content_browsertests fail to cleanup on
Windows bots
Re: Issue 563492 in chromium: 1.2%-1.8% regression in
rasterize_and_record_micro.top_25_smooth at 361423:361496
Re: Issue 550460 in chromium: Recommended DefaultSearchProvider settings
are duplicated
Re: Issue 563494 in chromium: 5.1%-18.5% regression in
thread_times.simple_mobile_sites at 361529:361598
Re: Issue 564024 in chromium: rambi-d-release-group canary fails
BuildPackages for sumo
Re: Issue 563495 in chromium: 5.1%-18.5% regression in
thread_times.simple_mobile_sites at 361529:361598
Re: Issue 207003 in chromium: force ancillary ebuild repositories to strict
manifest
Re: Issue 113111 in chromium: [Android] Add support for Chrome
Extensions/Apps
Re: Issue 563927 in chromium: CrOS build broken
Re: Issue 534159 in chromium: page reloads on connecting / disconnecting
Ethernet
Re: Issue 475839 in chromium: Figure out how to maintain Blackmagic SDK in
Chrome
Issue 564039 in chromium: swarm content_browsertests are failing after all
successes
Re: Issue 564039 in chromium: swarm content_browsertests are failing after
all successes on Win7 Tests
Re: Issue 520538 in chromium: Requests generated by navigator.sendBeacon
from Blob shown without POST body in network tab of dev tools
Issue 564040 in chromium: nacl-arm_perf_panda trybot doesn't work
Issue 564041 in chromium: TraceEvents should be reported before the native
library load on Android
Re: Issue 563501 in chromium: 1% regression in
tab_switching.tough_energy_cases at 361978:361999
Re: Issue 563656 in chromium:
telemetry.core.platform_unittest.PlatformScreenshotTest.testScreenshot is
flaky on linux
Re: Issue 563501 in chromium: 1% regression in
tab_switching.tough_energy_cases at 361978:361999
Issue 564042 in chromium: Wheel event
Re: Issue 563502 in chromium: 1% regression in
tab_switching.tough_energy_cases at 361978:361999
Re: Issue 404771 in chromium: Rehome HTTP Server & WPR in Telemetry
Re: Issue 563503 in chromium: 1.2% regression in sunspider at 361480:361499
--
--
Automated mail from issue updates at http://crbug.com/
Subscription options: http://groups.google.com/a/chromium.org/group/chromium-bugs

---
You received this message because you are subscribed to the Google Groups "Chromium-bugs" group.
To unsubscribe from this group and stop receiving emails from it, send an email to chromium-bugs+***@chromium.org.
c***@googlecode.com
2015-12-01 16:30:49 UTC
Permalink
Your project notifications generated too many emails to send
individually. Here are the subject lines of the emails you would have
received:

Re: Issue 464783 in chromium: Feature Request: Frequently Used Sites
Prefetching.
Re: Issue 464440 in chromium: Dragging bookmarks opens them
Re: Issue 401730 in chromium: Chromoting documentation says that Debian is
supported, which is not true
Re: Issue 459029 in chromium: Bookmarks export failing due to wrong
handling of "<select>" element
Re: Issue 456844 in chromium: New tab page needs a fix for not
Full-HD-resolutions
Re: Issue 452069 in chromium: Touch usability improvements for bookmarks
manager
Re: Issue 440191 in chromium: GTK+ theme on Linux doesn't have drop shadows
on Material Design MD New Tab Page
Re: Issue 428715 in chromium: Placement of Edit/Done buttons is
inconsistent between Bookmark Added and Edit Bookmark dialogs
Re: Issue 563863 in chromium: Make it possible to construct an
OffscreenCanvas on a Worker
Re: Issue 454150 in chromium: Wrong FavIcon on Desktop verison of Google
chrome
Re: Issue 398404 in chromium: Touch feedback enhancements for the bookmark
manager
Re: Issue 553925 in chromium: Recipe flakes are killing usefulness of build
CQ
Re: Issue 113111 in chromium: [Android] Add support for Chrome
Extensions/Apps
Re: Issue 465308 in chromium: 23.1% regression in webrtc_perf_tests at
8603:8603
Re: Issue 243926 in chromium: In fullscreen mode, typing in Google search
Fakebox does nothing
Re: Issue 561387 in chromium: health plan memory-regression (m47 -> m48):
3.7% renderer
Re: Issue 538654 in chromium: 1.6%-9.6% regression in various
screenshare_slides_vp9_2tl graphs at 10101:10101
Re: Issue 564020 in chromium: WebGL 2 test
conformance2_renderbuffers_framebuffer_object_attachment fails after WebGL
roll on Mac/Linux
Re: Issue 475108 in chromium: Thumbnails of most visited tabs not appearing
Re: Issue 113111 in chromium: [Android] Add support for Chrome
Extensions/Apps
Re: Issue 464783 in chromium: Feature Request: Frequently Used Sites
Prefetching.
Re: Issue 111726 in chromium: tcmalloc should be sped up
Re: Issue 546288 in chromium: Integrate Crashpad into Chrome on Windows
Re: Issue 158718 in chromium: Incorrect synchronization implementation in
vp8 leads to TSan reports.
Re: Issue 526183 in chromium: No data received for
smoothness.gpu_rasterization.key_mobile_sites_smooth from android-nexus9
since 342599
Re: Issue 498136 in chromium: File "not commonly downloaded and could be
dangerous"; was working a few days ago
Issue 564052 in chromium: Create content setting for BackgroundSync
Re: Issue 563484 in chromium: 14.2%-23.9% regression in blink_perf.dom at
362048:362051
Re: Issue 481559 in chromium: Placeholder text for NTP does not meet
accessibility contrast guidelines
Re: Issue 243926 in chromium: In fullscreen mode, typing in Google search
Fakebox does nothing
Re: Issue 543537 in chromium: Images corrupted
Re: Issue 243926 in chromium: In fullscreen mode, typing in Google search
Fakebox does nothing
Re: Issue 564039 in chromium: swarm content_browsertests are failing after
all successes on Win7 Tests
Re: Issue 562155 in chromium: Decouple iOS from content::StoragePartition
Re: Issue 563451 in chromium: 5.2%-29.7% regression in
storage.indexeddb_endure at 361095:361496
Re: Issue 563452 in chromium: 5.2%-29.7% regression in
storage.indexeddb_endure at 361095:361496
Re: Issue 461775 in chromium: Regression: Unable to access other
apps/options available in hangout window if camera is block.
Re: Issue 563490 in chromium: 3.1%-4.3% regression in
power.throttled_plugins_pps_enabled at 361072:361093
Re: Issue 563490 in chromium: 3.1%-4.3% regression in
power.throttled_plugins_pps_enabled at 361072:361093
Re: Issue 563489 in chromium: 3.1%-4.3% regression in
power.throttled_plugins_pps_enabled at 361072:361093
Re: Issue 459943 in chromium: Regression: Info bar is displayed again even
after clicking on 'Cancel' button in 'Hangout'.
Re: Issue 561772 in chromium: update_scripts step occasionally failing on
Windows bots
Re: Issue 563927 in chromium: CrOS build broken
Re: Issue 356588 in chromium: linux_sandbox_unittests die under
ThreadSanitizer v2
Issue 564056 in chromium: IOSChromeBrowsingDataRemover::RemoveImpl
remove_url parameter is always an empty GURL
Re: Issue 563491 in chromium: 1.2%-1.8% regression in
rasterize_and_record_micro.top_25_smooth at 361423:361496
Re: Issue 563492 in chromium: 1.2%-1.8% regression in
rasterize_and_record_micro.top_25_smooth at 361423:361496
Re: Issue 564052 in chromium: Create content setting for BackgroundSync
Re: Issue 564056 in chromium: IOSChromeBrowsingDataRemover::RemoveImpl
remove_url parameter is always an empty GURL
Re: Issue 561772 in chromium: update_scripts step occasionally failing on
Windows bots
Re: Issue 563495 in chromium: 5.1%-18.5% regression in
thread_times.simple_mobile_sites at 361529:361598
Re: Issue 563494 in chromium: 5.1%-18.5% regression in
thread_times.simple_mobile_sites at 361529:361598
Issue 564057 in chromium: Add telemetry benchmarks tracking
blink.user_timing TBM
Re: Issue 560068 in chromium: User Policy to prevent installing 'Google
Apps Script' from Web Store is not enforced
Re: Issue 562951 in chromium: Image colour management broken P3 iMac
displays
Re: Issue 546243 in chromium: 2.9%-8.3% regression in
blink_perf.pywebsocket at 355137:355172
Re: Issue 563508 in chromium: 2.1%-5.7% regression in
page_cycler.basic_oopif at 361337:361419
Re: Issue 563509 in chromium: 2.1%-5.7% regression in
page_cycler.basic_oopif at 361337:361419
Re: Issue 56350 in chromium: Opening of background tab with htaccess
secured content is not possible
Re: Issue 563517 in chromium: 5.7% regression in page_cycler.morejs at
361631:361673
Re: Issue 563517 in chromium: 5.7% regression in page_cycler.morejs at
361631:361673
Re: Issue 563516 in chromium: 5.7% regression in page_cycler.morejs at
361631:361673
Re: Issue 296041 in chromium: Keep notification center accessible on
ChromeOS even when no notifications are active.
Re: Issue 563954 in chromium: 5.9% regression in
page_cycler_site_isolation.basic_oopif at 362225:362262
Re: Issue 563955 in chromium: 5.9% regression in
page_cycler_site_isolation.basic_oopif at 362225:362262
Re: Issue 525873 in chromium: Move Android testing to Swarming.
Issue 564059 in chromium: arm/linux build doesn't work in gn
Re: Issue 564059 in chromium: arm/linux build doesn't work in gn
Re: Issue 454503 in chromium: Reordering with touch should be consistent
across UI surfaces
Re: Issue 563571 in chromium: 2%-5.1% regression in
thread_times.tough_scrolling_cases at 362038:362044
Re: Issue 464760 in chromium: Chrome doesn't find local resource if URL
contains three dots "..."
Re: Issue 563572 in chromium: 2%-5.1% regression in
thread_times.tough_scrolling_cases at 362038:362044
Re: Issue 555036 in chromium: git-try fails to find the 'HOME' environment
variable on Windows
Re: Issue 563553 in chromium: 2.9% regression in
thread_times.tough_scrolling_cases at 361935:361942
Re: Issue 563552 in chromium: 2.9% regression in
thread_times.tough_scrolling_cases at 361935:361942
Re: Issue 563927 in chromium: CrOS build broken
Re: Issue 563588 in chromium: fast/filesystem/op-get-entry.html is failing
Re: Issue 561105 in chromium: Security review: Mac shared memory via mach
primitives
Re: Issue 537196 in chromium: changing csp headers is not working in
current chrome session
Re: Issue 326539 in chromium: OS X Notification Center should be used on Mac
Re: Issue 541766 in chromium: Rietveld-generated e-mail subject lines vary
for issues with non-ASCII in title, breaking Gmail and Groups threading
Re: Issue 564011 in chromium: Pressing the 'Ctrl' key while in scrolling
inertia will result in page getting zoomed in/out
Re: Issue 562951 in chromium: Image colour management broken P3 iMac
displays
Re: Issue 561435 in chromium: InlineTextBox should not rely on SimpleShaper
to calculate accessibility character offsets
Re: Issue 446811 in chromium: Regression: Trace is observed on 'Market
Online-Google Bussion Solution' .
Re: Issue 559354 in chromium: Provide "Show saved copy" button in offline
error page
Re: Issue 557197 in chromium: Enable HTTP/2 over NPN (with OpenSSL).
Re: Issue 545118 in chromium: Add experimental configuration options to
CronetEngine.Builder.
Re: Issue 557620 in chromium: Audio output fails to switch with system
(without restart)
Re: Issue 543324 in chromium: Lots of flickering browsing sites using
Chrome version 46.0.2490.71
Re: Issue 560649 in chromium: INPUT with @placeholder prevents to select
word by double-clicking after text
Re: Issue 545118 in chromium: Add experimental configuration options to
CronetEngine.Builder.
Re: Issue 562672 in chromium: Respond to STOP message with the specified
sequence number if the application is already stopping
Re: Issue 560467 in chromium: java.lang.NullPointerException in
org.chromium.chrome.browser.preferences.autofill.AutofillServerCardPreference
Re: Issue 498136 in chromium: File "not commonly downloaded and could be
dangerous"; was working a few days ago
Re: Issue 513671 in chromium: Implement Notification action buttons
Re: Issue 564023 in chromium: Failing Quic tests on the Android Cronet bots
Re: Issue 416818 in chromium: Regression: Chrome browser displays asterisk
(*) characters instead of actual saved password in desktop mode.
Re: Issue 563485 in chromium: Visited link state not updated when changing
href of svg:a
Re: Issue 416757 in chromium: Regression : "Saved Password" length showing
wrong after entering password more than 8 digits.
Re: Issue 557440 in chromium: Remove checkForChildrenAdjacentRuleChanges
Re: Issue 561216 in chromium: Do secure context check when creating a
SharedWorker
--
--
Automated mail from issue updates at http://crbug.com/
Subscription options: http://groups.google.com/a/chromium.org/group/chromium-bugs

---
You received this message because you are subscribed to the Google Groups "Chromium-bugs" group.
To unsubscribe from this group and stop receiving emails from it, send an email to chromium-bugs+***@chromium.org.
c***@googlecode.com
2015-12-02 18:37:09 UTC
Permalink
Your project notifications generated too many emails to send
individually. Here are the subject lines of the emails you would have
received:

Re: Issue 561013 in chromium: Scrollable content jumps to current anchor(in
hash) when slight style/css changes are triggered by mouseover on other
links
Re: Issue 562691 in chromium: Omnibox dropdown hover and highlight
background colours do not appear for material design
Re: Issue 359315 in chromium: Offer password saving on change password forms
Re: Issue 560589 in chromium: Migrate MemorySanitizer to the new ABI
Re: Issue 564332 in chromium: linux_perf_bisector continously failing in
Expand Revision range step.
Re: Issue 560816 in chromium: Eliminate dependency on
//chrome/browser/profiles on iOS
Re: Issue 564727 in chromium: loading issues with flash player
Re: Issue 564332 in chromium: linux_perf_bisector continously failing in
Expand Revision range step.
Re: Issue 564332 in chromium: linux_perf_bisector continously failing in
Expand Revision range step.
Re: Issue 564375 in chromium: rework how the default toolchain is set in GN
Re: Issue 564028 in chromium: Unaligned settings button placement in
notificaiton
Re: Issue 564332 in chromium: linux_perf_bisector continously failing in
Expand Revision range step.
Re: Issue 564172 in chromium: Android Nexus 6 Perf Bisect Bot fails in
device_status_check due to offline device
Re: Issue 563576 in chromium: 2% regression in
thread_times.key_mobile_sites_smooth at 361449:361468
Re: Issue 532666 in chromium: Chrome tests should pass when run with
--isolate-extensions
Re: Issue 564028 in chromium: Unaligned settings button placement in
notificaiton
Re: Issue 564028 in chromium: Unaligned settings button placement in
notificaiton
Re: Issue 560589 in chromium: Migrate MemorySanitizer to the new ABI
Issue 564738 in chromium: Default apps for Aura Android
Re: Issue 564727 in chromium: loading issues with flash player
Re: Issue 545904 in chromium: Video playback on Mesa shows green window
Re: Issue 554784 in chromium: Samus: Camera app stops showing preview
images after putting device into suspend
Re: Issue 563483 in chromium: Bisector failing with "TypeError: float()
argument must be a string or a number"
Re: Issue 564642 in chromium: 5.2%-7.2% regression in
page_cycler_site_isolation.basic_oopif at 361453:361519
Re: Issue 564332 in chromium: linux_perf_bisector continously failing in
Expand Revision range step.
Re: Issue 562189 in chromium: StrictMode policy violation in WebappActivity
Re: Issue 560853 in chromium: webrtc stop playing audio when SSRC of
incoming RTP stream has changed, in Chrome 48
Re: Issue 564675 in chromium: 24.5% regression in
smoothness.tough_animation_cases at 360144:360197
Re: Issue 564332 in chromium: linux_perf_bisector continously failing in
Expand Revision range step.
Re: Issue 456806 in chromium: `git rebase-update` leaves branches without
an upstream.
Re: Issue 564332 in chromium: linux_perf_bisector continously failing in
Expand Revision range step.
Re: Issue 564467 in chromium: Chrome keeps popping up "Failed to start"
after M47 update
Re: Issue 332735 in chromium: Chrome Canary is not downloadable from Iran
Re: Issue 564682 in chromium: 7.4% regression in
thread_times.tough_scrolling_cases at 361443:361485
Re: Issue 401438 in chromium: Add UMA logging for Push and Notifications API
Re: Issue 338178 in chromium: Importing bookmarks.html expands imported
folders in Bookmark Manager
Issue 564742 in chromium: Implement parental control for Aura Android
Re: Issue 564683 in chromium: 6.8% regression in
thread_times.tough_scrolling_cases at 361443:361485
Re: Issue 564332 in chromium: linux_perf_bisector continously failing in
Expand Revision range step.
Re: Issue 456806 in chromium: `git rebase-update` leaves branches without
an upstream.
Re: Issue 556168 in chromium: problem opening/downloading mp3 files
Re: Issue 514802 in chromium: Provision fails with "start: Job is already
running: autoreboot"
Re: Issue 551258 in chromium: PDF displays blank in Chrome
Re: Issue 564332 in chromium: linux_perf_bisector continously failing in
Expand Revision range step.
Re: Issue 563955 in chromium: 5.9% regression in
page_cycler_site_isolation.basic_oopif at 362225:362262
Re: Issue 562189 in chromium: StrictMode policy violation in WebappActivity
Issue 564744 in
chromium: "MigratedLegacyCacheDirectoryNameTest.LegacyCacheMigrated" is
flaky
Re: Issue 331258 in chromium: Camera photo download generates crappy
filenames
Issue 564745 in chromium: "Uncaught Exception" is flaky
Re: Issue 351369 in chromium: Clicking on "Stop sharing" button does not
trigger onended event handler in Chrome Extension
Issue 564746 in chromium: Reordering tabs can result in dragging the window
side to side also.
Re: Issue 495904 in chromium: simplechrome: chrome-sdk should use relative
paths for .cros_cache
Re: Issue 564301 in chromium: SIGSEGV when loading extension with extension
tabs open
Re: Issue 508083 in chromium: Image gets deleted on pressing ENTER key
without 'Yes' button being focused on Delete dialog of Camera App
Re: Issue 514719 in chromium: multiple video tags with same SRC downloads
media file multiple times
Re: Issue 556477 in chromium: Regression : Camera app does not restore to
its remembered last window state.
Re: Issue 564304 in chromium: "Patch failure" is flaky
Re: Issue 558781 in chromium: M48, M47: Build timeout 8 hours instead of
twelve.
Re: Issue 540945 in chromium: browser_tests fail on xp
Issue 564750 in chromium: DevTools: Add regex highlighting to Codemirror
Re: Issue 489494 in chromium: Camera app needs material spinner
Re: Issue 540024 in chromium: Speed-up feature on YouTube causing severe
performance impact on Chrome
Re: Issue 564180 in chromium: daisy-release-group canary fails paygen
autotest
Re: Issue 514802 in chromium: Provision fails with "start: Job is already
running: autoreboot"
Re: Issue 558998 in chromium: multiple sourceURL bug
Re: Issue 564467 in chromium: Chrome keeps popping up "Failed to start"
after M47 update
Re: Issue 564623 in
chromium: "BrowserActionButtonUiTest.AddExtensionWithMenuOpen" is flaky
Re: Issue 466644 in chromium: Cleanup: remove
CloudPrint.ServiceProcessSocketLength UMA histogram
Re: Issue 539745 in chromium: Unable to rename any new folder in
chrome://bookmarks after chrome sign in.
Re: Issue 564304 in chromium: "Patch failure" is flaky
Issue 564757 in chromium: telemetry --browser=list does not work
Issue 564756 in chromium: Print out more info from Should.beCloseToArray
Re: Issue 544255 in chromium: Chrome asks for authentication on http sites
on squid
Re: Issue 564467 in chromium: Chrome keeps popping up "Failed to start"
after M47 update
Re: Issue 564757 in chromium: telemetry --browser=list does not work
Re: Issue 564180 in chromium: daisy-release-group canary fails paygen
autotest
Re: Issue 564467 in chromium: Chrome keeps popping up "Failed to start"
after M47 update
Re: Issue 538667 in chromium: Flickr Not showing Geotagging correctly in
organizer
Re: Issue 514802 in chromium: Provision fails with "start: Job is already
running: autoreboot"
Re: Issue 543040 in chromium: Bookmark Manager: previously accessed folders
always stay uncollapsed across instances
Re: Issue 348877 in chromium: Support stale-while-revalidate (one of the
two HTTP Cache-Control Extensions for stale content)
Re: Issue 564517 in chromium: stale-while-revalidate experiment
Re: Issue 542390 in chromium: Refactor Chrome’s TracingController to follow
the tracing clock sync architecture
Re: Issue 538667 in chromium: Flickr Not showing Geotagging correctly in
organizer
Re: Issue 481692 in chromium: Enable the meta-build wrapper on all Chromium
bots
Re: Issue 564517 in chromium: stale-while-revalidate experiment
Re: Issue 560001 in chromium: Website Shortcut Icons High DPI
Re: Issue 417912 in chromium: platform_ToolchainOptions: gold test can no
longer detect when an ELF is linked w/gold
Re: Issue 533943 in chromium: night-mode extensions don't work anymore
since the latest chromium update
Re: Issue 563092 in chromium: Wrong default microphone (audio jack vs. USB
camera)
Re: Issue 563955 in chromium: 5.9% regression in
page_cycler_site_isolation.basic_oopif at 362225:362262
Re: Issue 555842 in chromium: 2.5% regression in
page_cycler.intl_es_fr_pt-BR at 359159:359188
Re: Issue 563293 in chromium: Flash Hang when watch the letv video
Re: Issue 560881 in chromium: 24.7% regression in
session_restore.warm.typical_25 at 359505:359520
Re: Issue 554305 in chromium: Delete ScopedPtrVector
Re: Issue 558173 in chromium: Improve specifying gcm_sender_id for an
extension's ServiceWorker
Issue 564761 in chromium: Fails to build chromium when disabling clang
Re: Issue 563292 in chromium: Media Source eviction breaks during buffering
Issue 564763 in chromium: "A sealed resource is missing or invalid" even
after removing an added file from Bundle/MacOS.
Re: Issue 564650 in chromium: Allow discovering underlying display
configuration in unified desktop mode
Re: Issue 564574 in chromium: The Hotwords constraint should be limited to
ChromeOS-only, or removed
Issue 564765 in chromium: Instrumentation test SystemWebViewShellLayoutTest
failing on Android Webview L (dbg)
--
--
Automated mail from issue updates at http://crbug.com/
Subscription options: http://groups.google.com/a/chromium.org/group/chromium-bugs

---
You received this message because you are subscribed to the Google Groups "Chromium-bugs" group.
To unsubscribe from this group and stop receiving emails from it, send an email to chromium-bugs+***@chromium.org.
c***@googlecode.com
2015-12-02 23:40:13 UTC
Permalink
Your project notifications generated too many emails to send
individually. Here are the subject lines of the emails you would have
received:

Re: Issue 509665 in chromium: [Android] Scroll is jittery in naver.com
Re: Issue 509665 in chromium: [Android] Scroll is jittery in naver.com
Issue 564912 in chromium: MacViews: support Full Keyboard Access
Re: Issue 525751 in chromium: Illegal instruction SIGILL on start up
Re: Issue 429705 in chromium: Text selection handles in a mixed rtl/ltr
text line may have incorrect directionality
Re: Issue 138542 in chromium: Migrate from base/basictypes.h standard types
to use stdint.h instead.
Re: Issue 417518 in chromium: Get tests working with --site-per-process
Re: Issue 448592 in chromium: Get extension browsertests to pass in
--site-per-process mode
Issue 564914 in chromium: MacViews: audit keyboard navigation
Re: Issue 564500 in chromium: Nearly impossible to select a phone number in
an RTL page on Android
Issue 564915 in chromium: MacViews: audit VoiceOver support
Re: Issue 371804 in chromium: WebRTC iceConnectionState transition from
completed to completed
Re: Issue 457078 in chromium: chrome.dll is larger with clang than with cl
Re: Issue 429705 in chromium: Text selection handles in a mixed rtl/ltr
text line may have incorrect directionality
Re: Issue 564892 in chromium: In product UI to warn about upcoming support
changes for OSX
Re: Issue 564500 in chromium: Nearly impossible to select a phone number in
an RTL page on Android
Re: Issue 429705 in chromium: Text selection handles in a mixed rtl/ltr
text line may have incorrect directionality
Re: Issue 564879 in chromium: MacViews: font sizes are wrong
Re: Issue 564869 in chromium: Android GN build fails if GYP is not run
Re: Issue 558161 in chromium: HasDataUseTracking should be called after
browser navigation
Re: Issue 564869 in chromium: Android GN build fails if GYP is not run
Re: Issue 564876 in chromium: Your profile cannot be used because it is
from a newer version of Google Chrome-At one point is this message
triggered?
Re: Issue 538784 in chromium: In --site-per-process, attacker can suppress
process transfer by an opportune deletion of the RFH
Issue 564920 in chromium: Make depot_tools a proper recipe package, pinned
by build
Issue 564921 in chromium: Task Manager "memory" columns look suspicious
Re: Issue 564353 in chromium: Metric name not found in some cases for
recipe bisect jobs.
Re: Issue 564426 in chromium: powerd/update_engine rebooted my Minnie
unnecessarily
Re: Issue 559654 in chromium: ARC: Remove enable_arc chrome build flag
Re: Issue 564353 in chromium: Metric name not found in some cases for
recipe bisect jobs.
Re: Issue 463228 in chromium: autoserv: provision option does not take a
value
Re: Issue 559263 in chromium: Broken Bluetooth stack on HP Chromebox due to
USB timeouts
Re: Issue 564682 in chromium: 7.4% regression in
thread_times.tough_scrolling_cases at 361443:361485
Re: Issue 564683 in chromium: 6.8% regression in
thread_times.tough_scrolling_cases at 361443:361485
Re: Issue 564223 in chromium: 5-7% regression in PartitionAlloc memory
usage in range 361472 - 361474
Re: Issue 558705 in chromium: GPU URL's not loading correctly on Paine
Device
Re: Issue 564592 in chromium: [iOS] Failing test don't turn the tree red
Re: Issue 564592 in chromium: [iOS] Failing test don't turn the tree red
Re: Issue 564716 in chromium: Add histogram for use of UTF-16 with
TextEncoder
Re: Issue 451733 in chromium: Titlebar not using Aero theme anymore on Vista
Re: Issue 552569 in chromium: memory.memory_health_plan should bisect
Re: Issue 541232 in chromium: GetUserMedia video capture: crashes when an
unsupported video resolution is requested through Camera2 API
Re: Issue 533630 in chromium: Support fullscreen underlay video with AVDA
using the compositor underlay system
Re: Issue 554412 in chromium: [Chrome] Characters display in the search
window at "http://m.naver.com" is delayed
Re: Issue 564243 in chromium: Scroll height not recomputed when clicking
links in code search
Re: Issue 457078 in chromium: chrome.dll is larger with clang than with cl
Re: Issue 564345 in chromium: wifi reports "turned off" UNTIL I plug in an
ethernet cable, then wifi comes up showing wifi network
Re: Issue 562406 in chromium:
WebRtcMediaRecorderTest.MediaRecorderStartWithTimeSlice flaky on TSAN bot
Re: Issue 564869 in chromium: Android GN build fails if GYP is not run
Issue 564926 in chromium: Handle more scale factors for extension Browser
Action icons
Re: Issue 564243 in chromium: Scroll height not recomputed when clicking
links in code search
Re: Issue 546267 in chromium: Extension browser actions with OOPIFs don't
seem to work
Re: Issue 563916 in chromium: Regression: On hitting downward arrow key,
focus does not move to 'Bookmarks bar' option for the first time in the
folder drop down box.
Re: Issue 479709 in chromium: Retrieve_latest_warnings.bat needs updates
Re: Issue 99124 in chromium: Printed table content does not respect
page-break CSS properties
Re: Issue 557502 in chromium: Consider supporting rotation on
VideoCaptureDeviceClient::OnIncomingCapturedYuvData
Re: Issue 564869 in chromium: Android GN build fails if GYP is not run
Re: Issue 563530 in chromium: 3.8%-6% regression in indexeddb_perf at
361307:361462
Re: Issue 561432 in chromium: 20.2% regression in
memory.long_running_idle_gmail at 361270:361419
Re: Issue 561691 in chromium: Text animations broken in google slides
Re: Issue 540060 in chromium: Daisy/Clapper fail to run interop nightly due
to Could not lock a device with labels ['packet_capture']
Re: Issue 545914 in chromium: Incorrectly seeks to wrong part of mp3
encoded audio
Re: Issue 564926 in chromium: Handle more scale factors for extension
Browser Action icons
Re: Issue 561772 in chromium: git steps on bots occasionally failing in golo
Re: Issue 563455 in chromium: 2.4%-4.4% regression in
page_cycler.intl_ar_fa_he at 361380:361556
Re: Issue 564223 in chromium: 5-7% regression in PartitionAlloc memory
usage in range 361472 - 361474
Re: Issue 561185 in chromium: Use DXGI_SWAP_EFFECT_FLIP_SEQUENTIAL on
opaque windows.
Re: Issue 561691 in chromium: Text animations broken in google slides
Re: Issue 549781 in chromium: Add exosphere component to Chromium
Re: Issue 560469 in chromium: Unable to share files from Files app and
Gallery
Issue 564928 in chromium: ClusterFuzz should send emails when done
repeating jobs/updating stack trace etc.
Re: Issue 564869 in chromium: Android GN build fails if GYP is not run
Re: Issue 562219 in chromium: Sound problem in Chrome
Re: Issue 564442 in chromium: Audio Player / Video Player: Add tooltips for
control buttons.
Re: Issue 457078 in chromium: chrome.dll is larger with clang than with cl
Re: Issue 564426 in chromium: powerd/update_engine rebooted my Minnie
unnecessarily
Issue 564929 in chromium: ClusterFuzz doesn't keep stack/log from old jobs
Re: Issue 562219 in chromium: Sound problem in Chrome
Re: Issue 468178 in chromium: Use recipes to run 'cbuildbot' for CrOS
builds.
Re: Issue 485716 in chromium: Problems accessing Google applications from
Chrome
Re: Issue 564926 in chromium: Handle more scale factors for extension
Browser Action icons
Re: Issue 564926 in chromium: Handle more scale factors for extension
Browser Action icons
Issue 564932 in chromium: Bots no longer needed: vm154-m3, vm319-m3
Re: Issue 547647 in chromium: Tracking bug to move manual tests related to
Style to Layout Tests
Issue 564933 in chromium: Blue line appears on virtual keyboard
Re: Issue 509665 in chromium: [Android] Scroll is jittery in naver.com
Issue 564934 in chromium: Change deployment_test repair version selection
Re: Issue 563738 in chromium: DevTools: [Color Picker] material colors
hover offset
Re: Issue 554291 in chromium: [c++11 library] Get rid of ScopedPtrMap
Re: Issue 563569 in chromium: 2.7% regression in dromaeo.domcoremodify at
361345:361422
Re: Issue 561678 in chromium: cronet synchronous api doesn't support put
method
Re: Issue 563530 in chromium: 3.8%-6% regression in indexeddb_perf at
361307:361462
Re: Issue 503270 in chromium: Web MIDI Does Not Work on 43.0.2357.130
Re: Issue 555729 in chromium: 2.9% regression in sunspider at 359064:359070
Re: Issue 563292 in chromium: Media Source eviction breaks during buffering
Re: Issue 517253 in chromium: Checkerboards
Re: Issue 524565 in chromium: Create clang bot for arm
Re: Issue 564467 in chromium: Chrome 47.0.2526.73 32-bit incompatibility
with Trusteer Rapport
Re: Issue 554291 in chromium: [c++11 library] Get rid of ScopedPtrMap
Re: Issue 564932 in chromium: Bots no longer needed: vm154-m3, vm319-m3
Re: Issue 559766 in chromium: GN Linux x64 build has more static
initializers
Re: Issue 564937 in chromium: 57.1% regression in
rasterize_and_record_micro.key_silk_cases at 362549:362563
Issue 564937 in chromium: 57.1% regression in
rasterize_and_record_micro.key_silk_cases at 362549:362563
--
--
Automated mail from issue updates at http://crbug.com/
Subscription options: http://groups.google.com/a/chromium.org/group/chromium-bugs

---
You received this message because you are subscribed to the Google Groups "Chromium-bugs" group.
To unsubscribe from this group and stop receiving emails from it, send an email to chromium-bugs+***@chromium.org.
c***@googlecode.com
2015-12-03 19:38:57 UTC
Permalink
Your project notifications generated too many emails to send
individually. Here are the subject lines of the emails you would have
received:

Re: Issue 548479 in chromium: After nacl crash, if a device is on kiosk
mode, it should restart again after a crash.
Re: Issue 546840 in chromium: Update Reset settings to Material Design
Re: Issue 565126 in chromium: Nodes are garbage collected at once instead
of in small chunks
Re: Issue 555254 in chromium: 9.9% regression in performance_browser_tests
at 358948:358992
Re: Issue 445643 in chromium: Massive rendering lag on all pages with
free-spinning scroll wheel
Re: Issue 555684 in chromium: shape-outside: ellipse() botches
farthest-side shaping
Issue 565493 in chromium: gn cross-compiles for CrOS for pnacl / clang
don't work
Re: Issue 414032 in chromium: timezone chilean dst problem with javascript
date
Re: Issue 98595 in chromium: tools/emacs fails licensecheck
Re: Issue 551250 in chromium: RenderWidgetHostViewMus
Re: Issue 548479 in chromium: After nacl crash, if a device is on kiosk
mode, it should restart again after a crash.
Re: Issue 565017 in chromium: Notify/warn when a local trust anchor causes
Pin Validation bypass
Re: Issue 84299 in chromium:
BrowserCrApplicationAppleScriptTest.BookmarkFolders is FLAKY
Issue 565494 in chromium: landmines mechanism should be able to mark bad
commits after-the-fact.
Re: Issue 565017 in chromium: Notify/warn when a local trust anchor causes
Pin Validation bypass
Re: Issue 563537 in chromium: 6.7% regression in
page_cycler.intl_es_fr_pt-BR at 361396:361462
Re: Issue 565448 in chromium: Chromebook Terra network interfaces are
inoperable (wired Ethernet and WiFi)
Re: Issue 565017 in chromium: Notify/warn when a local trust anchor causes
Pin Validation bypass
Re: Issue 561725 in chromium: nacl-sdk-multirel bots a failing
intermitently on bot_update
Re: Issue 561338 in chromium: Eliminate LegacyInterfaceTypeChecking
Re: Issue 565493 in chromium: gn cross-compiles for CrOS for pnacl / clang
don't work
Re: Issue 445643 in chromium: Massive rendering lag on all pages with
free-spinning scroll wheel
Re: Issue 561223 in chromium: [Regression]: Rendering issue is seen while
restoring the browser
Re: Issue 358197 in chromium: Wrong result for javascript function new
Date() for OS timezone GMT+0400 (Moscow) - on Chrome for Mac only
Re: Issue 145697 in chromium: Direct-leak in
SecurityFilterPeer::CreateSecurityFilterPeerForFrame
Re: Issue 468613 in chromium: Clip-path bug with pointer events dispatched
outside the clipped region on hover
Re: Issue 547583 in chromium: Forced Re-enrollment Not Consistent / Allows
for Engagement in Developer Mode
Re: Issue 564882 in chromium: Prerendering does not respect third-party
cookie blocking
Re: Issue 468613 in chromium: Clip-path bug with pointer events dispatched
outside the clipped region on hover
Re: Issue 488779 in chromium: Replace blink layout tree hit-testing with
hit testing against display lists
Issue 565499 in chromium: Move repo checkout to subdir under buildroot.
Re: Issue 565499 in chromium: Move repo checkout to subdir under buildroot.
Re: Issue 363170 in chromium: Date.toLocaleTimeString returns wrong hour in
Central Time (USA)
Re: Issue 565017 in chromium: Notify/warn when a local trust anchor causes
Pin Validation bypass
Re: Issue 178063 in chromium: pop-up from <rediff.com> does not showing any
content in it only blank white page, Mac OS
Re: Issue 560638 in chromium: Chromebook stuck "Resolving host" on any page
load (Shill reporting 'Portal' state)
Re: Issue 565494 in chromium: landmines mechanism should be able to mark
bad commits after-the-fact.
Re: Issue 561763 in chromium: Stack traces from Telemetry runs aren't
symbolized on Windows any more
Re: Issue 565440 in chromium: Chrome box powers off immediately when
pressing the on/off button
Re: Issue 564771 in
chromium: "editing/selection/move-by-word-visually-mac.html" is flaky
Re: Issue 468613 in chromium: Clip-path bug with pointer events dispatched
outside the clipped region on hover
Re: Issue 564771 in
chromium: "editing/selection/move-by-word-visually-mac.html" is flaky
Re: Issue 564585 in chromium: Deactivate breakpoints with shortcut
Re: Issue 558710 in chromium: In content editables, IA2_EVENT_CARET_MOVED
events should fire on the object on which the caret has moved in addition
to the content editable root
Re: Issue 509135 in chromium: HTML5 Autoplay should be disabled for Session
Restore
Re: Issue 547948 in chromium: Stop dropping frames in
media/capture/WebmMuxer
Re: Issue 565448 in chromium: Chromebook Terra network interfaces are
inoperable (wired Ethernet and WiFi)
Re: Issue 547583 in chromium: Forced Re-enrollment Not Consistent / Allows
for Engagement in Developer Mode
Re: Issue 565017 in chromium: Notify/warn when a local trust anchor causes
Pin Validation bypass
Re: Issue 565017 in chromium: Notify/warn when a local trust anchor causes
Pin Validation bypass
Re: Issue 539964 in chromium: Inconsistent handling of hash changes when
displaying a hidden element
Re: Issue 565493 in chromium: gn cross-compiles for CrOS for pnacl / clang
don't work
Re: Issue 565081 in chromium: Can't Click in Address Bar
Re: Issue 564585 in chromium: Deactivate breakpoints with shortcut
Re: Issue 565377 in chromium: Provide descriptive reason to console or
DevTools when GPU process crashes
Re: Issue 563952 in chromium: DevTools' computed CSS view doesn't honour
user preference for Color format
Re: Issue 468613 in chromium: Clip-path bug with pointer events dispatched
outside the clipped region on hover
Re: Issue 565448 in chromium: Chromebook Terra network interfaces are
inoperable (wired Ethernet and WiFi)
Re: Issue 564585 in chromium: Deactivate breakpoints with shortcut
Re: Issue 549274 in chromium: HostDiscardableSharedMemoryManager crashes
when calling ThreadTaskRunnerHandle::Get() from worker thread
Re: Issue 565349 in chromium: Dev server fails to start "No valid URLs
found!"
Re: Issue 558089 in chromium: Chrome crashes when going from full screen to
a window on Lynda.com videos
Re: Issue 460999 in chromium: Regression: Accented character dialog inserts
duplicate key
Re: Issue 561763 in chromium: Stack traces from Telemetry runs aren't
symbolized on Windows any more
Re: Issue 560943 in chromium: 7.2% regression in startup.cold.blank_page at
360977:361010
Re: Issue 560705 in chromium: Regression: 'View certificate' pop up window
is not visible after existing fullscreen mode.
Re: Issue 556355 in chromium: Regression: Print overlay dismisses on
exiting fullscreen mode.
Re: Issue 460999 in chromium: Regression: Accented character dialog inserts
duplicate key
Re: Issue 74617 in chromium: Feature request: infinite loop breaking in
debugger
Re: Issue 456525 in chromium: inspector/sources/debugger flakily hangs the
Linux MSAN bot
Re: Issue 471093 in chromium:
inspector/sources/debugger/frameworks-dom-xhr-event-breakpoints.html is
flakily timing out on Win debug bots
Re: Issue 539746 in chromium: Support bookmark imports from Edge on Windows
10
Re: Issue 472904 in chromium:
virtual/deferred/inspector/tracing/worker-events.html crashes flakily
Re: Issue 474556 in chromium: 1-2 rows of garbage pixels at bottom end of
screen
Re: Issue 503456 in chromium:
inspector-protocol/debugger/debugger-terminate-dedicated-worker-while-paused.html
flaky crashes on Linux (dbg)
Re: Issue 431008 in chromium: DevTools: [timeline,network] should surface
and highlight User Timing marks
Re: Issue 564746 in chromium: Reordering tabs can result in dragging the
window side to side also.
Re: Issue 565494 in chromium: landmines mechanism should be able to mark
bad commits after-the-fact.
Re: Issue 365243 in chromium: Profiles - Heap Allocation - no details for
live objects
Re: Issue 460999 in chromium: Regression: Accented character dialog inserts
duplicate key
Re: Issue 564467 in chromium: Chrome 47.0.2526.73 32-bit incompatibility
with Trusteer Rapport
Re: Issue 332015 in chromium: Recorded profiles of previous page are still
shown on current webpage.
Re: Issue 563386 in chromium: DevTools leaking memory, crashing
Re: Issue 565493 in chromium: gn cross-compiles for CrOS for pnacl / clang
don't work
Re: Issue 533682 in chromium: Sync database tests use an unreliable means
of injecting corruption.
Re: Issue 509665 in chromium: [Android] Scroll is jittery in naver.com
Re: Issue 558201 in chromium: Alert popup + tab drag = stuck overlay
Re: Issue 393653 in chromium: Presentations in Google Slides sometimes only
load partially (menus grayed out)
Re: Issue 565440 in chromium: Chrome box powers off immediately when
pressing the on/off button
Re: Issue 146133 in chromium: Got my Chrome theme reset after syncing a new
PC
Re: Issue 393472 in chromium: hover area is calcuated wrongly when
overflow: hidden + border-radius
Re: Issue 314568 in chromium: [Feature request] Profile report should
include total time and number of function calls
Re: Issue 391433 in chromium: Open two tabs in a window in Google Chrome
browser? it is opening one tab and one new window...
Re: Issue 143249 in chromium: Remove empty-guid cleanup code for search
engines sync
Re: Issue 314568 in chromium: [Feature request] Profile report should
include total time and number of function calls
Re: Issue 558575 in chromium: Layout can cause content to scroll around
while the user is reading it.
Re: Issue 142872 in chromium: Default Search Provider goes out of sync when
switched while signed out
Re: Issue 141678 in chromium: Some sync clients wrongly report
notifications disabled
Re: Issue 564995 in chromium: CL Submission Failure
Re: Issue 558103 in chromium: Hitting "Stop Share" on Host triggers
reconnect attempt
Re: Issue 139839 in chromium: Refactor SyncManager initialization
Re: Issue 447153 in chromium: Mouse/Pen pointer stopps working & disappears
--
--
Automated mail from issue updates at http://crbug.com/
Subscription options: http://groups.google.com/a/chromium.org/group/chromium-bugs

---
You received this message because you are subscribed to the Google Groups "Chromium-bugs" group.
To unsubscribe from this group and stop receiving emails from it, send an email to chromium-bugs+***@chromium.org.
c***@googlecode.com
2015-12-04 23:47:40 UTC
Permalink
Your project notifications generated too many emails to send
individually. Here are the subject lines of the emails you would have
received:

Re: Issue 550675 in chromium: Incorrect window z-order when unhide Chrome
(Mac)
Re: Issue 443432 in chromium: VIM Color Scheme Test is loading slow and
hogging memory
Issue 566217 in chromium: backspace causes renderer hangs (CPU usage
becomes 100%)
Issue 566218 in chromium: [Tricky] 2nd monitor's display not come up after
suspend>unplug>resume > plug both monitors
Issue 566219 in chromium: non working my chrome
Re: Issue 349230 in chromium: 5% regression in
gpu-linux-release-nvidia/tab_capture_performance_tests/TabCapturePerformance/TestFrameTickGPU
at 254827:254838
Re: Issue 564514 in chromium: Chrome custom tabs & deep linking
Re: Issue 512823 in chromium: Chrome: Crash Report - [Assert]
extensions::ExecuteCodeInTabFunction::CanExecuteScriptOnPage
Issue 566220 in chromium: "Ctrl+Shift+Space" isn't updated yet on IME info
message - chrome://settings/languages
Re: Issue 565819 in chromium: FlashPlayer can't show context menu on right
click
Re: Issue 566012 in chromium: History Page: Use "dominant color + first
letter of URL" fallback if there is no large enough favicon
Re: Issue 420370 in chromium: Enable download scanning on mobile
Re: Issue 565663 in chromium: MutationObserver Registers OldValue But
Returns Later Node Value
Re: Issue 566019 in chromium: Find way of making Windows use
MenuKeyEventHandler and simplify MenuMessagePumpDispatcher
Re: Issue 565970 in chromium: dialog focusing steps should be performed on
show()
Re: Issue 566025 in chromium: Standardize parameters takes by android GN
templates
Re: Issue 412476 in chromium: chrome is not blocking .iql file
Issue 566222 in chromium: Accessibility notification doesn't belong in
WebRemoteFrameImpl::setReplicatedOrigin
16 issues changed in chromium
Re: Issue 444130 in chromium: Extension message may be lost if the calling
script closes the window immediately after calling sendMessage()
Re: Issue 320200 in chromium: content::RenderViewImpl::media_stream_client_
leak
Issue 566224 in chromium: Restart all masters to pick up buildbucket change.
Re: Issue 566222 in chromium: Accessibility notification doesn't belong in
WebRemoteFrameImpl::setReplicatedOrigin
Re: Issue 564198 in chromium: consider automatically upgrading from 32-bit
to 64-bit on Linux where possible.
Re: Issue 566126 in chromium: More useable filmstrip view in devtools
Re: Issue 566219 in chromium: non working my chrome
Re: Issue 469457 in chromium: MediaSource api not able to play chunks from
gstreamer
Re: Issue 561772 in chromium: git steps on bots occasionally failing in golo
Re: Issue 565624 in chromium: new builds seem to not be getting triggered
Re: Issue 566224 in chromium: Restart all masters to pick up buildbucket
change.
Issue 566226 in chromium: Support overflow: clip
Re: Issue 424174 in chromium: Web Audio decodeAudioData() very slow on
Android
Re: Issue 246103 in chromium: Video texture with Media Source gets in weird
state between initialization and preroll
Issue 566227 in chromium: adb_host: run timeout logic needs to be smarter
Re: Issue 350989 in chromium: Chrome window not completely rendered
Re: Issue 565624 in chromium: new builds seem to not be getting triggered
Re: Issue 566126 in chromium: More useable filmstrip view in devtools
Re: Issue 352274 in chromium: Need to better support special use cases with
Mailbox Synchronizer
Re: Issue 444130 in chromium: Extension message may be lost if the calling
script closes the window immediately after calling sendMessage()
Re: Issue 95685 in chromium: System hangs when tried to move back and forth
from regular and GPU process enabled tabs
Re: Issue 511670 in chromium: Extension tabs should not close when the
extension reloads
Re: Issue 171009 in chromium: Fix 64-bit MSVC warnings in ffmpeg, media,
and media_unittests
Re: Issue 564920 in chromium: Make depot_tools a proper recipe package,
pinned by build
Re: Issue 510327 in chromium: Distinguish OOM from other renderer crashes
Re: Issue 95703 in chromium: WebGL not compatible with compositor resource
Sharing
Re: Issue 561772 in chromium: git steps on bots occasionally failing in golo
Re: Issue 156422 in chromium: Unify the use of YUV<->RGB conversion and
scaling routines
Re: Issue 511158 in chromium: chrome.webRequest.onAuthRequired listener
works inconsistently
Re: Issue 95890 in chromium: Chrome: Crash Report - Stack Signature:
fastzero_I-b41284f6_1c2922e8_6d39d64d_03f80114_ff1d58a5
Re: Issue 558201 in chromium: Alert popup + tab drag = stuck overlay
Re: Issue 561772 in chromium: git steps on bots occasionally failing in golo
Re: Issue 101950 in chromium: RWH waits on updateRectAckPending in threaded
mode preventing redraw/reszies
Re: Issue 565624 in chromium: new builds seem to not be getting triggered
Re: Issue 561772 in chromium: git steps on bots occasionally failing in golo
4 issues changed in chromium
Re: Issue 565624 in chromium: new builds seem to not be getting triggered
Re: Issue 353879 in chromium: Handle lots of texture units
Re: Issue 104498 in chromium: Page using Gpu not running smooth
Re: Issue 508194 in chromium: chrome.mdns API has no way to report errors
Re: Issue 508246 in chromium: Spikes are common in
performance_browser_tests/CastV2Performance_gpu_novsync_24fps/video_jitter
21 issues changed in chromium
Re: Issue 109181 in chromium: Bad page rendering when launch app with GPU
content in full screen
4 issues changed in chromium
Re: Issue 510327 in chromium: Distinguish OOM from other renderer crashes
Issue 566233 in chromium: Scrollable area jumps back up, making it
impossible to reach the bottom item
Re: Issue 353937 in chromium: WebGL in iframes does not print
Re: Issue 504227 in chromium: Create method in chrome.windows extension API
tiggers 'continue where you left off' functionality
Re: Issue 352274 in chromium: Need to better support special use cases with
Mailbox Synchronizer
Re: Issue 446511 in chromium: options_ui.chrome_style documentation and
<select>
Issue 566235 in chromium: Add autotest to ensure that
chromeos-base/chromeos-ca-certificates is not out of sync
Re: Issue 501392 in chromium: Custom protocol handler not launching
external applications on Windows 2012
Re: Issue 446511 in chromium: options_ui.chrome_style documentation and
<select>
2 issues changed in chromium
Re: Issue 434861 in chromium: Support non-compositing mode in
WebMediaPlayerImpl
Re: Issue 460376 in chromium: Determine whether to advertise support AVC
level 5.2
Re: Issue 564266 in chromium: get gfx_unittests passing on 10.11
Re: Issue 566199 in chromium: Glimmer Chromebook has problems with auto
reconnect
Re: Issue 498601 in chromium: tabs.onUpdated doesn't include url
6 issues changed in chromium
Re: Issue 110615 in chromium: Chrome: Crash Report - Stack
Signature: WTF::HashTable<WebCore::Document *,std::pai...
Re: Issue 25431 in chromium: Implement support for MP4 reference movies
Re: Issue 354833 in chromium: Remove gpu::Capabilities::map_image
Issue 566236 in chromium: Profile Switcher Button won't go away
5 issues changed in chromium
Re: Issue 449314 in chromium: Chrome releases need to be on a release
calendar
Re: Issue 558656 in chromium: First letter missing at many places on alex,
zgb devices
Re: Issue 470266 in chromium: Remove VIDEO_HOLE code after all platforms
migrate to Ozone hardware overlay/underlay mechanism
Re: Issue 246060 in chromium: PowerSaveBlockerX11 does not work for some
Linux users.
Re: Issue 354833 in chromium: Remove gpu::Capabilities::map_image
Re: Issue 457857 in chromium: Windows hardware video decode crash with
DisplayLink devices.
Re: Issue 354833 in chromium: Remove gpu::Capabilities::map_image
Re: Issue 564385 in chromium: Please ignore - Testing
Re: Issue 117949 in chromium: 14K^2 canvas will eventually work,regularly
crash, slow initial perf
Re: Issue 497643 in chromium: SystemIndicatorApiTest.SystemIndicator flaky
after blink revision 196497
Re: Issue 564385 in chromium: Please ignore - Testing
Re: Issue 345432 in chromium: Leak inside content::GpuChannelHost::Connect
Re: Issue 470261 in chromium: Android: Replace use of VIDEO_HOLE with
hardware overlay/underlay mechanism
9 issues changed in chromium
Re: Issue 537382 in chromium: toLocaleDateString() gives wrong day
Re: Issue 299859 in chromium: Clean up Android demuxer abstractions and
ownership
Re: Issue 355720 in chromium: WebGL dies if TTY is inactive
6 issues changed in chromium
--
--
Automated mail from issue updates at http://crbug.com/
Subscription options: http://groups.google.com/a/chromium.org/group/chromium-bugs

---
You received this message because you are subscribed to the Google Groups "Chromium-bugs" group.
To unsubscribe from this group and stop receiving emails from it, send an email to chromium-bugs+***@chromium.org.
c***@googlecode.com
2015-12-07 20:01:35 UTC
Permalink
Your project notifications generated too many emails to send
individually. Here are the subject lines of the emails you would have
received:

Re: Issue 544255 in chromium: Chrome repeatedly prompts for NTLM
authentication credentials
Re: Issue 539496 in chromium: nine patch image has artifacts with dsf=1.25
Re: Issue 567296 in chromium: Enable composited overflow scrolling with
border-radius
Re: Issue 567293 in chromium: Use tiles for mask layers
Re: Issue 567219 in chromium: penis
Re: Issue 541705 in chromium: Rendering Process uses ~160mb due to
SourceBufferStream::GarbageCollectIfNeeded running when mem usage greater
than kSourceBufferVideoMemoryLimit=157mb
Re: Issue 567296 in chromium: Enable composited overflow scrolling with
border-radius
Re: Issue 567293 in chromium: Use tiles for mask layers
Re: Issue 566263 in chromium: DHE-RSA-CHACHA20-POLY1305 cipher not supported
Re: Issue 556771 in chromium: Support Emoji Joiner Sequences
Re: Issue 539496 in chromium: nine patch image has artifacts with dsf=1.25
Re: Issue 545216 in chromium: AU disables SSH on Dev channel with debug
features enabled
Re: Issue 437567 in chromium: "Copy email address" does not decode mailto:
hyperlinks which are urlencoded
Re: Issue 558726 in chromium: git cl upload hangs forever
Re: Issue 539496 in chromium: nine patch image has artifacts with dsf=1.25
Re: Issue 561378 in chromium: health plan memory-regression (m47 -> m48):
3% renderer (partition alloc)
Re: Issue 561387 in chromium: health plan memory-regression (m47 -> m48):
3.7% renderer
Re: Issue 561375 in chromium: health plan memory-regression (m47 -> m48):
5% browser
Re: Issue 544255 in chromium: Chrome repeatedly prompts for NTLM
authentication credentials
Re: Issue 442659 in chromium: Zoom and position loss when pdf document
reloaded
Re: Issue 560852 in chromium: Bookmarks bar selection graphical glitch
Re: Issue 565071 in chromium: All perf test fail
Re: Issue 544255 in chromium: Chrome repeatedly prompts for NTLM
authentication credentials
Re: Issue 456186 in chromium: Enrolled devices should send stats to Google
by default to be consistent with server-side behavior
Re: Issue 547356 in chromium: Web pages render incorrectly (randomly
irregular black blocks and misplacement)
Re: Issue 544255 in chromium: Chrome repeatedly prompts for NTLM
authentication credentials
Re: Issue 565528 in chromium: Offline Dino flash before PWA startup
Re: Issue 492892 in chromium: Autocomplete menu is placed on wrong place
for RTL on Android
Re: Issue 539496 in chromium: nine patch image has artifacts with dsf=1.25
Re: Issue 535481 in chromium: Recipe engine should handle catch exceptions
resulting from the finally sections in recipe code
Re: Issue 544255 in chromium: Chrome repeatedly prompts for NTLM
authentication credentials
Re: Issue 567294 in chromium: Search-L doesn't lock screen when SSH has
focus
Re: Issue 549412 in chromium: FATAL:child_process_task_provider.cc(148)]
Check failed : false.
Re: Issue 390377 in chromium: Test JS files of Blink-in-JS are not enabled
in Release builds
Re: Issue 556771 in chromium: Support Emoji Joiner Sequences
Re: Issue 421716 in chromium: Caret is aligned incorrectly when clicking
empty table cells in a contenteditable region
Re: Issue 46938 in chromium: VectorCanvasTest.Matrix fails and crashes
Re: Issue 567212 in chromium:
MediaGalleriesPlatformAppBrowserTest.PicasaDefaultLocation keeps timing out
on Win7 bots
Re: Issue 544255 in chromium: Chrome repeatedly prompts for NTLM
authentication credentials
Re: Issue 559281 in chromium: Display work area space is misreported on
high DPI Windows displays
Re: Issue 559412 in chromium: "mojo_apptests (with patch)" is flaky
Re: Issue 413056 in chromium: Google Docs hyperlink pop-ups "twitch" under
Chrome Canary with high-DPI
Re: Issue 564452 in chromium: Regression : Settings overlay shifts upwards
and seen out of the devtools window after adding new device.
Issue 567298 in chromium: Make a variant of isSecureContext() that doesn't
take an error message argument
Re: Issue 565213 in chromium: Regression: 'Device' icon is not clickable on
re-sizing the devtools window.
Re: Issue 564815 in chromium: window.history.pushState acts like
replaceState when called immediately after page load
Re: Issue 562468 in chromium: Security: A new attack type on the TLS/SSL
protocol (that gives you the opportunity to bypass SOP)
Re: Issue 474439 in chromium: Fetch API: Throw TypeError in Request() if
url contains username/password
Re: Issue 561387 in chromium: health plan memory-regression (m47 -> m48):
3.7% renderer
Re: Issue 364586 in chromium: sorting a column in task manager defaults to
descending
Re: Issue 550915 in chromium: Regression : "Browse People" Image is seen
blur in google plus page
Re: Issue 564729 in chromium: In product UI to warn about upcoming support
changes for Linux
Re: Issue 567212 in chromium:
MediaGalleriesPlatformAppBrowserTest.PicasaDefaultLocation keeps timing out
on Win7 bots
Re: Issue 47704 in chromium: sync: tombstone processing not idempotent
Re: Issue 158922 in chromium: Libvpx shares the compressor context between
threads in a possibly dangerous manner
Re: Issue 562468 in chromium: Security: A new attack type on the TLS/SSL
protocol (that gives you the opportunity to bypass SOP)
Re: Issue 118149 in chromium: Page loads then immediately disappears --
ERROR:gles2_cmd_decoder.cc(4725) in Console
Re: Issue 560466 in chromium: Trim down ChromeApplication
Re: Issue 559281 in chromium: Display work area space is misreported on
high DPI Windows displays
Re: Issue 482445 in chromium: Make sure code for browser process only runs
on browser process
Re: Issue 446581 in chromium: Presubmit errors were not understandable/clear
Re: Issue 511954 in chromium: Memory regression that wasn't entirely fixed
Re: Issue 545914 in chromium: Incorrectly seeks to wrong part of mp3
encoded audio
Issue 567300 in chromium: Chromevox: The CV bar at the top of the screen
doesn't display the text chromevox reads in locked screen.
Re: Issue 550915 in chromium: Regression : "Browse People" Image is seen
blur in google plus page
Re: Issue 3119 in chromium: Popups may not appear in Task Manager
Re: Issue 563285 in chromium: Chrome crashes when opening PDF
Re: Issue 544255 in chromium: Chrome repeatedly prompts for NTLM
authentication credentials
Re: Issue 527923 in chromium: Change Bookmark Folder icon back to YELLOW
Re: Issue 395966 in
chromium: 'x-devtools-emulate-network-conditions-client-id' should not be
sent to the network.
Re: Issue 564886 in chromium: Request for OSX 10.11 bot for main waterfall.
Re: Issue 566166 in chromium: Doubletapping links missing confirmation
sound when using TalkBack
Re: Issue 544255 in chromium: Chrome repeatedly prompts for NTLM
authentication credentials
Re: Issue 567212 in chromium:
MediaGalleriesPlatformAppBrowserTest.PicasaDefaultLocation keeps timing out
on Win7 bots
Re: Issue 378135 in chromium: Consider adding a SiblingInvalidator to
complement the descendant invalidation set system
Re: Issue 556531 in chromium: 2% regression in PartitionAlloc in range
356108 - 356131 in all platforms.
Re: Issue 562468 in chromium: Security: A new attack type on the TLS/SSL
protocol (that gives you the opportunity to bypass SOP)
Re: Issue 560479 in chromium: Request for Mac 10.11 bot on main waterfall.
Re: Issue 566263 in chromium: DHE-RSA-CHACHA20-POLY1305 cipher not supported
Re: Issue 545914 in chromium: Incorrectly seeks to wrong part of mp3
encoded audio
Re: Issue 566932 in chromium: closing windows crashes the window manager
Re: Issue 563318 in chromium: Unable to capture WebRTC debug logs if chrome
beta/GA and canary are installed in same machine
Re: Issue 502050 in chromium: Keyboard shortcuts need a couple tweaks for
new UI
Issue 567301 in chromium: Fix lint violations in src/sync/* code
Re: Issue 567301 in chromium: Fix lint violations in src/sync/* code
Issue 567302 in chromium: Android MediaInfoLoader doesn't follow redirects
Re: Issue 89588 in chromium: Skia/Flash use after free
Re: Issue 541766 in chromium: Rietveld-generated e-mail subject lines vary
for issues with non-ASCII in title, breaking Gmail and Groups threading
Re: Issue 463228 in chromium: autoserv: provision option does not take a
value
Re: Issue 463228 in chromium: autoserv: provision option does not take a
value
Re: Issue 544255 in chromium: Chrome repeatedly prompts for NTLM
authentication credentials
Re: Issue 542543 in chromium: Occasional leak in
IOThread::ConstructProxyScriptFetcherContext()
Re: Issue 567206 in chromium: 32-bit Linux. Chromium no longer compiles
Re: Issue 553635 in chromium: --kiosk option not available
Re: Issue 564876 in chromium: Provide a way to initiate on-demand updates
from the command line.
Re: Issue 174556 in chromium: Text styles such as italic or bold for
Japanese text are dropped in print result on Windows
Re: Issue 564040 in chromium: nacl-arm_perf_panda trybot doesn't work
Re: Issue 65244 in chromium: Scroll position of PDF page is not remembered
Re: Issue 442659 in chromium: Zoom and position loss when pdf document
reloaded
Re: Issue 565573 in chromium: "git cl patch" fails with "fatal: git diff
header lacks filename information when removing 0 leading pathname
components (line 274)"
Re: Issue 65244 in chromium: Scroll position of PDF page is not remembered
Re: Issue 419350 in chromium: Text on the 'VIEW TENDERS' and 'SUBMIT'
buttons overlap the arrow icon in www.indianrailways.gov.in.
--
--
Automated mail from issue updates at http://crbug.com/
Subscription options: http://groups.google.com/a/chromium.org/group/chromium-bugs

---
You received this message because you are subscribed to the Google Groups "Chromium-bugs" group.
To unsubscribe from this group and stop receiving emails from it, send an email to chromium-bugs+***@chromium.org.
c***@googlecode.com
2015-12-07 20:56:41 UTC
Permalink
Your project notifications generated too many emails to send
individually. Here are the subject lines of the emails you would have
received:

Re: Issue 119778 in chromium: WebKit shadow fast path turns into a slow
path in Chromium
Re: Issue 545216 in chromium: AU disables SSH on Dev channel with debug
features enabled
Re: Issue 566289 in chromium: DevTools: change timeline details layout so
that information fit there.
Re: Issue 78162 in chromium: PDF takes forever to load
Re: Issue 449846 in chromium: Page_action couldn't appear on pop-up windows?
Re: Issue 478417 in chromium: DevTools: unify promise rejection error
reporting in main thread and in worker.
Re: Issue 103475 in chromium: Layout of flash video moved from middle to
left side of browser
Re: Issue 546104 in chromium: Automate creation of heat maps and add
functionality to crosperf
Re: Issue 97512 in chromium: Browse For File Issue With Folder Redirection
and Roaming Profiles
Issue 567316 in chromium: Ctrl+shift+minus/plus not working on Chromebox
Re: Issue 556771 in chromium: Support Emoji Joiner Sequences
Re: Issue 265477 in chromium: script tag in document.write into an iframe
triggers twice
Re: Issue 553656 in chromium: Cannot edit Offline Host with long name
Re: Issue 119778 in chromium: WebKit shadow fast path turns into a slow
path in Chromium
Re: Issue 560860 in chromium: Incognito tabs not maintaining breakpoints
Re: Issue 142538 in chromium: Web accessible resources loaded from sandbox
scripts are run under the wrong context
Re: Issue 97314 in chromium: PDF links should support keyboard combinations
Re: Issue 372523 in chromium: Escape doesn't cancel extension install
prompt on Mac
Re: Issue 94189 in chromium: Error log, and potential crash, when deleting
Pepper plugin instance from within a Javascript callback
Re: Issue 560860 in chromium: Incognito tabs not maintaining breakpoints
Re: Issue 108494 in chromium: Flash video shows up incorrectly on Lenovo
site
Re: Issue 422976 in chromium: Chrome Actions
Re: Issue 560860 in chromium: Incognito tabs not maintaining breakpoints
Re: Issue 277210 in chromium: navigateToURL in flash failing in some
instances
Re: Issue 284461 in chromium: Flex application calling a php script to
provide a downloadable file to user stops working after Chrome 29
Re: Issue 366131 in chromium: Error console "show more" is at the bottom
but actually conceptually expands upwards
Re: Issue 97314 in chromium: PDF links should support keyboard combinations
Re: Issue 566497 in chromium: Debugger doesn't step into custom
Array.prototype.sort() function
Re: Issue 371120 in chromium: Right Click -> Inspect Element will take you
to invisible elements if they overlay the screen
Re: Issue 567276 in chromium: multiple rules generate
gen/base/debug/debugging_flags.h
Issue 567317 in chromium: Print styling of table is offset
Re: Issue 320656 in chromium: Docserver: sample tags are missing
Re: Issue 567313 in chromium: depot_tools_presubmit build passed but
rietveld can't see it
Re: Issue 348769 in chromium: Bad redirect from code.google.com to
developers.chrome.com
Re: Issue 565581 in chromium: Touch events are disabled in ChromeOS when
developer mode is enabled
Re: Issue 96688 in chromium: Chrome ignores PDF zoom settings for local
files
Re: Issue 339936 in chromium: Docserver: nacl docs are not pulled in from
cronjob
Re: Issue 318878 in chromium: Docserver: github not updating properly
Re: Issue 361458 in chromium: Security: Web directory traversal bug in
docs/server2/preview.py
Re: Issue 109895 in chromium: Page rendering depends on order of script and
css tags
Re: Issue 305280 in chromium: Docserver: cron jobs take too long to run
Re: Issue 92183 in chromium: Make the Chrome IPC Pepper proxy use a global
module ID
Re: Issue 305280 in chromium: Docserver: cron jobs take too long to run
Re: Issue 79975 in chromium: PDF search can be unresponsive
Re: Issue 79975 in chromium: PDF search can be unresponsive
Re: Issue 548541 in chromium: Background contents appears on tap/touch
of 'English-handwrite input tool.
Re: Issue 69871 in chromium: Integrated PDF-Reader incorrectly displays
Embedded PostScript graphics
Re: Issue 441892 in chromium: cidb_admin: Check that user is on the
cros/master branch.
Re: Issue 362620 in chromium: Error Console should have a way to clear the
logs
Re: Issue 93962 in chromium: Unable to run multiple test ( Audio/Game) in
different tabs.
Re: Issue 229582 in chromium: [Skia] ImageBuffer::copyImage(...) is broken
for scaled ImageBuffers
Re: Issue 297820 in chromium: Docserver: support devtools, mobile,
webstore, nacl docs
Issue 567318 in chromium: Translate bubble should show a more verbose
message
Re: Issue 95711 in chromium: The page reloads continuously with crash flash
plugin.
Re: Issue 297178 in chromium: Docserver: link_converter.py doesn't resolve
links in other directories properly
Re: Issue 93667 in chromium: Lion: PDF rubber band scrolling should behave
same as web content rubber band scrolling
Re: Issue 136125 in chromium: Move ExtensionContextMenu into extensions
namespace
Re: Issue 139390 in chromium: Move ExtensionProcessManager into extensions
namespace
Re: Issue 90135 in chromium: Print preview: no "Current page" option, nor
any way to inspect page numbers = print fail
Re: Issue 567300 in chromium: Chromevox: The CV bar at the top of the
screen doesn't display the text chromevox reads in locked screen.
Re: Issue 564223 in chromium: 5-7% regression in PartitionAlloc memory
usage in range 361472 - 361474
Re: Issue 60871 in chromium: Zoom of flash video creates artifacts
Re: Issue 468613 in chromium: Clip-path bug with pointer events dispatched
outside the clipped region on hover
Re: Issue 566180 in chromium: Chromevox: Spoken feedback doesn't read out
all items in locked screen
Re: Issue 236219 in chromium: Website not displaying drop-down list after
checking boxes
Re: Issue 94659 in chromium: Chrome should download a pdf when pdf viewer
plugin is disabled.
Re: Issue 561863 in chromium: Switch GPU recipe to run new Telemetry GPU
test isolate
Re: Issue 352257 in chromium: chrome.usb should be available to extensions
Re: Issue 557185 in chromium: MediaStreamDestination don't work with 6
channels
Re: Issue 566241 in chromium: current_cpu not bound to toolchain_args()
value while evaluating toolchain definition
Re: Issue 512869 in chromium: Support NaCl on Windows GN builds
Re: Issue 108236 in chromium: Link to PDF lets Chrome stumble but without
viewer plugin downloads normally.
Re: Issue 344760 in chromium: New API docs: Method signature line flashes
green
Re: Issue 94659 in chromium: Chrome should download a pdf when pdf viewer
plugin is disabled.
Re: Issue 557185 in chromium: MediaStreamDestination don't work with 6
channels
Re: Issue 565581 in chromium: Touch events are disabled in ChromeOS when
developer mode is enabled
Re: Issue 180083 in chromium: Refactor ExtensionPrefs to provide generic
pref storage for APIs
Re: Issue 82061 in chromium: When pausing Webkit inspector inside
javascript code executed from a plugin, chrome keeps complaining about
unresponsive plugin
Re: Issue 554709 in chromium: cryptohome: add crc to persistent data as a
corruption sanity check
Re: Issue 231916 in chromium: Chrome for Androids's Canvas drawImage loses
fidelity in canvases larger than 64k pixels
Re: Issue 333582 in chromium: Adblock Plus Version: 1.7.2 not working
correctly with this chrome build.
Re: Issue 87869 in chromium: Flash content loading improperly, incomplete
imaging no matter zoom state
Re: Issue 545972 in chromium: ASSERTION FAILED:
animatableAttributesStaticLocalVerifier.isNotRacy() in
blink::SVGElement::isAnimatableAttribute
Re: Issue 231916 in chromium: Chrome for Androids's Canvas drawImage loses
fidelity in canvases larger than 64k pixels
Re: Issue 538576 in chromium: The Encryption(-Key) header parsers should be
iterator-based
Re: Issue 78297 in chromium: PDF form taborder is wrong
Re: Issue 67110 in chromium: [skia] Leftmost pixel of antialiased rectangle
has a slightly wrong alpha value
Re: Issue 77788 in chromium: PDF scrolling really slow on a Mac.
Re: Issue 548479 in chromium: After nacl crash, if a device is on kiosk
mode, it should restart again after a crash.
Re: Issue 80701 in chromium: Preload: Start window for measurement at
AddPreload time, not when a prefetch tag has been seen
Re: Issue 550046 in chromium: non-720p video is the wrong height, has
duplicated rows at bottom
Re: Issue 565873 in chromium: right-click on player : "Show controls"
missing
Re: Issue 112723 in chromium: Print preview adds a horizontal scrollbar
to "fit" content to page
Re: Issue 555390 in chromium: touchevents enabled for non touch devices in
M48
Re: Issue 539496 in chromium: nine patch image has artifacts with dsf=1.25
Re: Issue 564040 in chromium: nacl-arm_perf_panda trybot doesn't work
Re: Issue 567305 in chromium: webgl_conformance_tests aren't happy on the
Win8 Release bot.
Re: Issue 548383 in chromium: DXVA decoder using Angle created device may
cause Win8 bot Flakiness
Re: Issue 550046 in chromium: non-720p video is the wrong height, has
duplicated rows at bottom
Re: Issue 86654 in chromium: PDFs do not redraw while holding pgup/pgdn
Re: Issue 78264 in chromium: Slow PDF rendering
Re: Issue 88802 in chromium: zoom not working in an embedded PDF
--
--
Automated mail from issue updates at http://crbug.com/
Subscription options: http://groups.google.com/a/chromium.org/group/chromium-bugs

---
You received this message because you are subscribed to the Google Groups "Chromium-bugs" group.
To unsubscribe from this group and stop receiving emails from it, send an email to chromium-bugs+***@chromium.org.
c***@googlecode.com
2015-12-07 21:34:41 UTC
Permalink
Your project notifications generated too many emails to send
individually. Here are the subject lines of the emails you would have
received:

Re: Issue 550784 in chromium: Clear button is in enabled state even after
all the options are unchecked
Re: Issue 165217 in chromium: Make Handles more accessible in IPC::Messages
on Windows
Re: Issue 564756 in chromium: Print out more info from Should.beCloseToArray
Re: Issue 173805 in chromium: Flash component Context menu are not
localized in He, Ar, complex script languages
Re: Issue 566760 in chromium: Disable avatar menu no longer works
Re: Issue 162710 in chromium: Toggling fullscreen looses focus of nacl
module
Re: Issue 161308 in chromium: Unable to scroll text fields with mouse wheel
Re: Issue 565398 in chromium: Enable BVT testing for Mickey
Re: Issue 161308 in chromium: Unable to scroll text fields with mouse wheel
Re: Issue 567309 in chromium: Populate Custom Search Engine Suggestions
from Default Search Engine Suggestions
Re: Issue 565398 in chromium: Enable BVT testing for Mickey
Re: Issue 166117 in chromium: FR: Warn user if copy is not possible
Re: Issue 544255 in chromium: Chrome repeatedly prompts for NTLM
authentication credentials
Re: Issue 160022 in chromium: Tabs created with 'Duplicate Tab' behave
differently from 'New Tab' and can fail due to shared resource limits
Re: Issue 160342 in chromium: Huge rendering bug on Overflow hidden + Fixed
position divs with flash content
Re: Issue 564876 in chromium: Provide a way to initiate on-demand updates
from the command line.
Re: Issue 159107 in chromium: Flash chart showing white stripes and blocks
Re: Issue 161845 in chromium: Base tag ignored if previous form submit
contained the same href as the base tag
Re: Issue 159893 in chromium: Fullscreen flash is broken
Re: Issue 467292 in chromium: Add regression test for ensuring squelching
works
Re: Issue 125733 in chromium: Prerender should wait for NAV_ENTRY_COMMITTED
notification
Re: Issue 539496 in chromium: nine patch image has artifacts with dsf=1.25
Re: Issue 154349 in chromium: Scarygirl game is zoomed-in when run in
fullscreen, making it unplayable
Re: Issue 305014 in chromium: webaudio/mediaelementaudiosourcenode-gc.html
crashes when run after webaudio/decode-audio-data-basic.html
Re: Issue 564223 in chromium: 5-7% regression in PartitionAlloc memory
usage in range 361472 - 361474
Re: Issue 125733 in chromium: Prerender should wait for NAV_ENTRY_COMMITTED
notification
Issue 567323 in chromium: Run AddressSanitizer(ASan) on a Cronet bot
Re: Issue 549781 in chromium: Add exosphere component to Chromium
Re: Issue 154159 in chromium: Video controls shown in Full screen even the
video is not in Full screen.
Re: Issue 439726 in chromium: click position error when opening page in new
tab
Re: Issue 370363 in chromium: autofill for forms not deactivatable
Re: Issue 359328 in chromium: Remove --show-fps-counter (Was: FPS counter
observed on crbug drop-down menus)
Re: Issue 567212 in chromium:
MediaGalleriesPlatformAppBrowserTest.PicasaDefaultLocation keeps timing out
on Win7 bots
Re: Issue 147525 in chromium: DromaeoTest.DOMCoreModifyPerf is timing out
Re: Issue 134013 in chromium: shockwave flash crashes @ RaiseException
Re: Issue 551072 in chromium: Mac: Use of GpuMemoryBuffers for compositor
resources and Gpu raster are incompatible
Re: Issue 154641 in chromium: Janky layout jiggling 2-finger scrolling
crbug.com bug report
Re: Issue 229604 in chromium: Page blank upon loading pages
Re: Issue 118149 in chromium: Page loads then immediately disappears --
ERROR:gles2_cmd_decoder.cc(4725) in Console
Re: Issue 149778 in chromium: PLayer tool bar falls from center to the
bottom of the screen when you go fullscreen ()
Re: Issue 152313 in chromium: Voice when switching from normal mode is
repeated in full screen mode and vice-versa.
Re: Issue 563613 in chromium: Validate WebGL 2.0 Samplers
Re: Issue 232990 in chromium: Page distortion / artifacts appearing
intermittently
Re: Issue 145283 in chromium: The flash content will continue to distort
and resize while it is loading
Re: Issue 140780 in chromium: In Youtube, Pause is observed when switching
between Full Screen and Exit Full Screen
Re: Issue 567230 in chromium: restart-not-visible.html is timing out and
crashing
Re: Issue 120732 in chromium: Gif animation not running smoothly
Re: Issue 256032 in chromium: Scrolling up or down while viewing images
causes zoom to change
Re: Issue 359328 in chromium: Remove --show-fps-counter (Was: FPS counter
observed on crbug drop-down menus)
Re: Issue 240827 in chromium: Implement filter effects region in reference
filters
Re: Issue 158107 in chromium: Upscaling stage for fullscreen video produces
two different video frames
Re: Issue 566944 in chromium: Nexus 7 - Bookmarks folder not remembered
Re: Issue 409576 in chromium: After closing chrome I return to, last page
when I start
Re: Issue 517258 in chromium: Wildcards are not allowed in
administrative/unilateral name constraints
Re: Issue 124794 in chromium: Entering text into input with style set
to "position: fixed; -webkit-transform: translateY(Xpx);" scrolls to
incorrectly calculated position
Re: Issue 281002 in chromium: accelerated-2d-canvas has an issue about
circle.
Re: Issue 567096 in chromium: Compilation issue with profiling=1
Re: Issue 238645 in chromium: Some pages display black boxes where there
should be none, and then become unresponsive
Re: Issue 285321 in chromium: Faulty element width with floated text, odd
font-size, and text-rendering: optimizeLegibility
Re: Issue 539496 in chromium: nine patch image has artifacts with dsf=1.25
Re: Issue 274779 in chromium: extension/app manifest to enable ES:Harmony /
experimental javascript
Re: Issue 565306 in chromium: Reduce noise in v8.infinite_scroll benchmark
Re: Issue 99415 in chromium: Extension settings API: Bad data in the
extension settings leveldb database doesn't get deleted
Re: Issue 469657 in chromium:
fast/events/mouse-event-buttons-attribute.html is flaky
Re: Issue 178468 in chromium: No access to webcam controls on sites that
use cam
Issue 567325 in chromium: n
Re: Issue 564578 in chromium: Unify iOS PasswordFrom parsing with other
platforms
Re: Issue 338133 in chromium: Skia roll made test flaky
Re: Issue 544255 in chromium: Chrome repeatedly prompts for NTLM
authentication credentials
Re: Issue 305365 in chromium: Closing a twitter-bootstrap modal doesn't
repaint the screen properly
Re: Issue 242165 in chromium: CookiesViewWebUITest.testOpenCookiesView
broken on Linux
Re: Issue 160022 in chromium: Tabs created with 'Duplicate Tab' behave
differently from 'New Tab' and can fail due to shared resource limits
Re: Issue 310292 in chromium:
http/tests/security/video-poster-cross-origin-crash.html flaky on Mac 10.6
Re: Issue 482769 in chromium: Include OS version in NetLog dumps
Re: Issue 566016 in chromium: Server-side spellcheck does not underline
gibberish
22 issues changed in chromium
Re: Issue 398239 in chromium: synthesized font shorthand incorrect
Re: Issue 548383 in chromium: DXVA decoder using Angle created device may
cause Win8 bot Flakiness
Re: Issue 564381 in chromium: WM needs some way to know window types
Re: Issue 566801 in chromium: Breakpoints inside single line and single
expression arrow functions
Re: Issue 529948 in chromium: crosperf:lost functionality with roll to
schedv2
Re: Issue 548383 in chromium: DXVA decoder using Angle created device may
cause Win8 bot Flakiness
Re: Issue 302466 in chromium: If a page loads/renders in the background, it
renders as a black page
Re: Issue 550784 in chromium: Clear button is in enabled state even after
all the options are unchecked
Re: Issue 567316 in chromium: Ctrl+shift+minus/plus not working on Chromebox
Re: Issue 541356 in chromium: infobar_autologin.png should be in
ios_theme_resources.grd
Re: Issue 566495 in chromium: Global search (Ctrl+Shift+F) doesn't find
anything on evaluated scripts
Issue 567327 in chromium: Client and non-client area appear at different
times
Re: Issue 348323 in chromium: Black screen instead of web pages.
Re: Issue 239040 in chromium: Possibly unbalanced pixel locking/unlocking
in Blink's Image::drawPattern
Re: Issue 346059 in chromium: print preview doesn't print background-image
images, but also doesn't remove them from the flow
Re: Issue 516066 in chromium: Slow bubble shows up on wrong window in
immersive fullscreen
Re: Issue 517258 in chromium: Wildcards are not allowed in
administrative/unilateral name constraints
Re: Issue 567139 in chromium: WTF containers should work with move-only
types
Re: Issue 401375 in chromium: web pages blanks out after 2 to 3 seconds of
loading
Re: Issue 567308 in chromium: Running chrome with --disable-security causes
rendering problems with html5 canvas
Re: Issue 426541 in chromium: OOPIF: Mouse wheel won't scroll in Aura
Issue 567328 in chromium: VS 2015 builds broken
Re: Issue 437647 in chromium: Chrome does not read values from Mac OS X
Keychain
Issue 567329 in chromium: Change data content on object tag in PDF
Re: Issue 385582 in chromium: blank screen after a second of page loading
Re: Issue 123674 in chromium: get rid of sync_api::BaseNode::GetEntry
--
--
Automated mail from issue updates at http://crbug.com/
Subscription options: http://groups.google.com/a/chromium.org/group/chromium-bugs

---
You received this message because you are subscribed to the Google Groups "Chromium-bugs" group.
To unsubscribe from this group and stop receiving emails from it, send an email to chromium-bugs+***@chromium.org.
c***@googlecode.com
2015-12-07 22:49:27 UTC
Permalink
Your project notifications generated too many emails to send
individually. Here are the subject lines of the emails you would have
received:

Re: Issue 567337 in chromium: Flakiness in mojo_apptests FrameTests
Issue 567342 in chromium: Add more UMA histogram stats to track download
protection performances
Re: Issue 566426 in chromium: Google Play music menubar is not laid out
correctly
Re: Issue 561010 in chromium: Clean up foreign namespaces inside skia/ext
Re: Issue 538694 in chromium: html5 video context menu items are missing
Re: Issue 567342 in chromium: Add more UMA histogram stats to track
download protection performances
Re: Issue 566491 in chromium: Google API Keys are missing error message
when opening web browser.
Re: Issue 564876 in chromium: Provide a way to initiate on-demand updates
from the command line.
Re: Issue 567329 in chromium: Change data content on object tag in PDF
Issue 567344 in chromium: trouble with initial sync
Re: Issue 57218 in chromium: Web database does not support foreign keys
Re: Issue 515454 in chromium: CSS font style matching test takes long
Re: Issue 567315 in chromium: TCMalloc unit tests fail under Valgrind
Re: Issue 522567 in chromium: Constant crashes in SoundHound on
FATAL:render_frame_impl.cc(4829) Check failed: false. Invalid URL passed
about:blank
Re: Issue 344141 in chromium: HTML5 videos in full screen show visual
tearing
Re: Issue 344141 in chromium: HTML5 videos in full screen show visual
tearing
Re: Issue 560852 in chromium: Bookmarks bar selection graphical glitch
Re: Issue 567340 in chromium: PDF viewer is blocked, with no way to run it
Re: Issue 567340 in chromium: PDF viewer is blocked, with no way to run it
Re: Issue 566908 in chromium: 3.9% regression in dromaeo.domcoremodify at
363352:363359
Re: Issue 566751 in chromium: Win ASAN LKGR compile failure
Re: Issue 417815 in chromium: Add zero suggest click indicator to chrome
history
Re: Issue 443247 in chromium: UIAutomator "click" and "longClick" does not
work on page content
Re: Issue 566833 in chromium: "Reopen closed tab" not available in
Incognito mode
Re: Issue 567196 in chromium: [Regression] background-image of horizontal
tab broken on Wikipedia in latest Canary
Re: Issue 566783 in chromium: Rollback Instructions - NTLM #544255 etc
Re: Issue 541145 in chromium: soundcloud widgets displayed in feedly cause
a crash when played
Re: Issue 554909 in chromium: about:gpu does not enumerate actual driver
bug workarounds running in the gpu process
Re: Issue 414978 in chromium: Chrome generates PDF files with much larger
file size due to font content
Re: Issue 566950 in chromium: Bookmarks scroll wheel broken
Re: Issue 566783 in chromium: Rollback Instructions - NTLM #544255 etc
Re: Issue 501543 in chromium: fast/images/size-failure.html fails due to
slimming paint
Re: Issue 566241 in chromium: current_cpu not bound to toolchain_args()
value while evaluating toolchain definition
Re: Issue 530034 in chromium: After waking from standby, all DNS entries
expires immediately
Re: Issue 566921 in chromium: Chrome thinks "a lot" should be "alot"
Re: Issue 554242 in chromium: Remove SYNC_EXPORT_PRIVATE macro and replace
with SYNC_EXPORT
Re: Issue 567301 in chromium: Fix lint violations in src/sync/* code
Re: Issue 566811 in chromium: plz update your websites Correct thr typo
mistakes
Re: Issue 566165 in chromium: Windows 10 support
Re: Issue 548541 in chromium: Background contents appears on tap/touch
of 'English-handwrite input tool.
Re: Issue 482769 in chromium: Include OS version in NetLog dumps
Re: Issue 319721 in chromium: background-position:fixed conflicts with
position: fixed on internal display only
Re: Issue 564876 in chromium: Provide a way to initiate on-demand updates
from the command line.
Re: Issue 544686 in chromium: Entire Chrome screen is constantly cracking
on ubuntu 14.04 with fglrx drivers
Re: Issue 437647 in chromium: Chrome does not read values from Mac OS X
Keychain
Re: Issue 567337 in chromium: Flakiness in mojo_apptests FrameTests
Re: Issue 567189 in chromium: "FrameTest.ChildFrameClientConnectData" is
flaky
Re: Issue 566561 in chromium: inline svg in content css rule in an :after
psudo tab is not rerendered correctly
Re: Issue 567337 in chromium: Flakiness in mojo_apptests FrameTests
Re: Issue 564959 in chromium: 1.8% regression in speedometer at
362435:362538
Re: Issue 563202 in chromium: Loop video on youtube
Re: Issue 538694 in chromium: html5 video context menu items are missing
Re: Issue 460828 in chromium: Win8 GN bots are failing due to gn_check
Include not allowed
Re: Issue 552398 in chromium: WebView on Android 5 - 6 persistent
checkerboard
Re: Issue 567298 in chromium: Make a variant of isSecureContext() that
doesn't take an error message argument
Re: Issue 522567 in chromium: Constant crashes in SoundHound on
FATAL:render_frame_impl.cc(4829) Check failed: false. Invalid URL passed
about:blank
Re: Issue 522567 in chromium: Constant crashes in SoundHound on
FATAL:render_frame_impl.cc(4829) Check failed: false. Invalid URL passed
about:blank
Re: Issue 539496 in chromium: nine patch image has artifacts with dsf=1.25
Re: Issue 567298 in chromium: Make a variant of isSecureContext() that
doesn't take an error message argument
Re: Issue 509748 in chromium: Security key access fails during login
Re: Issue 566568 in chromium: PDF Viewer displays header, which destroys
position of displayed page in iframe.
Re: Issue 414978 in chromium: Chrome generates PDF files with much larger
file size due to font content
Issue 567345 in chromium: OOPIF: Browser crash when trying to type after a
focused subframe's renderer crashes.
Re: Issue 566921 in chromium: Chrome thinks "a lot" should be "alot"
Re: Issue 566944 in chromium: Nexus 7 - Bookmarks folder not remembered
Re: Issue 567086 in chromium: Regression: Icon of PDF options becomes full
grey after long press of Space-bar key .
Re: Issue 69871 in chromium: Integrated PDF-Reader incorrectly displays
Embedded PostScript graphics
Issue 567347 in chromium: "Learn more" link is missing on Malware download
warning notification
Re: Issue 538454 in chromium: git reparent-branch raises: TypeError:
sequence item 6: expected string, NoneType found
Re: Issue 551800 in chromium: Gallery: transition animation from thumbnail
view to slide view starts after image load
Re: Issue 567347 in chromium: "Learn more" link is missing on Malware
download warning notification
Re: Issue 408895 in chromium: Painting order for float is very wrong.
Re: Issue 567298 in chromium: Make a variant of isSecureContext() that
doesn't take an error message argument
Re: Issue 75335 in chromium: Text quality poor on PDF
Re: Issue 417815 in chromium: Add zero suggest click indicator to chrome
history
Re: Issue 566224 in chromium: Restart all masters to pick up buildbucket
change.
Re: Issue 566924 in chromium: bobcat failed to setup_board
Re: Issue 266126 in chromium: Secure Shell pastes on right-click instead of
middle-click
Re: Issue 544255 in chromium: Chrome repeatedly prompts for NTLM
authentication credentials
Re: Issue 544686 in chromium: Entire Chrome screen is constantly cracking
on ubuntu 14.04 with fglrx drivers
Re: Issue 536048 in chromium: Autofill popup is not hiding on window move
in ChromeOS.
Re: Issue 114338 in chromium: Omnibox text entry very slow when looking
through history
Re: Issue 552058 in chromium: Answers in Suggest Query Badly Escaped
Issue 567351 in chromium: Correct spelling outter --> outer
Re: Issue 521686 in chromium: DevTools: enable infobar when attached to any
of the tabs in the given browser
Re: Issue 567068 in chromium: Div with auto scrollbar not rendering
correctly after content changes
Re: Issue 165217 in chromium: Make Handles more accessible in IPC::Messages
on Windows
Re: Issue 77145 in chromium: Enhancement: Following links in PDF should
alter history
Issue 567352 in chromium: Range.intersectsNode results are incorrect when
given text node in headless document
Re: Issue 175314 in chromium: <frame> and <iframe> should not create
backing store for borders
Re: Issue 367522 in chromium: Chrome pdf plugin lacks "previous view"
button/functionality
Re: Issue 529905 in chromium: lazy setup_board --board=bobcat fails on
builders
Re: Issue 565132 in chromium: Modal window drop-down menus are not working
in AngularJS 1.2.6
Re: Issue 567352 in chromium: Range.intersectsNode results are incorrect
when given text node in headless document
Issue 567356 in chromium: Refactor OfflinePageModelTest to simplify testing
outside of it.
Re: Issue 328738 in chromium: Pressing on the default Chrome icon keeps
creating more windows when another profile is opened.
Re: Issue 521686 in chromium: DevTools: enable infobar when attached to any
of the tabs in the given browser
Re: Issue 566760 in chromium: Disable avatar menu no longer works
Re: Issue 554242 in chromium: Remove SYNC_EXPORT_PRIVATE macro and replace
with SYNC_EXPORT
Re: Issue 567301 in chromium: Fix lint violations in src/sync/* code
Issue 567357 in chromium: libbrillo: process: close file descriptors
inherited from parent
Re: Issue 417815 in chromium: Add zero suggest click indicator to chrome
history
--
--
Automated mail from issue updates at http://crbug.com/
Subscription options: http://groups.google.com/a/chromium.org/group/chromium-bugs

---
You received this message because you are subscribed to the Google Groups "Chromium-bugs" group.
To unsubscribe from this group and stop receiving emails from it, send an email to chromium-bugs+***@chromium.org.
c***@googlecode.com
2015-12-08 20:03:04 UTC
Permalink
Your project notifications generated too many emails to send
individually. Here are the subject lines of the emails you would have
received:

Re: Issue 567298 in chromium: Make a variant of isSecureContext() that
doesn't take an error message argument
Re: Issue 567615 in chromium: Add UMA to record request parameters of
Cache.add/addAll
Re: Issue 538259 in chromium: Make WebRTC Chromium bots use chromium_tests
recipe module
Re: Issue 295193 in chromium: WorkerTest.LimitTotal flaky on mac
Issue 567817 in chromium: [Blimp Net] Add engine authentication handler
Re: Issue 567782 in chromium: externalURLScenarioWebReferrerTargetBlank and
externalURLScenarioWebReferrerWindowOpen failing on iPhone simulator with
WKWebView enabled
Re: Issue 567338 in chromium: WebGL 2 Transform Feedback bug
Re: Issue 567496 in chromium: FrameTest.OnViewEmbeddedInFrameDisconnected
in mojo apptests flaky
Re: Issue 556259 in chromium: Decrease overhead of Mojo pipes in the new
EDK by multiplexing pipes
Re: Issue 563639 in chromium: Child process isn't skipping past platform
handle, causing read errors and failure
Re: Issue 563639 in chromium: Child process isn't skipping past platform
handle, causing read errors and failure
Re: Issue 556259 in chromium: Decrease overhead of Mojo pipes in the new
EDK by multiplexing pipes
Re: Issue 567338 in chromium: WebGL 2 Transform Feedback bug
Re: Issue 567532 in chromium: Regression: Wierd behaviour of Menu and
Sub-menu is seen after mouse hovering on any options at "www.stc.com.sa".
Re: Issue 567388 in chromium: [Ninja] DEV screen not shown when connecting
to any monitor via DP-HDMI
Re: Issue 565697 in chromium: Smart Lock still seems to work even after
LST Revocation
Re: Issue 293948 in chromium: MutationObserver callback not called when
element is resized using css resize property
Re: Issue 567766 in chromium: AUTEST does not support trybot build names
Re: Issue 554773 in chromium: x86-alex-paladin provision failure "Update
failed, current operations is UPDATE_STATUS_IDLE"
Re: Issue 243572 in chromium: Update engine should send an Omaha error code
after reboot if it previously completed an update but failed to actually
update.
Re: Issue 567786 in chromium: Nexus 9 Stuck on provision_devices
Re: Issue 564691 in chromium: Tests fail on Win-Clang bots after Crashpad
landed
Re: Issue 243572 in chromium: Update engine should send an Omaha error code
after reboot if it previously completed an update but failed to actually
update.
Issue 567820 in chromium: Remove restored window highlight for material
design Ash frame
Re: Issue 565722 in chromium: Observing chrome crash while playing video in
local media player
Re: Issue 567766 in chromium: AUTEST does not support trybot build names
Re: Issue 529867 in chromium: [Win10]: Text-box alignment is not correct at
Linked-in login screen.
Re: Issue 323767 in chromium: frequent allocations of temporary Typed Array
objects lead to OOM
Re: Issue 293948 in chromium: MutationObserver callback not called when
element is resized using css resize property
Re: Issue 567811 in chromium: AA artifacts when using SVG clip-path
Re: Issue 556771 in chromium: Support Emoji Joiner Sequences
Re: Issue 567766 in chromium: AUTEST does not support trybot build names
Re: Issue 565608 in chromium: There is a lag when typing at omnibox on a
newly opened tab
Re: Issue 565722 in chromium: Observing chrome crash while playing video in
local media player
Re: Issue 567779 in chromium: Custom wallpaper no longer loads
Re: Issue 462676 in chromium: Android's Java assertions are bad, let's make
our own assertion
Re: Issue 559297 in chromium: Remove panther_moblab & stumpy_moblab
builders & build configs
Re: Issue 564262 in chromium: extend deploy_chrome for mus+ash
Re: Issue 567282 in chromium: ERR_SSL_PROTOCOL_ERROR
Re: Issue 331216 in chromium: ArrayBuffers remain in memory forever
Re: Issue 560857 in chromium: unicode-bidi:isolate should not reset
embedding levels to zero
Re: Issue 331216 in chromium: ArrayBuffers remain in memory forever
Re: Issue 567280 in chromium: convert directory.h usage of hash_map to
unordered_map
Re: Issue 567782 in chromium: externalURLScenarioWebReferrerTargetBlank and
externalURLScenarioWebReferrerWindowOpen failing on iPhone simulator with
WKWebView enabled
Re: Issue 529939 in chromium: CQ for the Syzygy bots
Re: Issue 567754 in chromium: Wacom tablets not supported with 3.18 kernel
Re: Issue 563569 in chromium: 2.7% regression in dromaeo.domcoremodify at
361345:361422
Re: Issue 462676 in chromium: Android's Java assertions are bad, let's make
our own assertion
Re: Issue 315872 in chromium: Chrome 29 and later incorrectly searching for
a URL instead of using the correct handler (even when clicked on it)
Re: Issue 470889 in chromium: Remove duplication in mini_installer.gyp/.gypi
Re: Issue 567282 in chromium: ERR_SSL_PROTOCOL_ERROR
Re: Issue 567485 in chromium: Recent PDFium change breaking chromium
bindings
Re: Issue 567263 in chromium: Webview is unable to be resetted when an
infinite JS animation is running
Re: Issue 567797 in chromium: adb_wrapper.AdbWrapper.KillServer error on
chromeos
Re: Issue 469120 in chromium: PredictorBrowserTest.DnsPrefetch is flaky on
Win
Re: Issue 567797 in chromium: adb_wrapper.AdbWrapper.KillServer error on
chromeos
Re: Issue 347770 in chromium: Improve http server information and socket
performance for Chromecast
Re: Issue 371136 in chromium: HttpServer shouldn't crash simply because of
non-HTTP/1.1 request
Re: Issue 567797 in chromium: adb_wrapper.AdbWrapper.KillServer error on
chromeos
Re: Issue 19223 in chromium: Render the overlays (header and footer) in the
renderer
Re: Issue 567797 in chromium: adb_wrapper.AdbWrapper.KillServer error on
chromeos
Re: Issue 19223 in chromium: Render the overlays (header and footer) in the
renderer
Re: Issue 525751 in chromium: Illegal instruction SIGILL on start up
Issue 567827 in chromium: Renderer crashes
from "http://www.google.com/intl/en/chromecast/" aren't seen
under "Chrome://crashes"
Re: Issue 546820 in chromium: Experiment with Strict Secure Cookies:
deprecating modification of 'secure' cookies from insecure schemes
Re: Issue 563318 in chromium: Unable to capture WebRTC debug logs if chrome
beta/GA and canary are installed in same machine
Re: Issue 567338 in chromium: WebGL 2 Transform Feedback bug
Re: Issue 331660 in chromium: Large ArrayBuffers are very unstable
Re: Issue 44519 in chromium: Rewrite collapse() and expand() in console view
Re: Issue 337978 in chromium: Texture overlay on top of
https://chromium-access.appspot.com/
Re: Issue 565598 in chromium: Bisect suspects a CL but confidence is 0
Re: Issue 558410 in chromium: "Create Applications Shortcuts" disappeared
from Win8-
Re: Issue 270849 in chromium: On upgrade to 30.0.1590.2, both profiles
have "sync error: sign in again" with sync backends that haven't initialized
Re: Issue 552339 in chromium: Add UI for RTL editor direction change
Re: Issue 525198 in chromium: crosperf afe lock server is inconsistent
about machine name extensions
Issue 567829 in chromium: Add chrome.system.setTimezone API
Issue 567830 in chromium: Don't look for android devices in telemetry when
not on posix
Re: Issue 567797 in chromium: adb_wrapper.AdbWrapper.KillServer error on
chromeos
Re: Issue 554104 in chromium: Chromebox for Meetings inconsistencies:
Configuring initial locale: language, keyboard, time format
Re: Issue 567830 in chromium: Don't look for android devices in telemetry
when not on posix
Re: Issue 347770 in chromium: Improve http server information and socket
performance for Chromecast
Re: Issue 567827 in chromium: Renderer crashes
from "http://www.google.com/intl/en/chromecast/" aren't seen
under "Chrome://crashes"
Re: Issue 349096 in chromium: postMessage crashes renderer on OOM.
Issue 567832 in chromium: Flaky zoom level in new version
Re: Issue 538694 in chromium: html5 video context menu items are missing
Re: Issue 544255 in chromium: Chrome repeatedly prompts for NTLM
authentication credentials
Re: Issue 567535 in chromium: Compile failure on
android_perf_bisect_builder.
Re: Issue 567263 in chromium: Webview is unable to be resetted when an
infinite JS animation is running
Re: Issue 543997 in chromium: Implement MediaStreamTrack Constrains API
Re: Issue 327676 in chromium: WebRTC content browsertests should test more
constraint combinations
Re: Issue 567827 in chromium: Renderer crashes
from "http://www.google.com/intl/en/chromecast/" aren't seen
under "Chrome://crashes"
Re: Issue 552646 in chromium: winx64_bisect_builder: Failed steps failed
compile (with patch) failed compile (without patch)
Re: Issue 529938 in chromium: Calculate display item bounds
Re: Issue 349304 in chromium: FileReader.readAsArrayBuffer is much slower
than expected
Re: Issue 567302 in chromium: Android MediaInfoLoader doesn't follow
redirects
Re: Issue 532625 in chromium: android_nexus4_perf_bisect: Failed steps
failed compile (with patch) failed compile (without patch)
Issue 567833 in chromium: Zoom ignored for urls with # (hash/pound)
Issue 567834 in chromium: Audio during apprtc call is not recorded(aec dump
is empty) on device Rikku
Re: Issue 545914 in chromium: Incorrectly seeks to wrong part of mp3
encoded audio
Re: Issue 544255 in chromium: Chrome repeatedly prompts for NTLM
authentication credentials
Re: Issue 539496 in chromium: nine patch image has artifacts with dsf=1.25
Re: Issue 516300 in chromium: Regression: The letter 'f' is not properly
visible in the Omnibox.
--
--
Automated mail from issue updates at http://crbug.com/
Subscription options: http://groups.google.com/a/chromium.org/group/chromium-bugs

---
You received this message because you are subscribed to the Google Groups "Chromium-bugs" group.
To unsubscribe from this group and stop receiving emails from it, send an email to chromium-bugs+***@chromium.org.
c***@googlecode.com
2015-12-08 21:45:31 UTC
Permalink
Your project notifications generated too many emails to send
individually. Here are the subject lines of the emails you would have
received:

Re: Issue 567626 in chromium: "File bug" creates a bug with
label "gardening-blink" but Sheriff-o-Matic tracks "Sheriff-Blink" instead
Re: Issue 567626 in chromium: "File bug" creates a bug with
label "gardening-blink" but Sheriff-o-Matic tracks "Sheriff-Blink" instead
Re: Issue 563285 in chromium: Chrome crashes when opening PDF
Re: Issue 567830 in chromium: Don't look for android devices in telemetry
when not on posix
Re: Issue 563711 in chromium: Remove unused git mirrors
(external/wayland/weston, external/wayland/wayland)
Re: Issue 563285 in chromium: Chrome crashes when opening PDF
Re: Issue 551176 in chromium: Android Aura: Clank’s crash dump, logcat
extractor, etc
Re: Issue 551170 in chromium: Android Aura: Pop-up window support
Re: Issue 563711 in chromium: Remove unused git mirrors
(external/wayland/weston, external/wayland/wayland)
Re: Issue 549570 in chromium: ContentShell.apk crash during gpu process
launch
Re: Issue 546665 in chromium: aura: Support GPU-process on Android
Re: Issue 546713 in chromium: android: Break up jni registration for
classes used on aura vs. not
Issue 567853 in chromium: In mash, menus are misplaced.
Re: Issue 567726 in chromium: tryserver.client.catapult purple
Re: Issue 400811 in chromium: Collect UMA stats on machine model names on
Android
Re: Issue 564943 in chromium: 15.3% regression in
thread_times.key_silk_cases at 361904:362399
Re: Issue 418037 in chromium: Make sure WebGL isn't enabled when there is
no robustness support and virtual contexts are in use
Re: Issue 427026 in chromium: Upstream crash uploading for Android
Re: Issue 349096 in chromium: postMessage crashes renderer on OOM.
Re: Issue 564691 in chromium: Tests fail on Win-Clang bots after Crashpad
landed
Re: Issue 462371 in chromium: Add callback mechanism for tracking when a UI
resources has been painted to the screen.
Re: Issue 485969 in chromium: Prevent repeated popups from a single page
Re: Issue 462447 in chromium: Browser hang seen inside compositor
destruction while closing tab
Re: Issue 545597 in chromium: Email is not prefilled in GAIA when it should
be
Re: Issue 533181 in chromium: Reliable failure made it through the CQ
Re: Issue 567747 in chromium: 2.4%-3.9% regression in
startup.warm.blank_page at 363403:363419
Re: Issue 567850 in chromium: CrashPad doesn't need to block Browser startup
Re: Issue 567827 in chromium: Renderer crashes
from "http://www.google.com/intl/en/chromecast/" aren't seen
under "Chrome://crashes"
Re: Issue 68552 in chromium: OOM when endlessly creating workers and/or
message ports
Issue 567857 in chromium: Provide a way to style the indeterminate progress
bar
Re: Issue 567827 in chromium: Renderer crashes
from "http://www.google.com/intl/en/chromecast/" aren't seen
under "Chrome://crashes"
Issue 567858 in chromium: audit syncer_unittest.cc for expected/actual
ordering on gtest macros
Re: Issue 556771 in chromium: Support Emoji Joiner Sequences
Re: Issue 544882 in chromium: Regression: ‘Settings’ button appear chopped
for some zoom levels in chrome web store.
Re: Issue 567827 in chromium: Renderer crashes
from "http://www.google.com/intl/en/chromecast/" aren't seen
under "Chrome://crashes"
Re: Issue 486732 in chromium: gpu process DCHECKs on startup
Re: Issue 322658 in chromium: Chrome for Android still not handling
@font-face src:local and a system font specified in 'font-family'
Re: Issue 497095 in chromium: [Chrome] Process
com.android.chrome:privileged_process0
com.android.chrome:privileged_process0 died by signal - 7.
Re: Issue 567827 in chromium: Renderer crashes
from "http://www.google.com/intl/en/chromecast/" aren't seen
under "Chrome://crashes"
Re: Issue 567850 in chromium: CrashPad doesn't need to block Browser startup
Re: Issue 546288 in chromium: Integrate Crashpad into Chrome on Windows
Re: Issue 322658 in chromium: Chrome for Android still not handling
@font-face src:local and a system font specified in 'font-family'
Re: Issue 553925 in chromium: Recipe flakes are killing usefulness of build
CQ
Re: Issue 567830 in chromium: Don't look for android devices in telemetry
when not on posix
Re: Issue 337916 in chromium: Cmd-backtick hotkey cycles between Chrome and
Chrome App Launcher apps
Re: Issue 508911 in chromium:
BrowserGpuChannelHostFactory::CreateViewCommandBuffer times out/crashes
Re: Issue 567827 in chromium: Renderer crashes
from "http://www.google.com/intl/en/chromecast/" aren't seen
under "Chrome://crashes"
Re: Issue 486423 in chromium: Text color in Google Sheets changes after
loading
Issue 567859 in chromium: MediaRecorder when stream has video with audio,
calls ondataavailable frequently which I don't think it should do looking
at the docs.
Re: Issue 538694 in chromium: html5 video context menu items are missing
Re: Issue 261321 in chromium: MediaRecorder API (OWP Launch Tracking)
Re: Issue 476203 in chromium: discrete nVidia gpu NEVER used by Chrome
(Hybrid Card + Optimus)
Re: Issue 547420 in chromium: Google Cast (Beta) extension is disabled if
you start chrome with with --no-experiments
Re: Issue 400391 in chromium: integrate results.js into a model class for
the failures
Re: Issue 553925 in chromium: Recipe flakes are killing usefulness of build
CQ
Re: Issue 553925 in chromium: Recipe flakes are killing usefulness of build
CQ
Re: Issue 493548 in chromium: PDF Printing no longer 'fit to page' by
default, nor remembers setting
Re: Issue 525751 in chromium: Illegal instruction SIGILL on start up
Re: Issue 496957 in chromium: add fd counts in task manager
Re: Issue 472900 in chromium: crashpad uses base but is DEPS'd in
Re: Issue 488458 in chromium: Black patch occurs when Chrome Beta is
launched in landscape mode
Re: Issue 562973 in chromium: Canvas bad background rendering when scaled
Re: Issue 549926 in chromium: #enable-tab-audio-muting not functioning
Re: Issue 452943 in chromium: ARM Mali devices wrongly report that
OES_texture_float is supported
Re: Issue 567747 in chromium: 2.4%-3.9% regression in
startup.warm.blank_page at 363403:363419
Issue 567865 in chromium: Hiding the body and showing again synchronously
causes the new tab page to blink
Re: Issue 537404 in chromium: Make sure bisector trigger tests on same
slave for a given bisect job.
Re: Issue 544972 in chromium: Componentize top-level //chrome/browser/sync
unittests to match componentized production code
Re: Issue 525751 in chromium: Illegal instruction SIGILL on start up
Re: Issue 564890 in chromium: crosperf: improve summary of results show on
the terminal
Re: Issue 567747 in chromium: 2.4%-3.9% regression in
startup.warm.blank_page at 363403:363419
Re: Issue 553925 in chromium: Recipe flakes are killing usefulness of build
CQ
Issue 567866 in chromium: ExtensionServiceTestSupervised tests failing
under Valgrind and Dr. Memory
Re: Issue 254990 in chromium: Feature request: API to retrieve the current
browser zoom level
Re: Issue 486423 in chromium: Text color in Google Sheets changes after
loading
Issue 567867 in chromium: Cookie prefixes and strict secure cookies
Re: Issue 544882 in chromium: Regression: ‘Settings’ button appear chopped
for some zoom levels in chrome web store.
Re: Issue 567867 in chromium: Cookie prefixes and strict secure cookies
Re: Issue 435153 in chromium: Passwords are not imported from Firefox
Re: Issue 546820 in chromium: Experiment with Strict Secure Cookies:
deprecating modification of 'secure' cookies from insecure schemes
Re: Issue 541511 in chromium: Experiment with cookie prefixes.
Re: Issue 567867 in chromium: Cookie prefixes and strict secure cookies
Re: Issue 567830 in chromium: Don't look for android devices in telemetry
when not on posix
Re: Issue 245726 in chromium: chrome.systemIndicator API needs 'setTitle'
method
Re: Issue 434310 in chromium: Regression: Hindi language not displayed
in 'chrome://settings/languages' after changing browser language to Hindi.
Re: Issue 441927 in chromium: ARC: Do not hardcode framebuffer device
values.
Re: Issue 441927 in chromium: ARC: Do not hardcode framebuffer device
values.
Re: Issue 567866 in chromium: ExtensionServiceTestSupervised tests failing
under Valgrind and Dr. Memory
Re: Issue 560613 in chromium: Allow port forwarding to occur in Autotest
Re: Issue 539496 in chromium: nine patch image has artifacts with dsf=1.25
Re: Issue 564691 in chromium: Tests fail on Win-Clang bots after Crashpad
landed
Re: Issue 567779 in chromium: Custom wallpaper no longer loads
Re: Issue 491261 in chromium: UI glitches along tile boundaries on pineview
devices
Re: Issue 544707 in chromium: When watching a video on YouTube and
simultaneously browsing the web on another tab or window, the other tab
takes a long time to load, and oftentimes fails to recognize I've given any
input. However, as soon as I pause the video, the page which was trying to
load, instantly begins to load and function as it should.
Re: Issue 525142 in chromium: Remove dwrite font cache and integrate dwrite
properly into sandboxed skia
Re: Issue 544255 in chromium: Chrome repeatedly prompts for NTLM
authentication credentials
Re: Issue 556771 in chromium: Support Emoji Joiner Sequences
Re: Issue 566561 in chromium: inline svg in content css rule in an :after
psudo tab is not rerendered correctly
Issue 567871 in chromium: DevTools: NetworkChangeNotifier should respect
devtools network throttling
Re: Issue 567693 in chromium: Remove special casing of 'xpointer(...' as
fragment
Re: Issue 78264 in chromium: Slow PDF rendering
Re: Issue 565761 in chromium: Puppet vagrant testing broken
--
--
Automated mail from issue updates at http://crbug.com/
Subscription options: http://groups.google.com/a/chromium.org/group/chromium-bugs

---
You received this message because you are subscribed to the Google Groups "Chromium-bugs" group.
To unsubscribe from this group and stop receiving emails from it, send an email to chromium-bugs+***@chromium.org.
c***@googlecode.com
2015-12-10 19:01:54 UTC
Permalink
Your project notifications generated too many emails to send
individually. Here are the subject lines of the emails you would have
received:

Re: Issue 567166 in chromium: WebRTC datachannel ignores SCTP packet with
multiple data chunks
Issue 568674 in chromium: Investigate whether DumpAccessibilityTree tests
are actually leaking
Re: Issue 568671 in chromium: Chromium Commit Queue does not preserve
author name when committing.
Re: Issue 556742 in chromium: Sennheiser SC-60 USB headset - mic path buzz,
possible initialization/config problem
Re: Issue 542073 in chromium: 10.9% regression in startup.cold.blank_page
at 353091:353137
Re: Issue 565758 in chromium: Normal computation gets inverted for Y
rotations close to zero.
Re: Issue 550484 in chromium: Enable Force Touch for links
Issue 568675 in chromium: Tracing category issues of --trace-to-console
Re: Issue 568437 in chromium: bootstrap.py fails to link gn on macos
because of missing source file base/trace_event/malloc_dump_provider.cc
Re: Issue 550464 in chromium: Text input area cannot be clicked after
resizing over some other element
Re: Issue 533648 in chromium: Memory leak on Unity game
Re: Issue 565680 in chromium: [Feature Request]: URL/Path based throttling
Re: Issue 546019 in chromium: Allow collected histogram data to live across
task boundaries.
Issue 568678 in chromium: A bunch of layout test failures on XP
Re: Issue 372771 in chromium: 8ms per frame under
updateLayerPositionsAfterScroll on MBP scrolling bit.ly/blinkon2
Re: Issue 556742 in chromium: Sennheiser SC-60 USB headset - mic path buzz,
possible initialization/config problem
Re: Issue 384715 in chromium: Background Apps aren't auto-started anymore
with the Chrome on starting the system
Re: Issue 568623 in
chromium: "org.chromium.chrome.browser.signin.SigninHelperTest#testNotSignedInAccountRename"
is flaky
Re: Issue 567290 in chromium: Notification button titles aren't visible in
canary.
Re: Issue 547872 in chromium: 19.9%-3377.3% regression in
blink_perf.pywebsocket at 355966
Re: Issue 552703 in chromium: ClangToTLinuxUBSanVptr bot takes 6.5h to cycle
Re: Issue 562219 in chromium: Sound problem in Chrome
Re: Issue 552703 in chromium: ClangToTLinuxUBSanVptr bot takes 6.5h to cycle
Re: Issue 567377 in chromium: CQ timeout is too short, blocking commits
Re: Issue 526304 in chromium: OOPIF: Tab(yahoo) stops rendering while
scrolling.
Re: Issue 568362 in chromium: Disabling spellcheck will not disable
server-side spellcheck.
Re: Issue 567713 in chromium: Can't scroll over top of custom scrollbars
Re: Issue 568623 in
chromium: "org.chromium.chrome.browser.signin.SigninHelperTest#testNotSignedInAccountRename"
is flaky
Re: Issue 568652 in chromium: Enounce MySpeed can no longer work
with/inject into Chrome
Re: Issue 547158 in chromium: Implement WebRTC-based protocol for chromoting
Re: Issue 568472 in chromium: Regression: 'Stop' and 'Cancel' button of
Audit section of Devtool is seen chopped after clicking on Run button.
Re: Issue 536897 in chromium: 15.3%-22.9% regression in
session_restore.cold.typical_25 at 350988:350989
Re: Issue 566499 in chromium: Thre rendering engine renders <video>
components over everything else.
Re: Issue 568647 in chromium: Video's are stripey
Re: Issue 567767 in chromium: Scroll in element with vertical flex and rtl
direction doesn't show up properly
Re: Issue 514343 in chromium: chrome.vpnProvider: Support VPN
auto-reconnects
Re: Issue 564804 in chromium: Slow rendering on Windows 10 Version 1511
Re: Issue 567960 in chromium: Media Stream Recorder fails to record a
remote peer connection stream
Re: Issue 568399 in chromium: Pixel 2 showing it's own display is not
supported on M48
Re: Issue 568176 in chromium: no external monitor, but Samus thinks there
is one
Re: Issue 568473 in chromium: PayloadVerificationError: Payload integrity
check failed: Unsupported minor version: 3
Re: Issue 568176 in chromium: no external monitor, but Samus thinks there
is one
Re: Issue 568134 in chromium: 3%-5.8% regression in memory.top_7_stress at
363810:363853
Re: Issue 470065 in chromium: Switch from ICU regexps to RE2 in autofill
Re: Issue 552703 in chromium: ClangToTLinuxUBSanVptr bot takes 6.5h to cycle
Re: Issue 331876 in chromium: [Android].htaccess protected audio & video
files cannot be played back
Re: Issue 555152 in chromium: 3.9%-16.8% regression in
session_restore.warm.typical_25 at 358209:358240
Re: Issue 568176 in chromium: no external monitor, but Samus thinks there
is one
Re: Issue 568570 in chromium: Deadkeys and compose key stopped working in
Chrome 47 on Linux
Re: Issue 560492 in chromium: Add crash uploading try# and process type
stats to Chrome on Android
Issue 568681 in chromium: Password Manager is not respecting
--disable-save-password-bubble command line switch
Re: Issue 560492 in chromium: Add crash uploading try# and process type
stats to Chrome on Android
Re: Issue 568543 in chromium: Blank print preview is seen for pdf
using 'PDF viewer' extension.
Re: Issue 552618 in chromium: Switching to system-wide RTL language leaves
Clank in bad state
Re: Issue 542162 in chromium: ClangToTAndroidASan tester is failing several
steps with no device attached error
Re: Issue 484785 in chromium: SendRequest and OnResponseHeadersUpdated
states may get mixed up
Re: Issue 552703 in chromium: ClangToTLinuxUBSanVptr bot takes 6.5h to cycle
Re: Issue 568434 in chromium: Componentize ShortcutsDatabase unittest
Re: Issue 567877 in chromium: Let clang-cl /W4 enable clang's -Wextra, and
clean up the code to build with this
Re: Issue 564804 in chromium: Slow rendering on Windows 10 Version 1511
Re: Issue 370770 in chromium: Scrollbar of overflow div is not reaching the
edge of the screen in zoom mode, forcing to move the cursor by a couple
pixels in order to catch the scrollbar in Gmail
Re: Issue 568590 in chromium: 3.2%-6.5% regression in page_cycler.morejs at
363568:363642
Re: Issue 568386 in chromium: HttpServerProperties - MRU list is not
maintained across browser startups
Re: Issue 568632 in chromium: "webkit_tests (with patch)" is flaky
Re: Issue 306188 in chromium: After element rotateY(180deg) and parent
rotateY(180deg), element's can't be interacted with
Re: Issue 568533 in chromium: Regression: Unwanted grey patch is seen after
killing and srcolling down the Pdf page.
Re: Issue 568499 in chromium: Regression : Context menu is seen misplaced
in videos of espn.go.com
Re: Issue 568533 in chromium: Regression: Unwanted grey patch is seen after
killing and srcolling down the Pdf page.
Re: Issue 369044 in chromium: Disable hover on touch for sites with a width
<= device-width
Re: Issue 568533 in chromium: Regression: Unwanted grey patch is seen after
killing and srcolling down the Pdf page.
Issue 568683 in chromium: [Autofill] Convert Autofill Download Manager to a
better backoff policy
Re: Issue 567377 in chromium: win_chromium_rel_ng takes too long to
compile, times out
Re: Issue 568473 in chromium: PayloadVerificationError: Payload integrity
check failed: Unsupported minor version: 3
Re: Issue 552703 in chromium: ClangToTLinuxUBSanVptr bot takes 6.5h to cycle
Re: Issue 568137 in chromium: bluetooth: update advertisement data
Re: Issue 553395 in chromium: bluetooth: TxPower and RSSI are always null
Re: Issue 343767 in chromium: Scrolling related code reads dirty
compositing state
Re: Issue 552703 in chromium: ClangToTLinuxUBSanVptr bot takes 6.5h to cycle
Re: Issue 510619 in chromium: Add tests for IMPLICIT and FROZEN_IMPLICIT
passphrase behaviors on Android
Re: Issue 462002 in chromium: Some sites, but in particular kuvaton.com are
intensively slow
Re: Issue 302828 in chromium: Web pages "stutter" when scrolling
Re: Issue 529515 in chromium: DevTools: [timeline] Heaviest Stack Trace view
Re: Issue 562219 in chromium: Sound problem in Chrome
Re: Issue 538367 in chromium: 13.4%-67.6% regression in
session_restore.cold.typical_25 at 351621:351642
Re: Issue 566499 in chromium: Thre rendering engine renders <video>
components over everything else.
Re: Issue 7648 in chromium: Support resuming interrupted downloads
Re: Issue 448098 in chromium: High dpi rendering incorrect for narrov
content with scrollbars
Re: Issue 225901 in chromium: Use of GetWebContents() incorrectly ties a
download item to a particular tab
Re: Issue 560816 in chromium: Eliminate dependency on
//chrome/browser/profiles on iOS
Re: Issue 562308 in chromium: WebrtcTransportTest.Connects fails on
win/asan bots
Re: Issue 405953 in chromium: can't always see the whole page
Issue 568684 in chromium: ClangToTMacASan, ClangToTMac%20(dbg) bots fail to
build llvm
Re: Issue 459626 in chromium: Hidden scrollbar overlays over relatively
positioned elements
Re: Issue 568240 in chromium: Evdev Timestamp overflow
Re: Issue 568678 in chromium: A bunch of layout test failures on XP
Re: Issue 543885 in chromium: [Tabbed mode] Incognito tab switcher button
doesn't appear when restarting Chrome
Issue 568688 in chromium: drm_hwcomposer git repo request
Re: Issue 568688 in chromium: drm_hwcomposer git repo request
Re: Issue 557440 in chromium: Remove checkForChildrenAdjacentRuleChanges
Re: Issue 563676 in chromium: eventSender sends only the last mouse button
when multiple/no buttons are pressed
Issue 568689 in chromium: Plugging in external mouse causes layout issue
Re: Issue 568675 in chromium: Tracing category issues of --trace-to-console
--
--
Automated mail from issue updates at http://crbug.com/
Subscription options: http://groups.google.com/a/chromium.org/group/chromium-bugs

---
You received this message because you are subscribed to the Google Groups "Chromium-bugs" group.
To unsubscribe from this group and stop receiving emails from it, send an email to chromium-bugs+***@chromium.org.
c***@googlecode.com
2015-12-10 21:08:44 UTC
Permalink
Your project notifications generated too many emails to send
individually. Here are the subject lines of the emails you would have
received:

Re: Issue 360039 in chromium: Tabs from the same site cannot be zoomed
independently
Re: Issue 544257 in chromium: [Cyan] Detected mis-matched resolutions:
get_external_resolution returns None
Re: Issue 568675 in chromium: Tracing category issues of --trace-to-console
Re: Issue 207003 in chromium: force ancillary ebuild repositories to strict
manifest
Re: Issue 484303 in chromium: improve error message for servo.py
Re: Issue 568654 in chromium: mus probably needs a declarative layout
manager
Issue 568725 in chromium: setTimeout gets executed delayed in mousemove
handler under certain conditions
Re: Issue 568712 in chromium: Update failed (error: 11) on Mac Chrome -
KSLockFile unable to open() lock file
Re: Issue 522405 in chromium: Unable to click on any emoticons icon from
chat window via tap/touch.
Re: Issue 514510 in chromium: on switching a tab, only some UI tiles are
redrawn
Re: Issue 568347 in chromium: Autotest Shard Create Job Does Not Accept
Build Number
Re: Issue 568249 in chromium: Flash content protected with Adobe Access DRM
not playable under Windows
Re: Issue 546277 in chromium: Shard does not sync afe_parameterized_job*
tables
Re: Issue 568385 in chromium: cautotest afe: Reimage with single jobs broken
Re: Issue 546277 in chromium: Shard does not sync afe_parameterized_job*
tables
Re: Issue 567921 in chromium: remove all lint warnings from our sources in
toolchain-utils
Issue 568726 in chromium: Font kerning not being applied to small font-size
text rendered via canvas context fillText()
Re: Issue 568724 in chromium: Unable to play/pause mediaplayer by clicking
on certain areas of the media player
2 issues changed in chromium
Re: Issue 476863 in chromium: ExtensionApiTest.EventsAreUnregistered
failing on Win7 Tests (dbg)(1)
Issue 568727 in chromium: Add JS support for Force Touch
Re: Issue 545231 in chromium: Layout Test svg/custom/repaint-shadow.svg is
failing
Issue 568728 in chromium: Enter one-line summary
Re: Issue 550484 in chromium: Enable Force Touch for links
Re: Issue 550484 in chromium: Enable Force Touch for links
Re: Issue 568675 in chromium: Tracing category issues of --trace-to-console
Re: Issue 548628 in chromium: Add more UMAs to understand Oilpan's behavior
in the wild
Re: Issue 477387 in chromium:
BasicExtensionSettingsWebUITest.testDeveloperMode is flaky on Mac
(Accessibility issue?)
Re: Issue 473568 in chromium: Regression: Unnecessary highlight is seen on
the dropdown after using autofill suggestion in 'Zoho calendar'
Re: Issue 544975 in chromium: Componentize unittests from
//chrome/browser/sync/glue to match production code
Re: Issue 527993 in chromium: [META] Implement an experimental
througth-source-map editor
Re: Issue 568675 in chromium: Tracing category issues of --trace-to-console
Re: Issue 568262 in chromium: Chrome's logo has black background in Windows
10's "Open with..." context menu
Re: Issue 568684 in chromium: ClangToTMacASan, ClangToTMac%20(dbg) bots
fail to build llvm
Re: Issue 568678 in chromium: A bunch of layout test failures on XP
Re: Issue 472625 in chromium: Fixed position DIV with scrollbar will not
redraw properly when you double click on it
Re: Issue 565269 in chromium: window.addEventListener('beforeunload',
function(){ return "Are you ready"; }) does not work
Re: Issue 555152 in chromium: 3.9%-16.8% regression in
session_restore.warm.typical_25 at 358209:358240
Re: Issue 543199 in chromium: Move datatype specific things from
sync_driver to their own components
Re: Issue 568262 in chromium: Chrome's logo has black background in Windows
10's "Open with..." context menu
Re: Issue 509043 in chromium: Add chorded button transformation to
mouse->pointer event generation logic
Re: Issue 568726 in chromium: Font kerning not being applied to small
font-size text rendered via canvas context fillText()
Re: Issue 568727 in chromium: Add JS support for Force Touch
Re: Issue 568001 in chromium: Android : Webview Unable To Render Image
After Many Pause-Resume Calls
Re: Issue 559046 in chromium: Regression: For any PDF page, unable to
scroll the page up/down using mouse.
Re: Issue 568684 in chromium: ClangToTMacASan, ClangToTMac%20(dbg) bots
fail to build llvm
Re: Issue 568262 in chromium: Chrome's logo has black background in Windows
10's "Open with..." context menu
Re: Issue 562308 in chromium: WebrtcTransportTest.Connects fails on
win/asan bots
Re: Issue 564374 in chromium: switch iOS bots to use goma where possible
Re: Issue 545664 in chromium: Repeatedly having pages jump to very high or
very low magnification (on initial navigation or tab switch)
Re: Issue 568623 in
chromium: "org.chromium.chrome.browser.signin.SigninHelperTest#testNotSignedInAccountRename"
is flaky
Re: Issue 565510 in chromium: webaudio desugaring/constructor issues
Re: Issue 568690 in chromium: Falco and Quawks consistently failing with
Test NA and Build related issues.
Issue 568729 in chromium: USB DAC sometimes has delayed audio
Re: Issue 568627 in chromium: Chrome printing blank pages
Re: Issue 419087 in chromium: Associate RenderWidget with RenderFrame
instead of RenderView
Re: Issue 540629 in chromium: Device orientation not working on Nexus 5
Android 6.0
Re: Issue 568529 in chromium: Double selection handles on long press in
webview on android Lollipop?
Re: Issue 568262 in chromium: Chrome's logo has black background in Windows
10's "Open with..." context menu
Re: Issue 470414 in chromium: Marketplace Apps appear in search results for
Force-installed Apps and Extensions
Re: Issue 568287 in chromium: Font-Rendering: Crete Round with
font-weight:bold has circled dot over lowercase "i"
Re: Issue 560432 in chromium: Add benchmarking to
SettingsMainPageBrowserTest
Re: Issue 568211 in chromium: avda zero copy should wait for
OnFrameAvailable
Re: Issue 568437 in chromium: bootstrap.py fails to link gn on macos
because of missing source file base/trace_event/malloc_dump_provider.cc
Re: Issue 479215 in chromium: docserver: Adding new property to existing
object in API documentation JSON doesn't populate availability section
(Since Chrome XX)
Re: Issue 568483 in chromium: Regression : Weird long square box is seen in
Source code of devtools after opening context menu
Re: Issue 481392 in chromium: Add "input" chrome.contextMenus ContextType
Issue 568730 in chromium: NullPointerException in
PowerMonitor.onBatteryChargingChanged
Issue 568731 in chromium: User not able to select the desire portion for
highlight Selection
Re: Issue 486256 in chromium: Multiple extensions adding same titled
chrome.contextMenus items can be impossible to distinguish.
Re: Issue 489258 in chromium: Clarify "invoked" and "user gesture"
requirements for extension/apps APIs
Re: Issue 491276 in chromium: Chrome Packaged App default charset for CSS
is not UTF-8
Re: Issue 532220 in chromium: Build a demo for Luci / Milo
Re: Issue 543199 in chromium: Move datatype specific things from
sync_driver to their own components
Re: Issue 567377 in chromium: win_chromium_rel_ng takes too long to
compile, times out
Re: Issue 563237 in chromium: Crash when hitting CTRL-W while touch panning
Re: Issue 568570 in chromium: Deadkeys and compose key stopped working in
Chrome 47 on Linux
Re: Issue 555211 in chromium: 2.8% regression in blink_perf.pywebsocket at
358039:358047
Issue 568733 in
chromium: "org.chromium.chrome.browser.sync.OpenTabsTest#testDownloadMultipleDeletedOpenTabs"
is flaky
Re: Issue 489802 in chromium: Enable passive monitoring of input events
without blocking scrolling (EventListenerOptions)
Re: Issue 479425 in chromium: sendMessage / onMessage weird behavior within
event page contenxt
Re: Issue 568183 in chromium: Replace MouseWheelEvent event scrolling with
GestureScrolls
Re: Issue 489802 in chromium: Enable passive monitoring of input events
without blocking scrolling (EventListenerOptions)
Re: Issue 565980 in chromium: Mac: Main-thread pinch zoom is janky
Re: Issue 568183 in chromium: Replace MouseWheelEvent event scrolling with
GestureScrolls
Issue 568734 in chromium: Regression: Remote video not shown in /pr-answer/
page
Re: Issue 546866 in chromium: Get layout tests passing cleanly on El Capitan
Re: Issue 567692 in chromium: UploadBlobElementReader does not correctly
handle rewinding the upload data, resulting in corrupted uploads
Issue 568735 in chromium: Investigate the performance of
setAttribute('d', ...)
Re: Issue 555212 in chromium: 11.6% regression in
power.throttled_plugins_pps_disabled at 358241:358263
Re: Issue 544228 in chromium: update our encoding tables per recent spec
changes (after review)
Re: Issue 554184 in chromium: Convert Sync FakeServer to use implicit
permanent folders once the real server behaves the same way
Re: Issue 568696 in chromium: [Android] Remote scrolling gesture does not
support flinging
Re: Issue 523092 in chromium: Create a test for re-auth failures due to
usernames containing dots or mixed case characters
Re: Issue 568144 in chromium: [Android] Client crashes when the remote host
is restarted
Re: Issue 480717 in chromium: downloads.removeFile does not remove folder
from "save as" webpage complete
Re: Issue 568625 in chromium: background-attachment: fixed background on
non-composited scroller moves in reverse
Re: Issue 555388 in chromium: Mac: Investigate using AVFoundation to reduce
h264 power consumption
Re: Issue 539385 in chromium: Remove the SVG pathSegList interface
Re: Issue 568665 in chromium: memory total is missing from buildslave page
Re: Issue 564374 in chromium: switch iOS bots to use goma where possible
Re: Issue 568575 in chromium: Flatten base::android:: namespace into
base:: ?
--
--
Automated mail from issue updates at http://crbug.com/
Subscription options: http://groups.google.com/a/chromium.org/group/chromium-bugs

---
You received this message because you are subscribed to the Google Groups "Chromium-bugs" group.
To unsubscribe from this group and stop receiving emails from it, send an email to chromium-bugs+***@chromium.org.
c***@googlecode.com
2015-12-14 19:57:11 UTC
Permalink
Your project notifications generated too many emails to send
individually. Here are the subject lines of the emails you would have
received:

Re: Issue 569580 in chromium: clobber Android Builder bot
Issue 569632 in chromium: EC: Add support for AKM09912
Re: Issue 569610 in chromium: GUI issue in OSX causing the bot to die and
task to fail
Re: Issue 240827 in chromium: Implement filter effects region in reference
filters
Re: Issue 325329 in chromium: Use of location.assign() from an error page
results in no history entry being added
Re: Issue 325326 in chromium: location.replace() from error pages adds an
entry to history.
Issue 569633 in chromium: content_unittests and blink_platform_unittests
failing on clang tot win release bots
Re: Issue 565129 in chromium: Static initializer in
data_file_browser_cld_data_provider.cc
Issue 569635 in chromium: scheduler crashes during push to prod
Re: Issue 569437 in chromium: 1 second lag when opening URLs from the
command line
Re: Issue 569633 in chromium: content_unittests and
blink_platform_unittests failing on clang tot win release bots
Re: Issue 569614 in chromium: Compile failure on Chromium.perf android
builder.
Re: Issue 324525 in chromium: DownloadContentTest.ShutdownInProgress flaky
Re: Issue 528486 in chromium: Task Manager uses old Task Manager backend
(Mac)
Re: Issue 569181 in chromium: Scrollbars lose fading effect
Re: Issue 111212 in chromium: Some tabs are "almost blank" after sleep
Re: Issue 568667 in chromium: Make it easy to automatically determine if
you are reviewer or cc-ed on a codereview mail
Re: Issue 568151 in chromium: ADB log spew on non-android bots
Issue 569636 in chromium: [USS] Handling MetadataChangeList in
SharedModelTypeProcessor code
Re: Issue 560446 in chromium: Incorrectly lowered priority slowing
navigation
Re: Issue 213478 in chromium: Add device policy to lock the keyboard
settings
Re: Issue 561994 in chromium: [Regression]: Google Hangouts app does not
render its content.
Re: Issue 112723 in chromium: Print preview adds a horizontal scrollbar
to "fit" content to page
Re: Issue 568151 in chromium: ADB log spew on non-android bots
Re: Issue 544248 in chromium: Can't customize title on chrome customtab
Re: Issue 561223 in chromium: [Regression]: Rendering issue is seen while
restoring the browser
Re: Issue 562030 in chromium: Regression: Sign in overlay for locked
profile gets unresponsive after resizing the window.
Re: Issue 100529 in chromium: Nothing happens when trying to download a
file that's already paused
Re: Issue 569633 in chromium: content_unittests and
blink_platform_unittests failing on clang tot win release bots
Re: Issue 67261 in chromium: A SQL leak in
appcache::AppCacheDatabase::PrepareCachedStatement()
Re: Issue 562030 in chromium: Regression: Sign in overlay for locked
profile gets unresponsive after resizing the window.
Issue 569637 in chromium: EC: Add support for Barometer BMP280
Re: Issue 569633 in chromium: content_unittests and
blink_platform_unittests failing on clang tot win release bots
Re: Issue 173306 in chromium: Unable to verify the cookie is accepted
setting the port attribute to null value and the URL has not the port
number.
Re: Issue 424152 in chromium: Regression: Incomplete cookies info shown in
windows 8/ immersive mode after re-sizing the window
Re: Issue 136029 in chromium: Chrome ignore conditions in code
Re: Issue 567750 in chromium: 2.5%-4.7% regression in
page_cycler.top_10_mobile at 363430:363459
Re: Issue 154641 in chromium: Janky layout jiggling 2-finger scrolling
crbug.com bug report
Re: Issue 173312 in chromium: Unable to verify the "Accept All" cookie
setting
Re: Issue 555184 in chromium: 140.6%-157.5% regression in cc_perftests at
358373:358446
Re: Issue 485650 in chromium: Use page zoom logic to implement device scale
Re: Issue 565722 in chromium: Observing chrome crash while playing video in
local media player
Re: Issue 551995 in chromium: TabManager tracking bug.
Re: Issue 547286 in chromium: Do not discard tabs with PDFs that have forms
Re: Issue 181519 in chromium: Privacy Issue - Cookies not being removed
Re: Issue 385276 in chromium: Friendfeed bookmarklet doesn't work (loads
blank popup)
Re: Issue 560633 in chromium: Frame drop when I playback video streaming on
aol.com
Issue 569638 in chromium: [Blimp] Check assigner provided client token at
engine authentication handler
Re: Issue 561649 in chromium: Start running some nightly test suites
earlier, and not in the morning hours.
Re: Issue 569580 in chromium: clobber Android Builder bot
Re: Issue 561649 in chromium: Start running some nightly test suites
earlier, and not in the morning hours.
Issue 569639 in chromium: [Merge M48] Protect PDF pages from being
discarded.
Re: Issue 560633 in chromium: Frame drop when I playback video streaming on
aol.com
Re: Issue 560446 in chromium: Incorrectly lowered priority slowing
navigation
Re: Issue 569512 in chromium: Video isnt rendered on full screen when
played in full screen mode.
Re: Issue 479057 in chromium: Any stereo sound played is upmixed to 5.1/7.1
surround without being copied to all speakers, or allowing the sound card
driver to do that. The result is the sound output always being stereo.
Re: Issue 561047 in chromium: EventHandler::mousePressed state is
inconsistent between different mouse buttons
Re: Issue 509043 in chromium: Add chorded button transformation to
mouse->pointer event generation logic
Re: Issue 453531 in chromium: Chromebook - Connectivity Issues With Google
Docs - Error 400 - Unknown SID
Re: Issue 569512 in chromium: Video isnt rendered on full screen when
played in full screen mode.
Re: Issue 545585 in chromium: Move SearchProvider implementation into Blink
Re: Issue 569620 in chromium: bvt-inline and paygen time out in canaries
Re: Issue 505903 in chromium: Flash cookies don't get deleted on exit
although "Keep local data only until you quit your browser" is checked
Re: Issue 365011 in chromium: kdb / kgdb fixes
Re: Issue 378373 in chromium: UPSTREAM: Get ability to do INT locking into
the regulator core
Re: Issue 547794 in chromium: Reduce the time required to pre-read images
on Windows.
Issue 569640 in chromium: EC: Add support for TI OPT3001 in motion sense
task
Issue 569641 in chromium: Retry (with delay back-off) when fetching info
from gitiles.
Re: Issue 470482 in chromium: Remove '--enable-file-cookies'.
Re: Issue 561994 in chromium: [Regression]: Google Hangouts app does not
render its content.
Re: Issue 561223 in chromium: [Regression]: Rendering issue is seen while
restoring the browser
Re: Issue 471245 in chromium: Cookie histograms are a bit wacky.
Re: Issue 502066 in chromium: Revised Firmware UI - Drawing
Re: Issue 539505 in chromium: Tracking bug for invalid file handle crashes.
Re: Issue 569626 in chromium: Non-left mouse buttons are not sent to Chrome
in Android
Re: Issue 557934 in chromium: When playing <audio> where src is ogg,
currentTime stops incrementing at duration (which is wrong) as audio
continues playing
Issue 569642 in chromium: [USS] Handling pending unsynced items in
SharedModelTypeProcessor on initialization
Re: Issue 564303 in chromium: Replace config_lib.Add* methods with
config_lib.Add.
Re: Issue 360334 in chromium: Needs spec: Coordinates system used in
ui::TextInputClient
Issue 569643 in chromium: ASSERTION FAILED: m_invalidations.isEmpty() in
PaintController::commitNewDisplayItems()
Re: Issue 509043 in chromium: Add chorded button transformation to
mouse->pointer event generation logic
Re: Issue 569639 in chromium: [Merge M48] Protect PDF pages from being
discarded.
Re: Issue 569227 in chromium: "context_lost on ATI GPU on Windows (with
patch) on Windows" is flaky
Issue 569644 in chromium: 7.4%-28.9% regression in blink_perf.css at
364681:364733
Re: Issue 569644 in chromium: 7.4%-28.9% regression in blink_perf.css at
364681:364733
Re: Issue 551498 in chromium: 1.5% regression in
thread_times.tough_scrolling_cases at 357571:357613
Re: Issue 569643 in chromium: ASSERTION FAILED: m_invalidations.isEmpty()
in PaintController::commitNewDisplayItems()
Re: Issue 569227 in chromium: "context_lost on ATI GPU on Windows (with
patch) on Windows" is flaky
Re: Issue 567598 in chromium: Windows bot fails trying to get the Go source
code
Re: Issue 65244 in chromium: Scroll position of PDF page is not remembered
Re: Issue 547286 in chromium: Do not discard tabs with PDFs that have forms
Re: Issue 569646 in chromium: 1.4% regression in
rasterize_and_record_micro.key_silk_cases at 364951:364953
Re: Issue 471245 in chromium: Cookie histograms are a bit wacky.
Issue 569646 in chromium: 1.4% regression in
rasterize_and_record_micro.key_silk_cases at 364951:364953
Issue 569645 in chromium: [USS] SharedModelTypeProcessor - loading initial
metadata from the service
Re: Issue 569148 in chromium: Chrome change blocks chromedriver automation
Re: Issue 569626 in chromium: Non-left mouse buttons are not sent to Chrome
in Android
Re: Issue 470482 in chromium: Remove '--enable-file-cookies'.
Re: Issue 336966 in chromium: Adding small member function to cc::LayerImpl
causes perf regression
Re: Issue 555545 in chromium: GPU process fails to launch on ANGLE trybots
with Windows/OpenGL/AMD
Re: Issue 569437 in chromium: 1 second lag when opening URLs from the
command line
Re: Issue 470482 in chromium: Remove '--enable-file-cookies'.
--
--
Automated mail from issue updates at http://crbug.com/
Subscription options: http://groups.google.com/a/chromium.org/group/chromium-bugs

---
You received this message because you are subscribed to the Google Groups "Chromium-bugs" group.
To unsubscribe from this group and stop receiving emails from it, send an email to chromium-bugs+***@chromium.org.
c***@googlecode.com
2015-12-14 22:41:28 UTC
Permalink
Your project notifications generated too many emails to send
individually. Here are the subject lines of the emails you would have
received:

Re: Issue 545572 in chromium: AFE: Create Job args broken
Re: Issue 552692 in chromium: ClangToTMac is failing isolate step after bot
reimaging
Re: Issue 545572 in chromium: AFE: Create Job args broken
Re: Issue 215923 in chromium: Add a configure buttton to give Colemak users
the choice of using the overriden meaning of the Search key instead of
Colemak's default backspace
Re: Issue 569680 in chromium: signature_validator_win.cc is unused
Re: Issue 345972 in chromium: 19 second recalcStyle on Mozilla reference
Re: Issue 453090 in chromium: CQ and PreCQ masters dying with
KeyError: 'commit'
Re: Issue 568345 in chromium: a transitiion on a box-shadow using
currentColor doesn't change the box-shadow color
Re: Issue 363609 in chromium: Backface-visibility ignored on elements where
overflow is set to scroll or auto
Re: Issue 468613 in chromium: Clip-path bug with pointer events dispatched
outside the clipped region on hover
Re: Issue 564374 in chromium: switch iOS bots to use goma where possible
Re: Issue 497295 in chromium: Add support for SharedArrayBuffer and Atomics
APIs
Re: Issue 454593 in chromium: Remove and re-add a shard results in multiple
objects error in shard_client
Re: Issue 568236 in chromium: USB Audio Skipping every second
Re: Issue 568196 in chromium: cc should apply filters to original
(unpadded) textures
Re: Issue 569680 in chromium: signature_validator_win.cc is unused
Issue 569683 in chromium: OOPIF: Race condition is possible between commit
and cancelling a pending navigation
Re: Issue 363609 in chromium: Backface-visibility ignored on elements where
overflow is set to scroll or auto
Re: Issue 568136 in chromium: Unexpected powerwash
Re: Issue 553683 in chromium: 7.9%-26.2% regression in
tab_switching.tough_image_cases at 358153:358208
Re: Issue 552421 in chromium: mathjax rendering issue - border widths
between 0 and 1 now round up
Re: Issue 569508 in chromium: vertical line "|" appears after each math
formula (both in \(\) and \[\) environment)
Re: Issue 568691 in chromium: Border width is scaled differently than
margin when zooming browser
Issue 569686 in chromium: Events should have an initialized flag, but
instead used empty event name
Re: Issue 544283 in chromium: MediaRecorder sends a dataavailable event
with no data in it when shutdown
Re: Issue 568896 in chromium: Hit testing visual overflow does not work
Issue 569688 in chromium: ScopedJavaLocalRef stored as class member.
Re: Issue 569466 in chromium: Regression: [DevTools] Tooltip is not
displayed for Full/Responsive/Device icon.
Issue 569689 in chromium: chromium_presubmit stalled for 40+ minutes
Issue 569690 in chromium: createEvent() should only work for whitelisted
event interfaces
Re: Issue 569689 in chromium: chromium_presubmit stalled for 40+ minutes
Re: Issue 569493 in chromium: Add metrics capturing recurrent browsing
behaviors
Re: Issue 569689 in chromium: chromium_presubmit stalled for 40+ minutes
Re: Issue 569510 in chromium: Regression: Added rule from ‘Device’ overlay
in DevTools doesn’t trigger on ‘Port forwarding settings’ overlay
in 'chrome://inspect/#devices' page.
Re: Issue 569688 in chromium: ScopedJavaLocalRef stored as class member.
Re: Issue 568896 in chromium: Hit testing visual overflow does not work
Re: Issue 568345 in chromium: a transitiion on a box-shadow using
currentColor doesn't change the box-shadow color
Re: Issue 568734 in chromium: Regression: Remote video not shown in
/pr-answer/ page
Re: Issue 569688 in chromium: ScopedJavaLocalRef stored as class member.
Re: Issue 476719 in chromium: Extract the generic parts of pylib/ from
chromium
Issue 569691 in chromium: Legacy bisect gives no clear error when it fails
because max_time_minutes is out of range.
Re: Issue 560620 in chromium: Expose WebGL EXT_disjoint_timer_query
extension unconditionally
Re: Issue 318434 in chromium: Composited scrolling doesn't pixel snap
correctly
Re: Issue 569688 in chromium: ScopedJavaLocalRef stored as class member.
Re: Issue 569688 in chromium: ScopedJavaLocalRef stored as class member.
Re: Issue 568734 in chromium: Regression: Remote video not shown in
/pr-answer/ page
Re: Issue 569691 in chromium: Legacy bisect gives no clear error when it
fails because max_time_minutes is out of range.
Re: Issue 425627 in chromium: Update Settings to Material Design
Re: Issue 568909 in chromium: [Regression]:Flickering of sign in frame is
seen on performing zoom operations
Re: Issue 569688 in chromium: ScopedJavaLocalRef stored as class member.
Re: Issue 569691 in chromium: Legacy bisect gives no clear error when it
fails because max_time_minutes is out of range.
Re: Issue 563537 in chromium: 6.7% regression in
page_cycler.intl_es_fr_pt-BR at 361396:361462
Re: Issue 564223 in chromium: 5-7% regression in PartitionAlloc memory
usage in range 361472 - 361474
Re: Issue 564374 in chromium: switch iOS bots to use goma where possible
Issue 569692 in chromium: createDocument() should only create XMLDocument
with contentType "application/xml"
Re: Issue 568577 in chromium: chromium.android is all mixed up
Re: Issue 569688 in chromium: ScopedJavaLocalRef stored as class member.
Re: Issue 557934 in chromium: When playing <audio> where src is ogg,
currentTime stops incrementing at duration (which is wrong) as audio
continues playing
Re: Issue 555569 in chromium: chrome.app.window API needs way of creating
windows fullscreen on a specific monitor
Issue 569693 in chromium: UI elements in tabs not vertically centered when
Material design is enabled
Re: Issue 569693 in chromium: UI elements in tabs not vertically centered
when Material design is enabled
Re: Issue 569021 in chromium: 7.3% regression in
smoothness.gpu_rasterization.tough_path_rendering_cases at 364427:364497
Re: Issue 569689 in chromium: chromium_presubmit stalled for 60+ minutes
Re: Issue 566788 in chromium: no sound from youtube in chrome
Re: Issue 568786 in chromium: Remove multiple client desktop sync
integration tests
Issue 569694 in chromium: Make unbound InterfacePtr<>/Binding<> not tied to
any thread.
Re: Issue 345972 in chromium: dirtyLinesFromChangedChild is n^2 during
attach
Re: Issue 432882 in chromium: WebGL Regression with precision highp float
Issue 569695 in chromium: Missing DrMemory stack traces
Re: Issue 569689 in chromium: chromium_presubmit stalled for 60+ minutes
Re: Issue 345972 in chromium: dirtyLinesFromChangedChild is n^2 during
attach
Re: Issue 568367 in chromium: Add version check when process alternative
services advertised by server
Issue 569696 in chromium: Tapping New Tab on the Pixel C doesn't set focus
on the Omnibar
Re: Issue 567755 in chromium: [Autofill] Modernize autofill popup design
Re: Issue 569635 in chromium: scheduler crashes during push to prod
Re: Issue 568883 in chromium: arm64 GN Android build doesn't work
Re: Issue 91230 in chromium: Multi-Profiles: Add support for custom avatar
Re: Issue 569440 in chromium: (Mac?) With Click-to-Play PDF viewer, can't
print from Google Slides
Re: Issue 569694 in chromium: Make unbound InterfacePtr<>/Binding<> not
tied to any thread.
Re: Issue 104861 in chromium: Several Flash tabs crashes chrome.dll and
flash plugin
Re: Issue 544228 in chromium: update our encoding tables per recent spec
changes (after review)
Re: Issue 423444 in chromium: Use WKWebView on iOS 8+
Re: Issue 534541 in chromium: run_benchmark always reinstalls local APK,
potentially multiple times for a single session
Re: Issue 371847 in chromium: VS 2013 produce corrupted pdb files
Re: Issue 569695 in chromium: Missing DrMemory stack traces
Re: Issue 569666 in chromium: 1.5% regression in
rasterize_and_record_micro.top_25_smooth at 364949:364950
Re: Issue 464516 in chromium: Create an isolate file for the Android test
runner
Re: Issue 564948 in chromium: 11.2% regression in blink_perf.css at
361904:362399
Re: Issue 563793 in chromium: Figure out how to clang-format Blink
Re: Issue 569635 in chromium: scheduler crashes during push to prod
Re: Issue 539264 in chromium: Regression: Select box with custom mouse
cursor can trigger cursor change on each layout
Re: Issue 569344 in chromium: LibFuzzer build failure
Re: Issue 568503 in chromium: Regression: [DevTools] Unnecessary ‘console’
option is present in drawer tabs menu list.
Re: Issue 548908 in chromium: Add commit time information to revision state
objects.
Re: Issue 569487 in chromium: VMTest failure in security_ASLR
Re: Issue 564179 in chromium: When fetching the list of intervening
revisions, bisect fetches only ~100 commits.
Re: Issue 569148 in chromium: Chrome change blocks chromedriver automation
Re: Issue 569689 in chromium: chromium_presubmit stalled for 60+ minutes
Re: Issue 485163 in chromium: Bisect should ensure that profile state is
reset before each run.
Re: Issue 557934 in chromium: When playing <audio> where src is ogg,
currentTime stops incrementing at duration (which is wrong) as audio
continues playing
Issue 569697 in chromium: Support custom libfuzzer launcher on ClusterFuzz.
Re: Issue 557906 in chromium: Google profile pic doesnt sync for the first
login
--
--
Automated mail from issue updates at http://crbug.com/
Subscription options: http://groups.google.com/a/chromium.org/group/chromium-bugs

---
You received this message because you are subscribed to the Google Groups "Chromium-bugs" group.
To unsubscribe from this group and stop receiving emails from it, send an email to chromium-bugs+***@chromium.org.
c***@googlecode.com
2015-12-15 23:23:31 UTC
Permalink
Your project notifications generated too many emails to send
individually. Here are the subject lines of the emails you would have
received:

Re: Issue 567439 in chromium: Flake/failures in LayerTreeHostCopyRequest
tests on Dr. Memory bots
Re: Issue 568862 in chromium: Bottom of shelf doesn't align with bottom of
screen
Re: Issue 563726 in chromium: file input fires onchange event when the user
hits cancel after already selecting a file
Re: Issue 549803 in chromium: TouchView + docked mode can get you stuck in
a state with no input devices
Re: Issue 565086 in chromium: 14.7% regression in power.typical_10_mobile
at 361903:362468
Re: Issue 549415 in chromium: Can't enable "OK Google" on 2015 pixel
Re: Issue 537017 in chromium: My machine freezes when playing games on
Facebook. The mouse will move; but I cannot get to any tabs or close
without a F3 and power button. Yes I can recreate this whenever I try to
play a game. I am using a HP Pavilion 14 Chromebook.
Issue 570085 in chromium: [USS] Datatype error and Unrecoverable Error
handling
Re: Issue 570026 in chromium: Password leakage from password manager
through bookmarklet (self-xss)
Re: Issue 569950 in chromium: 13.1%-233.2% regression in
smoothness.gpu_rasterization.tough_filters_cases at 365047:365110
Re: Issue 551695 in chromium: Update sign-in promo in extension install
bubble
Issue 570086 in chromium: SSL_VERSION_OR_CIPHER_MISMATCH count went up from
2k to 18k in M48 Beta channel.
Re: Issue 569258 in chromium: Use after free of SaveFileCreateInfo in
SaveFileManager::OnStartSave
Re: Issue 442790 in chromium: Implement MTD UUID support to clean up kernel
command-line params
Re: Issue 541599 in chromium: One instance of no DHCP address in reboot
tests
Re: Issue 443432 in chromium: VIM Color Scheme Test is loading slow and
hogging memory
Re: Issue 531655 in chromium: [UI][Network] Chrome://settings page
sometimes does not reflect proper VPN status, after disconnecting VPN.
Re: Issue 564878 in chromium: mix-blend-mode - massive frame rate drop in
v47 that wasn't in v46
Re: Issue 569347 in chromium: DomDistillerJsTest.RunJsTests started failing
on tot android/asan bot
Re: Issue 239854 in chromium: RTL:Seeing Arabic suggestion for English word
Issue 570087 in chromium: [USS] Verify Sync Connect / Disconnect logic in
SharedModelTypeProcessor
Issue 570088 in chromium: Autotest strips off -cheets suffix when detecting
board.
Re: Issue 512125 in chromium: DataReductionProxyIOData posting (potentially
frequent) tasks when data reduction is disabled
Re: Issue 429600 in chromium: Memory usage constantly growing by WebRTC and
not clearing up?
Re: Issue 77819 in chromium: Typed url sync model associator / change
processor needs to be easily unit-testable, and existing unit tests
converted
Re: Issue 267174 in chromium: Giving blank page when make NTP in idle stage
for some time
Re: Issue 570049 in chromium: Fuzz the Chromium part of Web Bluetooth
Re: Issue 472221 in chromium: "Internal DNS client enabled" is a problem
with VPN or local cache servers
Re: Issue 269694 in chromium: SERP :Google Brand logo is missing and
clicking on that google logo's place it takes user to NTP page
Re: Issue 569777 in chromium: Android Chromoting: Cardboard mode should ask
for needed permissions
Re: Issue 569964 in chromium: ipc_fuzzer/message_lib/all_messages.cc
doesn't build on asan/win bots after
https://codereview.chromium.org/1438603002
Re: Issue 462791 in chromium: NaCl browser_tests failing on Linux GN
Re: Issue 512900 in chromium: Support ppapi extensions test in the GN build
Re: Issue 569764 in chromium: [Touch] Orientation values outside of [0,
360) cause touch injection to fail on Windows
Re: Issue 567544 in chromium: [Chrome][v47] Unavailable to choose a
bookmark when adding "Bookmark 1x1" of Chrome widget
Re: Issue 410696 in chromium: Recent update to Chrome v37 doesn't respect
Windows scaling at 125%
Re: Issue 570076 in chromium: bluetooth: Implement
BluetoothDeviceAndroid::Disconnect
Re: Issue 569100 in chromium: [Cyan]:
audio_AudioBasicBluetoothPlaybackRecord fails on R49
Re: Issue 554551 in chromium: Sync on ChromeOS stays in deferred state when
there are invalid credentials
Re: Issue 568841 in chromium: Shared device screen is not displaying mouse
cursor on desktop user screen
Re: Issue 569100 in chromium: [Cyan]:
audio_AudioBasicBluetoothPlaybackRecord fails on R49
Issue 570090 in chromium: "without patch" not working on chromecast trybot
Re: Issue 531655 in chromium: [UI][Network] Chrome://settings page
sometimes does not reflect proper VPN status, after disconnecting VPN.
Re: Issue 568678 in chromium: A bunch of layout test failures on XP
Issue 570091 in chromium: need a way to specify hooks and deps
conditionally that doesn't depend on GYP_DEFINES
Re: Issue 569732 in chromium: CFI: perf compile slaves are slower than
other GCE slaves
Issue 570092 in chromium: Remove constant definitions from header files in
page_load_metrics
Re: Issue 570032 in chromium: VideoRendererAlgorithmTest.CadenceBasedTest
is flaky
Re: Issue 569015 in chromium: VideoRendererAlgorithmTest.CadenceBasedTest
flaky on win7
Re: Issue 569975 in chromium: GYP_CHROMIUM_NO_ACTION should be default on
platforms where we switched to GN
Re: Issue 569964 in chromium: ipc_fuzzer/message_lib/all_messages.cc
doesn't build on asan/win bots after
https://codereview.chromium.org/1438603002
Re: Issue 570026 in chromium: Password leakage from password manager
through bookmarklet (self-xss)
Re: Issue 570068 in chromium: downstream tcmalloc deadlock fork fix
Re: Issue 549349 in chromium: Create "Quirks" Client to retrieve and manage
icc (and other display calibration) data from a server
Re: Issue 557344 in chromium: 1518.7% regression in sizes at 359903:359922
Re: Issue 531655 in chromium: [UI][Network] Chrome://settings page
sometimes does not reflect proper VPN status, after disconnecting VPN.
Re: Issue 567791 in chromium: Create an enterprise policy to disable pings
to the quirks server.
Re: Issue 547356 in chromium: Web pages render incorrectly (randomly
irregular black blocks and misplacement)
Re: Issue 459705 in chromium: GN: Make iOS build work
Re: Issue 569141 in chromium: Link affinity for long press is too strong
Re: Issue 531655 in chromium: [UI][Network] Chrome://settings page
sometimes does not reflect proper VPN status, after disconnecting VPN.
Re: Issue 569964 in chromium: ipc_fuzzer/message_lib/all_messages.cc
doesn't build on asan/win bots after
https://codereview.chromium.org/1438603002
Re: Issue 569106 in chromium: Desktop scale factor is not applied to cursor
Re: Issue 531655 in chromium: [UI][Network] Chrome://settings page
sometimes does not reflect proper VPN status, after disconnecting VPN.
Re: Issue 569964 in chromium: ipc_fuzzer/message_lib/all_messages.cc
doesn't build on asan/win bots after
https://codereview.chromium.org/1438603002
Re: Issue 569418 in chromium: Cmd-Shift-F no longer works to leave full
screen
Re: Issue 55920 in chromium: PDF Viewer: Goto Page, Jump to page, Go to
page feature request
Re: Issue 554551 in chromium: Sync on ChromeOS stays in deferred state when
there are invalid credentials
Re: Issue 569723 in chromium: Support ordered test execution via filtering
in test_runner.py
Re: Issue 535758 in chromium: BoringSSL's AEAD interface allows
non-standard nonce lengths for AES-GCM
Re: Issue 531655 in chromium: [UI][Network] Chrome://settings page
sometimes does not reflect proper VPN status, after disconnecting VPN.
Re: Issue 531655 in chromium: [UI][Network] Chrome://settings page
sometimes does not reflect proper VPN status, after disconnecting VPN.
Re: Issue 567371 in chromium: Icon for USB-C device notification
Re: Issue 565579 in chromium: Develop tests to cover BookmarkModel changes
that could impact offline pages
Re: Issue 563092 in chromium: Wrong default microphone (audio jack vs. USB
camera)
Re: Issue 564878 in chromium: mix-blend-mode - massive frame rate drop in
v47 that wasn't in v46
Re: Issue 531655 in chromium: [UI][Network] Chrome://settings page
sometimes does not reflect proper VPN status, after disconnecting VPN.
Re: Issue 410088 in chromium: Need to detect bot out of disk space and fix
it in an automated way
Re: Issue 308233 in chromium: Implement auto-reload and option for loading
stale data in network error page.
Re: Issue 568972 in chromium: Theme colour on HTTPS sites with merged
tabs/apps off
Re: Issue 569789 in chromium: Make all WTF containers move aware
Re: Issue 568233 in chromium: Drawing glitches on very tall scrolled
elements
Re: Issue 547356 in chromium: Web pages render incorrectly (randomly
irregular black blocks and misplacement)
Re: Issue 569964 in chromium: ipc_fuzzer/message_lib/all_messages.cc
doesn't build on asan/win bots after
https://codereview.chromium.org/1438603002
Issue 570094 in chromium: mac/ios clang++/libc++ rejects valid std::tuple
usage
Re: Issue 569970 in chromium: Update swarming client in cbuildbot.
Re: Issue 569144 in chromium: Omnibox word swiping issue
Re: Issue 564172 in chromium: Android Nexus 6 Perf Bisect Bot fails in
device_status_check due to offline device
Re: Issue 557344 in chromium: 1518.7% regression in sizes at 359903:359922
Re: Issue 568209 in chromium: Selecting text causes it to disappear
Issue 570095 in chromium: Chrome produces a Javascript error when there are
two fieldset elements one the same page
Re: Issue 569760 in chromium: <base> element dynamically added, a test was
failed
Re: Issue 569285 in chromium: Please remove the "won't run without Google
play services" pop up from chromium
Re: Issue 477623 in chromium: Security: With Chrome 42 Elliptic curves
secp512r1 missing
Re: Issue 551695 in chromium: Update sign-in promo in extension install
bubble
Re: Issue 570095 in chromium: Chrome produces a Javascript error when there
are two fieldset elements one the same page
Re: Issue 536669 in chromium: We should run mojo js bindings tests
Re: Issue 570036 in chromium: Chromium crashed in core_audio_util_win.cc
Re: Issue 570008 in chromium: Google API Keys are missing error message
when opening web browser.
Re: Issue 568485 in chromium: [Regression]: Spin effect is not seen from
second click on chrome icon in chrome://help page
Re: Issue 569966 in chromium: "><h1>Hacked By Shin0bi H4x0r -XSSED</H1>
Re: Issue 570095 in chromium: Chrome produces a Javascript error when there
are two fieldset elements one the same page
--
--
Automated mail from issue updates at http://crbug.com/
Subscription options: http://groups.google.com/a/chromium.org/group/chromium-bugs

---
You received this message because you are subscribed to the Google Groups "Chromium-bugs" group.
To unsubscribe from this group and stop receiving emails from it, send an email to chromium-bugs+***@chromium.org.
c***@googlecode.com
2015-12-16 00:19:06 UTC
Permalink
Your project notifications generated too many emails to send
individually. Here are the subject lines of the emails you would have
received:

Issue 570108 in chromium: Offer not saving password just this one time for
subpages etc.
Re: Issue 415609 in chromium: WebGL conformance_glsl_functions tests fail
intermittently
Re: Issue 273384 in chromium: Devtools does not auto-reload generated CSS
Re: Issue 543693 in chromium: Check failed:
recursive_data->num_unclipped_descendants >= num_clip_children in
cc::PreCalculateMetaInformationInternal
Re: Issue 543661 in chromium: Check failed:
CanApplyBlendModeUsingBlendFunc(blend_mode) in
cc::GLRenderer::ApplyBlendModeUsingBlendFunc
Re: Issue 567314 in chromium: Disable interactive mode of
chrome.identity.getAuthToken for kiosk apps
Re: Issue 539907 in chromium: Tiling OOOM lead to unlimited recursive
calling and stack exhaustion
Re: Issue 569285 in chromium: Please remove the "won't run without Google
play services" pop up from chromium
Re: Issue 568972 in chromium: Theme colour on HTTPS sites with merged
tabs/apps off
Re: Issue 564172 in chromium: Android Nexus 6 Perf Bisect Bot fails in
device_status_check due to offline device
Re: Issue 538682 in chromium: Devirtualize display item list in cc
Re: Issue 535085 in chromium: debugger instruction will be resumed by
chrome.windows.create API call
Re: Issue 570105 in chromium: AlternativeService - change the expiration
time from 1 day to 365 days
Re: Issue 537172 in chromium:
virtual/spv2/paint/invalidation/spv2/background-image-paint-invalidation.html
is failing on Mac 10.6 and XP bots
Re: Issue 537172 in chromium:
virtual/spv2/paint/invalidation/spv2/background-image-paint-invalidation.html
is failing on Mac 10.6 and XP bots
Re: Issue 569816 in chromium: RegistryEntry class should take WOW64
parameters
Re: Issue 537191 in chromium: Chrome crashes Cinnamon unless I turn of GPU
support
Re: Issue 569806 in chromium: Google Play Books Fails to Load
Re: Issue 568041 in chromium: Perf bisect bot not bypassing no-repro check
Re: Issue 532950 in chromium: chrome://accessibiliy global mode : on ->
ckeditor not working
Re: Issue 564878 in chromium: mix-blend-mode - massive frame rate drop in
v47 that wasn't in v46
Re: Issue 568972 in chromium: Theme colour on HTTPS sites with merged
tabs/apps off
Re: Issue 477623 in chromium: Security: With Chrome 42 Elliptic curves
secp512r1 missing
Re: Issue 528791 in chromium: Chromium does not respect
the "--enable-lcd-text" argument when "--force-device-scale-factor=2" is
also passed
Re: Issue 570105 in chromium: AlternativeService - change the expiration
time from 1 day to 30 days
Re: Issue 570094 in chromium: mac/ios clang++/libc++ rejects valid
std::tuple usage
Re: Issue 528645 in chromium: Chrome font issue
Re: Issue 570088 in chromium: Autotest strips off -cheets suffix when
detecting board.
Re: Issue 561803 in chromium: Enable the new Mojo EDK by default for Chrome
Re: Issue 570094 in chromium: mac/ios clang++/libc++ rejects valid
std::tuple usage
Re: Issue 570088 in chromium: Autotest strips off -cheets suffix when
detecting board.
Re: Issue 463228 in chromium: autoserv: provision option does not take a
value
Re: Issue 522970 in chromium: Breakpad fails to produce a valid
mini/microdump if the crashing process has run out of memory
Re: Issue 570094 in chromium: mac/ios clang++/libc++ rejects valid
std::tuple usage
Re: Issue 515087 in chromium: The saved page mhtml content is not proper
Re: Issue 563893 in chromium: Minimzed window flashes if show() is called
for it
Re: Issue 555604 in chromium: chrome://net-internals#bandwidth should log
result of client config
Issue 570110 in chromium: Report the color space of MSE video
Re: Issue 570104 in chromium: OSX: Chrome Remote Desktop window does not
respond to common fullscreen shortcuts
Re: Issue 568624 in chromium: UI hangs when going fullscreen [win10,
optimus]
Re: Issue 512351 in chromium: Broken layout on http://m.cyber.incheon.kr
Re: Issue 512543 in chromium: Typing 'c' in the omnibar crashes chromium OS
Re: Issue 570094 in chromium: mac/ios clang++/libc++ rejects valid
std::tuple usage
Re: Issue 463113 in chromium: Push API gives confusing error message for
offline subscribe
Re: Issue 510097 in chromium: issues.insert test
Re: Issue 569979 in chromium: Paygen fails on all canary builders
Re: Issue 510091 in chromium: issues.insert test
Re: Issue 570110 in chromium: Report the color space of MSE video
Re: Issue 505026 in chromium: Remove gl texture copies in
SkCanvasVideoRenderer
Re: Issue 500584 in chromium: PDF looks terrible, but fine in Firefox
Re: Issue 567157 in chromium: git freeze not working (Nothing to freeze).
Re: Issue 570088 in chromium: Autotest strips off -cheets suffix when
detecting board.
Re: Issue 554987 in chromium: [c++11 library] Come up with plan for
base::Tuple vs std::tuple
Re: Issue 554987 in chromium: [c++11 library] Come up with plan for
base::Tuple vs std::tuple
Re: Issue 570074 in chromium: Cleanup the pause tests in content browser
test
Re: Issue 410097 in chromium: Subsequence painting optimization for
slimming paint phase 1 and 2
Re: Issue 568841 in chromium: Shared device screen is not displaying mouse
cursor on desktop user screen
Re: Issue 565086 in chromium: 14.7% regression in power.typical_10_mobile
at 361903:362468
Re: Issue 569083 in chromium: Zooming does not re-align the text, making it
impossible to read news articles
Re: Issue 551635 in chromium: Touch highlighting on mixed directional text
is confusing and broken
Re: Issue 481122 in chromium: Allow the page to render before <link> tags
in body
Re: Issue 543624 in chromium: Check failed: IsStringASCII(ascii) in
base::ASCIIToUTF16
Re: Issue 541935 in chromium: PNaCL SDK workaround for Python 3
Re: Issue 570082 in chromium: Youtube audio has static/pops in it.
Re: Issue 541851 in chromium: what we must do? (xp users and java applets)
Re: Issue 569332 in chromium: Dealy in deleting text in content editable
Issue 570112 in chromium: Clean up lifecycle code in WebViewImpl
Re: Issue 550487 in chromium: Chromium 46 - WebGL shader fails to initialize
Re: Issue 570100 in chromium: A TPM change around selftest on resume has
been partially lost
Re: Issue 570088 in chromium: Autotest strips off -cheets suffix when
detecting board.
Re: Issue 569083 in chromium: Zooming does not re-align the text, making it
impossible to read news articles
Re: Issue 565132 in chromium: Modal window drop-down menus are not working
in AngularJS 1.2.14 or earlier
Re: Issue 569412 in chromium: Closes app when closing last tab
Re: Issue 570110 in chromium: Report the color space of MSE video
Re: Issue 559352 in chromium: guado at chromeos4-row3-rack8-host1 trying to
enroll
Re: Issue 546068 in chromium: Chrome EndToEnd tests failure : Timed out
going through login screen
Re: Issue 569332 in chromium: Delay in deleting text in content editable
Re: Issue 550487 in chromium: Chromium 46 - WebGL shader fails to initialize
Re: Issue 569347 in chromium: DomDistillerJsTest.RunJsTests started failing
on tot android/asan bot
Re: Issue 559278 in chromium: Trigger try-jobs through Buildbucket to
identify culprit by recompile
Re: Issue 273384 in chromium: Devtools does not auto-reload generated CSS
Re: Issue 570094 in chromium: mac/ios clang++/libc++ rejects valid
std::tuple usage
Re: Issue 455749 in chromium: "your profile could not be opened correctly"
after latest update
Re: Issue 555147 in chromium:
chrome.vpnProvider.onPlatformMessage("disconnected") not fired when sign
out while VPN is connected
Re: Issue 565540 in chromium: Self-signed certificate not being accepted.
Returns err_insecure_response
Re: Issue 568972 in chromium: Theme colour on HTTPS sites with merged
tabs/apps off
Issue 570117 in chromium: High CPU with background tab (no Javascript
running)
Issue 570118 in chromium: non identical password entries shown as identical
to the user
Re: Issue 554289 in chromium: [c++11 library] Remove ScopedVector
Re: Issue 570047 in chromium: Mojo compile is flaky?
Re: Issue 569296 in chromium: Theme-color not working for webapps
when "merged tabs" feature is turned off
Re: Issue 568972 in chromium: Theme colour on HTTPS sites with merged
tabs/apps off
Issue 570119 in chromium: Tab crashes after pasting some CSS into a textarea
Re: Issue 564172 in chromium: Android Nexus 6 Perf Bisect Bot fails in
device_status_check due to offline device
Re: Issue 531701 in chromium: cobalt.balglobal.com cert failure on
46.0.2490.21 (Official Build) beta (64-bit)
Issue 570121 in chromium: bluetooth: Implement the UUID blacklist
Re: Issue 537697 in chromium: Disconnect doesn't really disconnect
Re: Issue 565736 in chromium: Ship Web Bluetooth to experimental framework
users
Re: Issue 569730 in chromium: bluetooth: Implement
BluetoothRemoteGATTServer.disconnect
Re: Issue 273384 in chromium: Devtools does not auto-reload generated CSS
Re: Issue 570049 in chromium: Fuzz the Chromium part of Web Bluetooth
Re: Issue 569423 in chromium: Address bar autoloader not working
--
--
Automated mail from issue updates at http://crbug.com/
Subscription options: http://groups.google.com/a/chromium.org/group/chromium-bugs

---
You received this message because you are subscribed to the Google Groups "Chromium-bugs" group.
To unsubscribe from this group and stop receiving emails from it, send an email to chromium-bugs+***@chromium.org.
c***@googlecode.com
2015-12-17 22:33:01 UTC
Permalink
Your project notifications generated too many emails to send
individually. Here are the subject lines of the emails you would have
received:

Issue 570805 in chromium: 3.5% regression in
page_cycler_site_isolation.basic_oopif at 365486:365488
3 issues changed in chromium
Re: Issue 522853 in chromium: Linux: Chrome/Chromium SIGBUS/Aw, Snap! on
small /dev/shm
Re: Issue 570343 in chromium: Typing Japanese in gmail compose window is
very slow on Mac
Re: Issue 570784 in chromium: gnubby nano USB security key doesn't work
on "samus" (pixel 2) after power-on until gnubby is removed and re-inserted
once
Re: Issue 364374 in chromium: Some official time zones are not parsed
correctly.
Issue 570807 in chromium: "chrome_junit_tests (with patch)" is flaky
Re: Issue 566588 in chromium: New fullscreen oddly stretches video
Re: Issue 570666 in chromium: Incorrent coordinate offsetX, offsetY in
canvas.
Re: Issue 568602 in chromium: WebView crash on startup in policy code, in
apps that have a nondefault main thread
Re: Issue 561190 in chromium: log spam in perf tests "CPU time_in_state
file not found"
Re: Issue 445035 in chromium: The dropdown blanks out on clicking the (-/+)
icon in www.shine.com.
Re: Issue 569572 in chromium: Typing Japanese in Google Inbox takes up
100%+ CPU
Re: Issue 570160 in chromium: Offline Google Chrome installer doesn't
install most recent version
Issue 570809 in chromium: smoothness.gpu_rasterization.top_25_smooth
failing on Android One due to renderer crash
Re: Issue 570587 in chromium: Audio Static/Crackle
Re: Issue 565555 in chromium: Clean up is_android section of BUILD.gn
Re: Issue 566588 in chromium: New fullscreen oddly stretches video
Re: Issue 570069 in chromium: [Media Router UI] Clearing the issue on the
UI messes it up
Re: Issue 570781 in chromium: cc_perftests timing out on Nexus 9 around
364191-364221
Re: Issue 446448 in chromium: Permission pop up overlay seen chopped from
L.H.S in "www.rbi.org.in"
Issue 570810 in chromium: Get tests running on Brillo continuous builder.
Re: Issue 420251 in chromium: Bootstrap styled buttons don't deselect
Re: Issue 561470 in chromium: Implement Cast ReceiverAction for the
Presentation API Cast MRP on Android
Re: Issue 570388 in chromium: Users are reporting numlock not working
Re: Issue 570152 in chromium: move blink failures into the chromium tab on
sheriff-o-matic
Re: Issue 569227 in chromium: "context_lost on ATI GPU on Windows (with
patch) on Windows" is flaky
Re: Issue 570796 in chromium: Android Nexus7v2 Perf (1) offline
Re: Issue 518875 in chromium: Copy-to-clipboard in Image Downloads
Re: Issue 570477 in chromium: thread_times.polymer failures on Android
Nexus7v2 Perf - renderer crash in paper-shadow page
Re: Issue 570809 in chromium: smoothness.gpu_rasterization.top_25_smooth
failing on Android One due to renderer crash
Re: Issue 569053 in chromium: Large unused media::StreamParserBuffer at
youtube
Re: Issue 562706 in chromium: Browser does not seem to render a css class
Re: Issue 570810 in chromium: Get tests running on Brillo continuous
builder.
Re: Issue 561470 in chromium: Implement Cast ReceiverAction for the
Presentation API Cast MRP on Android
Re: Issue 570809 in chromium: smoothness.gpu_rasterization.top_25_smooth
failing on Android One due to renderer crash
Re: Issue 570548 in chromium: Make WebView CTS bot faster
Re: Issue 569053 in chromium: Large unused media::StreamParserBuffer at
youtube
Re: Issue 570768 in chromium: chrome_junit_tests failing on all Android try
runs which run it
Re: Issue 319405 in chromium: No feedback when cookies aren't sent due to
mixed http and https content
Re: Issue 555703 in chromium: Fix MSE MP4 video-related config-change
layout test timeouts (Spitzer)
Re: Issue 570584 in chromium: Choppy video playback
Re: Issue 570587 in chromium: Audio Static/Crackle
Re: Issue 570622 in chromium: Synchronous xmlhttprequest returns an empty
response when cache is hit after etag verification
Re: Issue 540867 in chromium: Download shelf consumes a bit of power while
downloading
Re: Issue 358385 in chromium: Orbitz final purchase page throws JS errors
Re: Issue 471525 in chromium: Heap-buffer-overflow in url::ParsePort
Re: Issue 568602 in chromium: WebView crash on startup in policy code, in
apps that have a nondefault main thread
Re: Issue 136305 in chromium: Incorrect naming of .tar.gz downloaded files
Re: Issue 570238 in chromium: Regression: Extension icon in it's installed
bubble's sync promo is not shown properly for few extensions.
Re: Issue 452135 in chromium: ASSERTION FAILED: !m_renderGrid.gridIsDirty()
in blink::GridPainter::paintChildren
Re: Issue 570242 in chromium: MemoryInfra: base_unittest OverflowDeathTest
failing
Re: Issue 144832 in chromium: It is time to unlink the "Backspace" ->
Browser Back shortcut.
Re: Issue 513016 in chromium: Implement IsSuitableForGpuRasterization for
display lists
Re: Issue 459938 in chromium: DenormalDisable.h fails to compile as it uses
some arm NEON/VFP specific assemble instruction when HAVE_DENORMAL is 1
(WebKit/Blink)
Issue 570812 in chromium: Regression (r175480) Icon fonts using hinting
blurred at odd text box offsets
Re: Issue 438618 in chromium: Heap-buffer-overflow in
blink::Character::expansionOpportunityCount
Re: Issue 570548 in chromium: Make WebView CTS bot faster
Re: Issue 150712 in chromium: Chrome/Mac OS panel scroll issue
Re: Issue 401463 in chromium: Bad-cast to blink::RenderBox from
blink::RenderText;RenderBox.h:769:1
Re: Issue 570069 in chromium: [Media Router UI] Clearing the issue on the
UI messes it up
Re: Issue 561470 in chromium: Implement Cast ReceiverAction for the
Presentation API Cast MRP on Android
Re: Issue 489543 in chromium: Canvas clearRect() / fillRect() bloats memory
usage.
Re: Issue 399321 in chromium: Heap-use-after-free in
blink::constructBidiRunsForLine
Re: Issue 570812 in chromium: Regression (r175480) Icon fonts using hinting
blurred at odd text box offsets
Re: Issue 383777 in chromium: ASSERTION FAILED: positionOffset <=
node->length()
Re: Issue 378469 in chromium: Heap-use-after-free in
WebCore::GraphicsContext::drawImage
Re: Issue 570751 in chromium: Unable to open Google/express page
Re: Issue 376433 in chromium: ASSERTION FAILED: obj->isRenderInline() ||
obj == this, UNKNOWN in WebCore::RenderBlockFlow::createLineBoxes
Re: Issue 492684 in chromium: Replace DeterministicSocketData with
SequencedSocketData
Re: Issue 514473 in chromium: Investigate why CTS test
WebViewSslTest#testSslErrorProceedResponseNotReusedForDifferentHost is flaky
Re: Issue 566588 in chromium: New fullscreen oddly stretches video
Re: Issue 422000 in chromium: Chrome 38 busts "vsync" and causes jerky
<canvas> requestAnimationFrame() animations
Re: Issue 570774 in chromium: Time to time browser will have a background
rectangular image behind "View site information" button
Issue 570813 in chromium: sys-block/open-iscsi package imported from
upstream installs binaries to the wrong path
Re: Issue 570677 in chromium: images without cache-allow-header are cached
when using lazy loading.
Re: Issue 568194 in chromium: [mini_installer] Debug component build
resource now over 1Gb. mini_installer.exe silently fails.
Re: Issue 569055 in chromium: Remove support for URLRequests having NULL
delegates.
Issue 570814 in chromium: Buffered keyboard input is consumed by coreboot
on reboot
Re: Issue 570068 in chromium: Locking on one thread during a call to fork
from another, may induce a deadlock
Re: Issue 570807 in chromium: "chrome_junit_tests (with patch)" is flaky
Re: Issue 557422 in chromium: Replace Pass() with std::move() where possible
Re: Issue 561470 in chromium: Implement Cast ReceiverAction for the
Presentation API Cast MRP on Android
Re: Issue 422000 in chromium: Chrome 38 busts "vsync" and causes jerky
<canvas> requestAnimationFrame() animations
Re: Issue 570152 in chromium: move blink failures into the chromium tab on
sheriff-o-matic
Re: Issue 508794 in chromium: uninit read from
content.dll!content::AccessibilityTreeFormatter::ToString
Re: Issue 570030 in chromium: Make sure display items always have a valid
display item client.
Re: Issue 569053 in chromium: Large unused media::StreamParserBuffer at
youtube
Re: Issue 506977 in chromium: Windows stylus "flicks" support can interfere
with pen use in Chrome
Re: Issue 506977 in chromium: Windows stylus "flicks" support can interfere
with pen use in Chrome
Re: Issue 541705 in chromium: Rendering Process uses ~160mb due to
SourceBufferStream::GarbageCollectIfNeeded running when mem usage greater
than kSourceBufferVideoMemoryLimit=157mb
Re: Issue 561470 in chromium: Implement Cast ReceiverAction for the
Presentation API Cast MRP on Android
Re: Issue 568602 in chromium: WebView crash on startup in policy code, in
apps that have a nondefault main thread
Re: Issue 570735 in chromium: Request to create new public repo
chromiumos/platform/bmpblk
Issue 570817 in chromium: sys-block/open-iscsi package imported from
upstream does not have support for LFS on beaglebone_servo
Re: Issue 570631 in chromium: Selected element overlaying scrollbar
Re: Issue 569890 in chromium: skp files sometimes truncated prematurely
Re: Issue 561893 in chromium: Unwanted scroll bar is seen in Files.app add
new services window
Re: Issue 568602 in chromium: WebView crash on startup in policy code, in
apps that have a nondefault main thread
Re: Issue 569643 in chromium: ASSERTION FAILED: m_invalidations.isEmpty()
in PaintController::commitNewDisplayItems()
Re: Issue 568883 in chromium: arm64 GN Android build doesn't work
Re: Issue 570706 in chromium: Investigate trybot failures of
https://codereview.chromium.org/1530483002/#ps40001
--
--
Automated mail from issue updates at http://crbug.com/
Subscription options: http://groups.google.com/a/chromium.org/group/chromium-bugs

---
You received this message because you are subscribed to the Google Groups "Chromium-bugs" group.
To unsubscribe from this group and stop receiving emails from it, send an email to chromium-bugs+***@chromium.org.
c***@googlecode.com
2015-12-18 21:43:25 UTC
Permalink
Your project notifications generated too many emails to send
individually. Here are the subject lines of the emails you would have
received:

Re: Issue 427912 in chromium: bmpblk package should be moved to open
Re: Issue 530803 in chromium: 4.2% regression in performance_browser_tests
at 347678:347720
Re: Issue 527803 in chromium: 19% regression in
thread_times.tough_scrolling_cases at 346876:346891
Re: Issue 314268 in chromium: Flash/Stage3D performance is substantially
worse in Pepper using ATI GPUs
Re: Issue 568386 in chromium: HttpServerProperties - MRU list is not
maintained across browser startups
Re: Issue 571092 in chromium: Null pointer crash in
RenderWidgetHostViewChildFrame::RouteMouseEvent
Re: Issue 314268 in chromium: Flash/Stage3D performance is substantially
worse in Pepper using ATI GPUs
Issue 571120 in chromium: POST request using form doesn't work from new ui
options page
Re: Issue 569062 in chromium: Do not use assets to paint Ash window control
hover/pressed states
Re: Issue 571106 in chromium: build_image: summary line always says
`./image_to_vm.sh` regardless of current dir
Re: Issue 450631 in chromium: Mouse hover isn't cleared when Chrome is
covered by another window
Re: Issue 570829 in chromium: Store Firmware builds in a better location.
Re: Issue 352106 in chromium: Page doesn't get mouseleave event when
switching to another tab while mouse is down.
Re: Issue 570366 in chromium: Old Google/Chrome icons missing but can still
be selected
Re: Issue 563504 in chromium: 1.5% regression in smoothness.polymer at
361517:361554
Re: Issue 571077 in chromium: Some pages temporarily render as if at very
low resolution (appears pixelated, zoomed in)
Re: Issue 570268 in chromium: createObjectURL memory leak
Re: Issue 571116 in chromium: Wrong state in
MediaCodecPlayer::OnPermissionDecided.
Issue 571123 in chromium: 32.5%-39.6% regression in webrtc_perf_tests at
11072:11072
Re: Issue 571123 in chromium: 32.5%-39.6% regression in webrtc_perf_tests
at 11072:11072
Re: Issue 569826 in chromium: Regression: Unwanted blue line is seen below
ominibox after typing anything
Issue 571124 in chromium: getUserMedia: localhost is NOT being treated as a
secure origin over HTTP
Re: Issue 570845 in chromium: setInterval stops when interacting with mouse
if function run by interval is relatively CPU-intensive
Re: Issue 571124 in chromium: getUserMedia: localhost is NOT being treated
as a secure origin over HTTP
Issue 571125 in chromium: Give instructions for previewing markdown changes
in src/docs
Re: Issue 548235 in chromium: Intl timezone returning wrong timezones
Re: Issue 569821 in chromium: bootstrap.py fails to link gn on macos and
liux introduced by https://codereview.chromium.org/1471073007
Re: Issue 473625 in chromium: DevTools: update flex containers to
correspond to the spec.
Re: Issue 529559 in chromium: Searching for "x" opens a unexpected site
instead of Google search
Re: Issue 557422 in chromium: Replace Pass() with std::move() where possible
Re: Issue 473625 in chromium: DevTools: update flex containers to
correspond to the spec.
Re: Issue 570843 in chromium: RAM usage regression around
2015-12-09T02:44:11.000Z
Re: Issue 569821 in chromium: bootstrap.py fails to link gn on macos and
liux introduced by https://codereview.chromium.org/1471073007
Re: Issue 557422 in chromium: Replace Pass() with std::move() where possible
Re: Issue 529453 in chromium: Touch scroll latency on Surface Pro 3 is
noticeably worse than in Edge and Chrome on ChromeOS
Re: Issue 557422 in chromium: Replace Pass() with std::move() where possible
Re: Issue 314268 in chromium: Flash/Stage3D performance is substantially
worse in Pepper using ATI GPUs
Re: Issue 570810 in chromium: Get tests running on Brillo continuous
builder.
Re: Issue 553696 in chromium: 3.3% regression in blink_perf.pywebsocket at
358387:358435
Re: Issue 570904 in chromium: CFI slows down some tests by 30%
Re: Issue 570829 in chromium: Store Firmware builds in a better location.
Re: Issue 570904 in chromium: CFI regresses multiple benchmarks by 20-30%
Issue 571130 in chromium: Sync: Sync UI fails when running a debug build
Re: Issue 561834 in chromium: Several 'Operation not allowed' errors in
`adb_install_apk.py`
Re: Issue 570007 in chromium: If BT pairing is missed during OOBE it's
impossible to ever get back
Re: Issue 385960 in chromium: Three finger tap to look up in dictionary
doesn't work perfectly after zoomed
Issue 571133 in chromium: "Unable to enable java asserts" on rooted device
Re: Issue 568435 in chromium: Miscellaneous CSS property parser bugs
Re: Issue 385960 in chromium: Three finger tap to look up in dictionary
doesn't work perfectly after zoomed
Re: Issue 568841 in chromium: Shared device screen is not displaying mouse
cursor on desktop user screen
Re: Issue 570843 in chromium: RAM usage regression around
2015-12-09T02:44:11.000Z
Re: Issue 571065 in chromium: NET::ERR_CERT_REVOKED on sites with UTN -
DataCorp SGC intermediate cert
Re: Issue 567544 in chromium: [Chrome][v47] Unavailable to choose a
bookmark when adding "Bookmark 1x1" of Chrome widget
Re: Issue 492693 in chromium: Stop using DeterministicSocketData in
quic_network_transaction_unittest.cc
Re: Issue 570904 in chromium: CFI regresses multiple benchmarks by 20-30%
Re: Issue 570829 in chromium: Store Firmware builds in a better location.
Re: Issue 568602 in chromium: WebView crash on startup in policy code, in
apps that have a nondefault main thread
Re: Issue 456310 in chromium: Autotest for extension_EchoPrivate always
fails. Does not appear in list of tests.
Re: Issue 570829 in chromium: Store Firmware builds in a better location.
Re: Issue 570904 in chromium: CFI regresses multiple benchmarks by 20-30%
Re: Issue 571097 in chromium: ☂ Stepping and pausing everywhere
Re: Issue 396021 in chromium: Add break on NaN generation
Re: Issue 570904 in chromium: CFI regresses multiple benchmarks by 20-30%
Re: Issue 465008 in chromium: DevTools: holes in Timeline flame chart
Re: Issue 392774 in chromium: Feature Request: Give control over what
a "statement" is, debugger-wise
Re: Issue 569436 in chromium: Save Password bubble does not appear on
orderaheadapp.com
Re: Issue 571097 in chromium: ☂ Stepping and pausing everywhere
Re: Issue 555293 in chromium: 2.3% regression in dromaeo.domcoremodify at
359094:359106
Re: Issue 559339 in chromium: ChromeVox makes an announcement for each key
press while in Docs.
Re: Issue 533516 in chromium: Support having several RenderViewHosts per
WebContents in WebView
Re: Issue 462149 in chromium: The 'Source map URL' overlay is displaced on
navigating back from a web page.
Re: Issue 568632 in chromium: "webkit_tests (with patch)" is flaky
Re: Issue 555578 in chromium: Using mmap-ed I/O SQLite can improve browser
process memory efficiency (~1.5 M on Android)
Re: Issue 473625 in chromium: DevTools: update flex containers to
correspond to the spec.
Re: Issue 242847 in chromium: DevTools: Preserve breakpoints when query
string suffix changes.
Re: Issue 497513 in chromium: DevTools: [regression] [jsprofiler] single
(anonymous function) is many different anonymous functions
Re: Issue 473625 in chromium: DevTools: update flex containers to
correspond to the spec.
Issue 571144 in chromium: Windows minidumps from crash/ contain less
information than before
Re: Issue 492693 in chromium: Stop using DeterministicSocketData in
quic_network_transaction_unittest.cc
Re: Issue 230828 in chromium: Make Request Initiator information available
through chrome.* APIs
Issue 571145 in chromium: All tests purple on ClangToTMacAsan tester
Re: Issue 571097 in chromium: ☂ Stepping and pausing everywhere
Re: Issue 432469 in chromium: DevTools: Support stepping into asynchronous
callbacks.
Re: Issue 565059 in chromium: Flaky crash of
inspector/console/console-uncaught-promise.html
Re: Issue 515230 in chromium: DevTools: file system indexer consumes a lot
of resources
2 issues changed in chromium
Re: Issue 376637 in chromium: Source maps don't work in a WebWorker
Re: Issue 564403 in chromium: Layout Test
http/tests/inspector/service-workers/service-worker-manager.html is flaky
Re: Issue 339252 in chromium: timeline/timeline-window-filter.html is flaky
Re: Issue 434175 in chromium: chromevox fails to read scanned PDF backed by
symbolic text
Re: Issue 230513 in chromium: Chromium: remove compatibility overloads for
postConsoleMessageToWorkerObject
Re: Issue 409494 in chromium: Ability to drag .cpuprofile file into profile
panel
Issue 571146 in chromium: Create a way for ARC to fetch auth code from GAIA
Re: Issue 570007 in chromium: If BT pairing is missed during OOBE it's
impossible to ever get back
Re: Issue 244505 in chromium: Timeline does not report time in deferred
canvas flush
Re: Issue 508819 in chromium: Regression: Scroll bar of the page flickers
on hovering the mouse on any element in Elements tab of DevTools.
Re: Issue 486698 in chromium: DevTools: Sources - Syntax highlighting for
any script type embedded in HTML
Re: Issue 555728 in chromium: 56.1% regression in
session_restore.cold.typical_25 at 359462:359484
Re: Issue 438390 in chromium: SVG Path with stroke dashes not displayed
propertly
Re: Issue 570976 in chromium: webkitSpeechRecognition stucks suddenly
Re: Issue 465622 in chromium: DevTools: user JS sometimes included in
(program)
Re: Issue 403373 in chromium: DevTools: [sourcemaps] Visual indication that
a file is a mapped file
--
--
Automated mail from issue updates at http://crbug.com/
Subscription options: http://groups.google.com/a/chromium.org/group/chromium-bugs

---
You received this message because you are subscribed to the Google Groups "Chromium-bugs" group.
To unsubscribe from this group and stop receiving emails from it, send an email to chromium-bugs+***@chromium.org.
c***@googlecode.com
2015-12-22 21:18:39 UTC
Permalink
Your project notifications generated too many emails to send
individually. Here are the subject lines of the emails you would have
received:

Re: Issue 537727 in chromium: Create a file pathname sanitizer in base/;
audit the code for places it should be used; change call sites and tests
Issue 571669 in chromium: Bundle yapf to depot_tools to enable git cl
format --python without user installing yapf.
Issue 571670 in chromium: git cl format shouldn't require clang-format for
Python formatting (with yapf).
Re: Issue 536999 in chromium: Implement synchronized painting for Slimming
Paint phase 1
Re: Issue 567875 in chromium: Selection does not appear on
https://developers.google.com/web/updates/2015/08/using-requestidlecallback?hl=en
Re: Issue 247517 in chromium: Remove redundant Instant-related query params
from search URLs
Re: Issue 535651 in chromium: lock_time is stored differently in master and
shard DBs.
Re: Issue 539373 in chromium: Android WebView stops loading pages
Re: Issue 440363 in chromium: Weird flickering seen in css3dclouds
experiment after pinch to zoom in/out action.
Re: Issue 142396 in chromium: Instant API should be on window.navigator
instead of window.chrome
Re: Issue 438207 in chromium: When the user uses touch screen and drags div
element the onDragStart event does not fire as well as other drag events
Re: Issue 179006 in chromium: box-shadow blur covers about half the
expected distance
Re: Issue 554282 in chromium: [Chaos] Turn broken dynamic APs to static APs
Re: Issue 522228 in chromium: SPKI parsing for Certificates is too
permissive
Re: Issue 570845 in chromium: setInterval and setTimeout stop during input
when timer callbacks are expensive
Issue 571671 in chromium: MediaStream Recording API: support multiple audio
tracks
Re: Issue 435532 in chromium: Uber frame content flickers on pinch to zoom
Re: Issue 563716 in chromium: Stack traces from Telemetry runs aren't
symbolized on Mac
Re: Issue 571241 in chromium: Canary 49.0.2587.0 (r364195) breaks VSYNC and
stops GPU from being used
Re: Issue 544234 in chromium: Context menu for changing spellchecker
language disappeared.
Re: Issue 436751 in chromium: Touchscreen does not work on select websites
Re: Issue 438311 in chromium: Password fields are not reported to the
Windows On-screen keyboard.
Re: Issue 370550 in chromium: Not able to touch Upwards/Downwards menu
arrows
Re: Issue 369982 in chromium: overscroll-history-navigation cannot be
sensibly prevented
Re: Issue 568183 in chromium: Replace MouseWheelEvent event scrolling with
GestureScrolls
Issue 571674 in chromium: Remove dead query params from instant_url and
search_url
Re: Issue 559278 in chromium: Trigger try-jobs through Buildbucket to
identify culprit by recompile
Re: Issue 247517 in chromium: Remove redundant Instant-related query params
from search URLs
Re: Issue 362784 in chromium: [Ptz] Text gets overlapped upon zooming in on
a Google document
Issue 571677 in chromium: [Cast, Android] ReceiverAction routes/clients
should never get any messages rather than "cast" and MRP should ignore all
message coming through them.
Re: Issue 522853 in chromium: Linux: Chrome/Chromium SIGBUS/Aw, Snap! on
small /dev/shm
Re: Issue 571231 in chromium: Implement Curve25519 for TLS
Re: Issue 571672 in chromium: ASSERT in GraphicsLayer::paintWithoutCommit
Re: Issue 571674 in chromium: Remove dead query params from instant_url and
search_url
Issue 571678 in chromium: GN: Java files defined in android_apk() target
should be accessible from android_instrumentation_test()
Re: Issue 549590 in chromium: document.querySelector(':target') fails to
select :target element before page load
Re: Issue 522853 in chromium: Linux: Chrome/Chromium SIGBUS/Aw, Snap! on
small /dev/shm
Re: Issue 353888 in chromium: Chrome asks for "Windows Password" when
displaying saved password, but those passwords are available with no
protection via other methods anyway.
Re: Issue 549590 in chromium: document.querySelector(':target') fails to
select :target element before page load
Re: Issue 570845 in chromium: setInterval and setTimeout stop during input
when timer callbacks are expensive
Re: Issue 571248 in chromium: update libwebp to v0.5.0
Re: Issue 496258 in chromium: Make IPAddressNumber its own class
Re: Issue 570845 in chromium: setInterval and setTimeout stop during input
when timer callbacks are expensive
Re: Issue 566131 in chromium: [Cassandra] Replace Celes DVT and setup
conductive rig
Re: Issue 451577 in chromium: Some win_blink_rel builds failing over 100
tests
Issue 571680 in chromium: Fix janky smooth scroll animations that get
forwarded from the main thread to the compositor
Re: Issue 552556 in chromium: teach ScrollAnimator to start compositor
animations
Re: Issue 571680 in chromium: Fix janky smooth scroll animations that get
forwarded from the main thread to the compositor
Re: Issue 480516 in chromium: Supporting serviceURI param to
SpeechRecognition
Re: Issue 451577 in chromium: Some win_blink_rel builds failing over 100
tests
Re: Issue 451577 in chromium: Some win_blink_rel builds failing over 100
tests
Re: Issue 480516 in chromium: Supporting serviceURI param to
SpeechRecognition
Re: Issue 568134 in chromium: 3%-5.8% regression in memory.top_7_stress at
363810:363853
Re: Issue 568386 in chromium: HttpServerProperties - MRU list is not
maintained across browser startups
Re: Issue 568475 in chromium: 65.7% regression in v8.infinite_scroll at
363587:363603
Re: Issue 451577 in chromium: Some win_blink_rel builds failing over 100
tests
Re: Issue 526746 in chromium: wireless does not stay connected to our
meraki wifi, and when it does, we get dns and dhcp errors.
Re: Issue 566914 in chromium: 3.7%-211% regression in
performance_browser_tests at 362994:363078
Re: Issue 571208 in chromium: DevTools: [inspect devices] #webrtc "browser"
always visible
Re: Issue 565231 in chromium: Regression : Overlapping of "Add rule"
button is seen on bottom row of 'Inspect devices' after dragging devtools
window downwards.
Re: Issue 564345 in chromium: wifi reports "turned off" UNTIL I plug in an
ethernet cable, then wifi comes up showing wifi network
Re: Issue 560714 in chromium: 1.9% regression in speedometer at
360815:360855
Re: Issue 571567 in chromium: kernel chromeos-3.18: sync genpd with upstream
Re: Issue 571567 in chromium: kernel chromeos-3.18: sync genpd with upstream
Re: Issue 571567 in chromium: kernel chromeos-3.18: sync genpd with upstream
Re: Issue 571567 in chromium: kernel chromeos-3.18: sync genpd with upstream
Re: Issue 571567 in chromium: kernel chromeos-3.18: sync genpd with upstream
Re: Issue 571567 in chromium: kernel chromeos-3.18: sync genpd with upstream
Re: Issue 571567 in chromium: kernel chromeos-3.18: sync genpd with upstream
Re: Issue 571567 in chromium: kernel chromeos-3.18: sync genpd with upstream
Re: Issue 571567 in chromium: kernel chromeos-3.18: sync genpd with upstream
Re: Issue 571567 in chromium: kernel chromeos-3.18: sync genpd with upstream
Re: Issue 571567 in chromium: kernel chromeos-3.18: sync genpd with upstream
Re: Issue 571567 in chromium: kernel chromeos-3.18: sync genpd with upstream
Re: Issue 571567 in chromium: kernel chromeos-3.18: sync genpd with upstream
Re: Issue 571567 in chromium: kernel chromeos-3.18: sync genpd with upstream
Re: Issue 571567 in chromium: kernel chromeos-3.18: sync genpd with upstream
Re: Issue 567280 in chromium: convert directory.h usage of hash_map to
unordered_map
Re: Issue 571567 in chromium: kernel chromeos-3.18: sync genpd with upstream
Re: Issue 571567 in chromium: kernel chromeos-3.18: sync genpd with upstream
Re: Issue 571567 in chromium: kernel chromeos-3.18: sync genpd with upstream
Re: Issue 571567 in chromium: kernel chromeos-3.18: sync genpd with upstream
Re: Issue 571567 in chromium: kernel chromeos-3.18: sync genpd with upstream
Re: Issue 571567 in chromium: kernel chromeos-3.18: sync genpd with upstream
Re: Issue 571567 in chromium: kernel chromeos-3.18: sync genpd with upstream
Re: Issue 571567 in chromium: kernel chromeos-3.18: sync genpd with upstream
Re: Issue 571567 in chromium: kernel chromeos-3.18: sync genpd with upstream
Re: Issue 571567 in chromium: kernel chromeos-3.18: sync genpd with upstream
Re: Issue 571567 in chromium: kernel chromeos-3.18: sync genpd with upstream
Re: Issue 571567 in chromium: kernel chromeos-3.18: sync genpd with upstream
Re: Issue 571567 in chromium: kernel chromeos-3.18: sync genpd with upstream
Re: Issue 557849 in chromium: Release builders: Do not mark master as
succeeded when one of the slaves fails
Re: Issue 569268 in chromium: Error -512 in when waiting for fence in
rockchip drm
Re: Issue 570532 in chromium: See if we can speed up dma-mapping allocations
Re: Issue 427912 in chromium: bmpblk package should be moved to open
Re: Issue 552556 in chromium: teach ScrollAnimator to start compositor
animations
Re: Issue 563534 in chromium: 6.3%-14.9% regression in page_cycler.morejs
at 361591:361620
Re: Issue 570570 in chromium: CRAS: speaker and headphone have identical
StableDeviceId
Re: Issue 570570 in chromium: CRAS: speaker and headphone have identical
StableDeviceId
Re: Issue 570570 in chromium: CRAS: speaker and headphone have identical
StableDeviceId
Re: Issue 535982 in chromium: External USB microphones naming are now
incomplete.
Re: Issue 570570 in chromium: CRAS: speaker and headphone have identical
StableDeviceId
--
--
Automated mail from issue updates at http://crbug.com/
Subscription options: http://groups.google.com/a/chromium.org/group/chromium-bugs

---
You received this message because you are subscribed to the Google Groups "Chromium-bugs" group.
To unsubscribe from this group and stop receiving emails from it, send an email to chromium-bugs+***@chromium.org.
Loading...