Discussion:
102 messages from Google Code
(too old to reply)
c***@googlecode.com
2014-08-06 20:44:23 UTC
Permalink
Your project notifications generated too many emails to send
individually. Here are the subject lines of the emails you would have
received:

Re: Issue 366884 in chromium: fetch tool should list available projects in
help output
Re: Issue 396993 in chromium: Ok Google checkbox greyed out if microphone
unavailable
Re: Issue 330938 in chromium: touch keyboard pops up when not in Windows 8
mode
Re: Issue 392928 in chromium: Feature Request: Overscroll History
Navigation for Files App.
Re: Issue 392459 in chromium: PeerConnection.iceConnectionState transition
from gathering to completed
Issue 401200 in chromium: Postinstall scriptlet in RPM
google-chrome-unstable references the wrong file, causing error e-mail
Re: Issue 366884 in chromium: fetch tool should list available projects in
help output
Issue 401201 in chromium: linux_arm_cross_compile needs
gtest_tests_filter_exclusions
Re: Issue 400893 in chromium: gn bots don't use goma, run everything locally
Re: Issue 381973 in chromium: [dom_distiller] Incorrect next page stitched
onto article
Re: Issue 395172 in chromium: WebRTCBrowserTests fail on DrMemory
Re: Issue 306085 in chromium: webkit.dll link timeouts on Win x64 Builder
(dbg)
Re: Issue 392492 in chromium: Selection.collapse throws errors when it
shouldn't
Re: Issue 393873 in chromium: Typecheck JavaScript with Closure Compiler
Re: Issue 391992 in chromium: Chrome consume whole 32-bit system memory and
has leaks
Issue 401202 in chromium: Package Chrome logs in zip format
Re: Issue 393873 in chromium: Typecheck JavaScript with Closure Compiler
Re: Issue 376975 in chromium: Unable to extract .tgz files on Chrome OS
Re: Issue 400583 in chromium: core-scroll-header failing in Polymer page set
Re: Issue 401139 in chromium: [Tracking] Eliminate unnecessary garbage
generation during common UX scenarios
Re: Issue 399030 in chromium: CRASH:
media::FileDataSource::FileDataSource(base::File)
Re: Issue 401195 in chromium: Investigate spike in proxy connection failures
Re: Issue 398888 in chromium: Fix ash_unittests on Ozone
Issue 401203 in chromium: Split out Polymer page set pages into standalone
examples
Re: Issue 401203 in chromium: Split out Polymer page set pages into
standalone examples
Re: Issue 400535 in chromium: Improve Polymer page set
Re: Issue 357080 in chromium: Layout Test media/autoplay.html is failing
Re: Issue 400659 in chromium: Prevent GC of media elements that can still
fire events
Re: Issue 341031 in chromium: Implement Blink-in-JavaScript
Re: Issue 401151 in chromium:
PinchViewportTest.TestScrollFocusedNodeIntoRect is flaky on mac bots
Re: Issue 398888 in chromium: Fix ash_unittests on Ozone
Re: Issue 400484 in chromium: chromeos-chrome build fails with unrecognized
-Wheader-hygiene and -Wstring-conversion flags
Re: Issue 383314 in chromium: Chrome GPU process keeps crashing.
Re: Issue 60452 in chromium: chrome doesn't line-break on    
  ​
Re: Issue 60452 in chromium: chrome doesn't line-break on    
  ​
Re: Issue 161834 in chromium: Cache /proc/cpuinfo and make it available
inside sandboxed renderers
Re: Issue 391372 in chromium: Regression: Localizing browser doesn't change
the 'Import bookmarks now' suggestion from bookmarks bar
Re: Issue 400484 in chromium: chromeos-chrome build fails with unrecognized
-Wheader-hygiene and -Wstring-conversion flags
Re: Issue 399251 in chromium: Content verification handles 0-length files
incorrectly
Issue 401204 in chromium: Improve Java trace coverage
Re: Issue 697 in chromium: java applet not loading
Re: Issue 401204 in chromium: Improve Java fastpath trace coverage
Issue 401205 in chromium: Split Pronto Sheet core_dom into 3 separate
libraries
Re: Issue 324691 in chromium: Top left quarter of rendered pages visible on
some new navigations
Re: Issue 378576 in chromium: Windows-specific bug in custom protocol
handling
Issue 401206 in chromium: dedicated worker inspector interface is non
functional
Re: Issue 401198 in chromium: network is consistently slow on Panther for
30s after resume/unlock
Re: Issue 401198 in chromium: network is consistently slow on Panther for
30s after resume/unlock
Re: Issue 378576 in chromium: Windows-specific bug in custom protocol
handling
Re: Issue 365857 in chromium: Remove acceleratedCompositingForVideoEnabled
Re: Issue 394363 in chromium: Git-on-Borg not caching the main project
anymore
Re: Issue 391478 in chromium: FOAM calculator app doesn't render on Athena
Re: Issue 394489 in chromium: Make sure offline Gmail runs on Athena
Re: Issue 400930 in chromium: Cast streaming API does not parse frame rate
from config
Re: Issue 397341 in chromium: chrome-extension:// favicons cause DCHECK
Issue 401209 in chromium: Why does GWS memory bump by +50m during gaga
expansion?
Re: Issue 357080 in chromium: Layout Test media/autoplay.html is failing
Re: Issue 329623 in chromium: Implement auto-reload for offline errors on
IOS
Issue 401210 in chromium: Layout/composite error while working with form in
chrome app <webview>
Re: Issue 365857 in chromium: Remove acceleratedCompositingForVideoEnabled
Re: Issue 394363 in chromium: Git-on-Borg not caching the main project
anymore
Re: Issue 398408 in chromium: Screen freezes when user tries to access a
file from stream and internet connection is switched off
Re: Issue 368691 in chromium: Typing in omnibox is restricted due to some
focus issue between print preview & omnibox.
Re: Issue 400334 in chromium: Poor quality Javanese text rendering
Re: Issue 401147 in chromium: Implement the inline signin confirmation
bubble and mirror upgrade tutorial
Re: Issue 393797 in chromium: ChromeVox: cannot open certain apps while
enabled, including File Manager
Issue 401212 in chromium: [dom_distiller] Incorporate readability
guideliness into dom-distiller
Re: Issue 367395 in chromium: Title tab drop down on chrome metro covers
tabs making it a huge pain to use.
Re: Issue 401195 in chromium: Investigate spike in proxy connection failures
Re: Issue 161834 in chromium: Cache /proc/cpuinfo and make it available
inside sandboxed renderers
Re: Issue 401147 in chromium: Implement the inline signin confirmation
bubble and mirror upgrade tutorial
Re: Issue 401195 in chromium: Investigate spike in proxy connection failures
Issue 401213 in chromium: Android multi-networking support
Re: Issue 371747 in chromium: Poster circle doesn't go idle after screen is
locked
Re: Issue 399653 in chromium: Support the WebIDL ExtendedAttributeIdentList
Re: Issue 394363 in chromium: Git-on-Borg not caching the main project
anymore
Re: Issue 398794 in chromium: 'analyze' step on Chromium bots should not
skip compilation for Blink changes.
Re: Issue 398087 in chromium: Discardable memory usage regression
Re: Issue 400330 in chromium: Paste popup keeps showing after screen
orientation is changed
Re: Issue 396997 in chromium: Paste popup is coming without insertion
handler
Re: Issue 400304 in chromium: Paste popup keeps showing even after user
starts typing in the input field
Re: Issue 396997 in chromium: Paste popup is coming without insertion
handler
Re: Issue 400304 in chromium: Paste popup keeps showing even after user
starts typing in the input field
Re: Issue 400330 in chromium: Paste popup keeps showing after screen
orientation is changed
Re: Issue 368691 in chromium: Typing in omnibox is restricted due to some
focus issue between print preview & omnibox.
Re: Issue 367395 in chromium: Title tab drop down on chrome metro covers
tabs making it a huge pain to use.
Re: Issue 295984 in chromium: Pepper Flash crashes on twitch.tv and
spotify.com
Issue 401214 in chromium: permit binding of URLRequests to specific networks
Re: Issue 368691 in chromium: Typing in omnibox is restricted due to some
focus issue between print preview & omnibox.
Re: Issue 397217 in chromium: DevTools: remaster text editor errors
Re: Issue 391171 in chromium: 10.2% regression in cc_perftests at
Infinity:-Infinity
Re: Issue 391830 in chromium: 1.5% regression in
startup.warm.dirty.blank_page at 275696:-Infinity
Issue 401215 in chromium: Bring Chrome OS behavior to Win Notifications bell
Re: Issue 365857 in chromium: Remove acceleratedCompositingForVideoEnabled
Issue 401218 in chromium: Clean up the FieldTrial interface
Issue 401217 in chromium: DHCP Fails in Windows Server 2012 Load Balanced
DHCP Environment
Re: Issue 372049 in chromium: Enable PPAPI browser_tests under ARM Non-SFI
NaCl
Re: Issue 395832 in chromium: ARM Chromium build failing
with "find-bad-constructs: No such file or directory"
Re: Issue 393797 in chromium: ChromeVox: cannot open certain apps while
enabled, including File Manager
Issue 401221 in chromium: Evaluate the size of LayerEvictionTileIterator
and possibly reduce it
Re: Issue 397074 in chromium: Regression: Traces of overlay is seen on
clicking close button.
Re: Issue 367395 in chromium: Title tab drop down on chrome metro covers
tabs making it a huge pain to use.
--
--
Automated mail from issue updates at http://crbug.com/
Subscription options: http://groups.google.com/a/chromium.org/group/chromium-bugs

To unsubscribe from this group and stop receiving emails from it, send an email to chromium-bugs+***@chromium.org.
c***@googlecode.com
2014-08-07 18:51:14 UTC
Permalink
Your project notifications generated too many emails to send
individually. Here are the subject lines of the emails you would have
received:

Re: Issue 397104 in chromium: Background video in hidden tabs prevents
screensaver & screenlock
Re: Issue 374772 in chromium: Worker threads V8 Isolates to not auto-run
microtasks, and should call RunMicrotasks after every task
Re: Issue 401365 in chromium: Deprecate SHA-1 for certificates
Re: Issue 395733 in chromium: MediaStreamTrack.getSources lists audio input
devices even when all are disabled
Re: Issue 374462 in chromium: Devtools connection problems with first tab
on cros immediately after logging in
Re: Issue 399816 in chromium: Extremely long style recalc due to whitespace
textNodes
Re: Issue 396264 in chromium: Bottom corners of window are not round on
retina display
Issue 401623 in chromium: Write a script to record what is running on a
drone
Re: Issue 323965 in chromium: ozone: support mouse
Re: Issue 397822 in chromium: Fire "beforepaste" event before
firing "paste" event
Re: Issue 400649 in chromium: Google Docs is going unresponsive after click
on "print using system dialog" link.
Re: Issue 399653 in chromium: Support the WebIDL ExtendedAttributeIdentList
Issue 401624 in chromium: [DisplayList2DCanvas] Regression: imageSmoothing
seems to be broken
Re: Issue 400011 in chromium: landmines should also clobber developer
checkouts
Re: Issue 377089 in chromium: Add tab_capture_performance_tests to Perf GPU
bots
Re: Issue 390238 in chromium: Text/favicon inside tab is blurry
Re: Issue 401023 in chromium: Shortcuts for copy/paste not working
for 'Sign in' after enabling 'New profile management system' flag
from 'chrome://flags'.
Re: Issue 391086 in chromium: kernel-freon: spinlock bad magic in
drm_gem_object_release_handle
Re: Issue 400022 in chromium: ozone: implement input property system for
CrOS gesture library
Re: Issue 374462 in chromium: Devtools connection problems with first tab
on cros immediately after logging in
Re: Issue 352347 in chromium: Don't autofill passwords where confirmation
is required
Re: Issue 245918 in chromium: content_browsertests crashing inside
BrowserTestSystemMessageHandle
Re: Issue 400464 in chromium: email when NeedsManualRebaselines are ready
Re: Issue 400466 in chromium: auto-email weekly nag email about unhandled
NeedsManualRebaselines
Re: Issue 362698 in chromium: ozone: implement input method support on
ChromeOS
Re: Issue 400465 in chromium: make auto-rebaseline work if you're already
on the auto-rebaseline branch
Re: Issue 400468 in chromium: Allow rebaselining flaky tests
Re: Issue 400467 in chromium: setup role account for RebaselineOMatic
Re: Issue 363302 in chromium: ozone: fix video acceleration tests
Re: Issue 401628 in chromium: 25.1% regression in page_cycler.dhtml at
287747:287771
Issue 401628 in chromium: 25.1% regression in page_cycler.dhtml at
287747:287771
Re: Issue 400763 in chromium: Full crash & disappear when clicking
on 'Ebola' link on my news page
Re: Issue 370905 in chromium: Figure out Video Output Format Story For
Overlay Scanout
Re: Issue 401541 in chromium: Save as File Dialog doesn't permit dragging
to a second screen
Re: Issue 401341 in chromium: update_engine incorrect dependencies (due to
temporarily out of disk space on /tmp)
Re: Issue 399939 in chromium: WebRTC hangout video input broken, gives a
green screen
Re: Issue 401304 in chromium: ozone: fix context menu tests
Re: Issue 397219 in chromium: android_dbg_triggered_tests fails try-job
when its devices go missing
Re: Issue 401307 in chromium: ozone: fix drag & drop tests
Re: Issue 401590 in chromium: ozone: ash: enable user metrics reporting
Re: Issue 260318 in chromium: ozone: Implement screen capturer
Issue 401629 in chromium: Use a CookieHashSet rather than CookieList in
chrome/browser/
Re: Issue 343245 in chromium: Support animated cursors on Ozone
Re: Issue 399281 in chromium: Windows that were minimized in the last run
are black when opened by "Continue where I left off"
Re: Issue 361228 in chromium: ozone: fix chromeos boot splash
Re: Issue 362166 in chromium: ozone: support interactive_ui_tests
Re: Issue 400457 in chromium: give Access-Control-Allow-Origin:* to 404
results.json requests
Re: Issue 400458 in chromium: have proper monitoring and alerting on 500s
on test-results.appspot.com
Re: Issue 370522 in chromium: CrOS Hardware Overlays
Re: Issue 381877 in chromium: Measure RSS from shared libraries
Re: Issue 225464 in chromium: reconcile Win x64 rel try bot and CQ configs
Re: Issue 370524 in chromium: couple ozone compositing schedule to vblank
Re: Issue 400456 in chromium: only show failures results for the actual
failures that have happened on the bots in the shown runs
Re: Issue 372463 in chromium: Forward image_chromium buffer to
SurfaceFactoryOzone
Re: Issue 372469 in chromium: Enable Allocation of buffers with
IMAGE_SCANOUT_CHROMIUM
Re: Issue 380861 in chromium: surfaceless implementation (aka khrEGLImage)
Re: Issue 400455 in chromium: add recently flaky to flakiness dashboard
Re: Issue 381894 in chromium: ozone: plumb inputcontrol
Re: Issue 378950 in chromium: Leave out unused sys-apps/hwids database
files from builds
Issue 401630 in chromium: Mac: Multiple crashes in ui::Compositor and
related code
Re: Issue 381895 in chromium: ozone: plumb touchpad activity logging
Re: Issue 381898 in chromium: ozone: fix touchscreen pressure
Re: Issue 400453 in chromium: Make flakiness dashboard, et. al. show a nice
UI that points to a bug for the test types that don't upload
Re: Issue 381929 in chromium: ozone: plumb evdev touch logging
Re: Issue 398066 in chromium: Tab crashes when having insecure form action
in a secure origin in an invisible DOM (without frame)
Re: Issue 401630 in chromium: Mac: Multiple crashes in ui::Compositor and
related code
Re: Issue 397822 in chromium: Fire "beforepaste" event before
firing "paste" event
Re: Issue 381938 in chromium: ozone: autotests, hardware testing, X11 deps
Re: Issue 400833 in chromium: asan script execute_asan_tool.rb is not
detecting crashes
Re: Issue 381932 in chromium: ozone: plumb touchpad metrics
Re: Issue 401631 in chromium: 4.8% regression in
dromaeo.jslibtraverseprototype at 287749:287763
Issue 401631 in chromium: 4.8% regression in dromaeo.jslibtraverseprototype
at 287749:287763
Re: Issue 178297 in chromium: Android Chrome does not allow applications to
play HTML5 audio without an explicit action by the user
Re: Issue 392280 in chromium: ozone: implement remainder of WindowTreeHost
Re: Issue 298569 in chromium: Drop DecryptConfig::data_offset_
Re: Issue 392478 in chromium: Properly handle display configuration on
Ozone-GBM
Re: Issue 398888 in chromium: Fix ash_unittests on Ozone
Re: Issue 400451 in chromium: get rid of the groups dropdown
Re: Issue 340465 in chromium: ozone: Support input devices without X11
Re: Issue 369844 in chromium: "Disable Javascript" button automatically
unchecked on reload
Re: Issue 401586 in chromium: win_chromium_x64_rel
Issue 401633 in chromium: Wallpaper on Athena has white border in top & left
Re: Issue 351168 in chromium: ozone: evdev: Support touchpad
Re: Issue 354036 in chromium: events: Add mechanism for rewriting input
events
Re: Issue 400448 in chromium: figure out data corruption bug that causes
files to have invalid keys in test-results.appspot.com
Re: Issue 386822 in chromium: Figure out if we can use negative pitch
during rendering of webgl buffers
Re: Issue 401635 in chromium: 4.3% regression in dromaeo.domcoremodify at
288018:288025
Issue 401635 in chromium: 4.3% regression in dromaeo.domcoremodify at
288018:288025
Re: Issue 400432 in chromium: put Access-Control-Allow-Origin:* on all
GetFile requests
Re: Issue 399681 in chromium: Figure out V4L2 Build With Ozone
Re: Issue 400447 in chromium: Fix times_ms.json schema
Re: Issue 279662 in chromium: flakiness dashboard should show retry
information
Re: Issue 396370 in chromium: linux_chromium_gn_rel compiles both x11 and
ozone code
Re: Issue 158245 in chromium: Streaming HTML5 Audio stops playing mid-play
with error "Failed to load resource"
Re: Issue 398518 in chromium: [ozone] Make sure we didn't change the key
repeat raste
Re: Issue 256193 in chromium: Zoom level alters printed font and DPI in PDF
Re: Issue 398628 in chromium: test-results / flakiness-dashboard needs
an 'is this flaky' API
Re: Issue 401292 in chromium: Display most flakiness tests on
test-results.appspot.com
Re: Issue 361144 in chromium: Ozone multi-monitor
Re: Issue 399623 in chromium: adding a mediagroup-attribute breaks audio
elements
Re: Issue 401294 in chromium: UX issues around User Agent emulation
Re: Issue 225464 in chromium: reconcile Win x64 rel try bot and CQ configs
--
--
Automated mail from issue updates at http://crbug.com/
Subscription options: http://groups.google.com/a/chromium.org/group/chromium-bugs

To unsubscribe from this group and stop receiving emails from it, send an email to chromium-bugs+***@chromium.org.
c***@googlecode.com
2014-08-07 22:06:30 UTC
Permalink
Your project notifications generated too many emails to send
individually. Here are the subject lines of the emails you would have
received:

Re: Issue 396241 in chromium: 9.5% regression in
page_cycler.tough_layout_cases at 284425:284456
Issue 401707 in chromium: Confirmation bubble doesn't work properly with
fullscreen key
Re: Issue 260319 in chromium: background-position not correct when
background-size present and brower zoom level is off
Re: Issue 401446 in chromium: Omnibox search bubble does not appear after
fresh install in Windows 8 mode.
Re: Issue 401707 in chromium: Confirmation bubble doesn't work properly
with fullscreen key
Re: Issue 401642 in chromium: File collision between opengles-headers and
mesa on arm
Re: Issue 399816 in chromium: Extremely long style recalc due to whitespace
textNodes
Re: Issue 401371 in chromium: IME should never be enabled in Chromoting
window
Re: Issue 126500 in chromium: Button click event not fired when dragging
mouse between inner text and button element
Re: Issue 399930 in chromium: 443:Broken p=1.000000 was observed on playing
youtube videos on latest Chrome Canary
Re: Issue 401401 in chromium: In Webgl experiments context menu not getting
opened using tap/touch.
Re: Issue 178358 in chromium: A pop up message "Google Chrome wants to use
your confidential information stored in your keychain. Do you want to allow
access to this item?" appears persistently
Re: Issue 399816 in chromium: Extremely long style recalc due to whitespace
textNodes
Re: Issue 356694 in chromium: Sometimes the text selection toolbar covers
selected text
Re: Issue 401666 in chromium: Under contention quick taps can turn into
long presses on the virtual keyboard.
Re: Issue 399816 in chromium: Extremely long style recalc due to whitespace
textNodes
Re: Issue 401556 in chromium: flag to hide wifi/battery overlay
Re: Issue 401386 in chromium: Provide tools, guidance for web development
when security features (such as HTTPS) are in play
Re: Issue 401226 in chromium: MenuViewDragAndDropTest has flaky timeouts on
Windows
Re: Issue 399222 in chromium: Position of the paste popup is incorrect when
tapped on Insertion handle
Issue 401709 in chromium: Mojo: Convert Battery Status to using Mojo IPC
Re: Issue 328107 in chromium: Create test to look for unused dynamic
libraries.
Re: Issue 382649 in chromium: Investigate detecting unused libraries on the
rootfs
Re: Issue 394004 in chromium: Proper invalidation for invalidation-only
style changes with geometry changes
Re: Issue 394050 in chromium: Under-repaint for non-composited
transformation style change
Re: Issue 399924 in chromium: Leak inside vp3_update_thread_context
Re: Issue 396176 in chromium: 4.9%-251.4% regression in blink_perf at
284391:284408
Re: Issue 399447 in chromium: Allow the client to know the operating system
of the host
Re: Issue 395159 in chromium: Design: visual improvements to text filtering
in Ash overview mode
Re: Issue 368750 in chromium: x11: Use XInput2 events for keyboard events
Re: Issue 396173 in chromium: 14.2% regression in cc_perftests at
284418:284431
Issue 401712 in chromium: Improve idle task scheduling in android webview
Re: Issue 401712 in chromium: Improve idle task scheduling in android
webview
Re: Issue 399311 in chromium: [Android WebView] Support async upload idle
Re: Issue 399745 in chromium: [Android WebView] Android Webview can
deadlock in rendering after r273092
Re: Issue 396494 in chromium: NestedAcceleratorTest tests are flaky 40% of
the time
Re: Issue 379031 in chromium: Browser crashes when using SOCKS5 to connect
to IPv6 address
Re: Issue 379031 in chromium: Browser crashes when using SOCKS5 to connect
to IPv6 address
Re: Issue 368750 in chromium: x11: Use XInput2 events for keyboard events
Re: Issue 396176 in chromium: 4.9%-251.4% regression in blink_perf at
284391:284408
Re: Issue 279351 in chromium: Re-factor network settings UI to use a well
defined API (networkingPrivate or TBD)
Re: Issue 396138 in chromium: Cast: transient UDP socket error can cause
session to terminate
Re: Issue 394704 in chromium: User can see Shapes in 2003 and 2007 files
Re: Issue 391287 in chromium: Support accessibility in Sheet grid
Re: Issue 380181 in chromium: getUserMedia - Desktop capture screen sharing
request not visible in extensions with small windows.
Re: Issue 401341 in chromium: update_engine incorrect dependencies (due to
temporarily out of disk space on /tmp)
Re: Issue 362991 in chromium: Subpixel rendering not used when scrollbar is
present in crosh
Re: Issue 399924 in chromium: Leak inside vp3_update_thread_context
Re: Issue 401340 in chromium: chromite incorrect dependencies
Re: Issue 401596 in chromium: Dashboard tooltip isn't sticky upon clicking
after adjusting horizontal timeline slider.
Re: Issue 394701 in chromium: Add support for Textboxes
Re: Issue 279351 in chromium: Re-factor network settings UI to use a well
defined API (networkingPrivate or TBD)
Re: Issue 394286 in chromium: Support accessibility of Sheet tabs
Re: Issue 348880 in chromium: Select all by Ctrl + A should support region
based selection
Re: Issue 401053 in chromium: Garbage characters in file name when PPT
files are opened from certain links
Issue 401713 in chromium: gpu_info_collector_win.cc should use
IDXGIAdapter::GetDesc
Re: Issue 401713 in chromium: gpu_info_collector_win.cc should use
IDXGIAdapter::GetDesc
Re: Issue 354245 in chromium: User can merge and split cells
Re: Issue 399924 in chromium: Leak inside vp3_update_thread_context
Issue 401714 in chromium: Bad literal in pwg_encoder.cc
Re: Issue 400989 in chromium: r283380 breaks my build
Re: Issue 324536 in chromium: Support rotated text
Re: Issue 269653 in chromium: Need a format brush / painter
Re: Issue 343069 in chromium: UNKNOWN in
extensions::AppBindings::OnAppInstallStateResponse
Re: Issue 399816 in chromium: Extremely long style recalc due to whitespace
textNodes
Re: Issue 398157 in chromium: WebRTC audio is not transmitted if video is
off.
Re: Issue 394970 in chromium: Race condition with network_portal_detector
if shill takes some time to determine whether it's online
Issue 401716 in chromium:
conformance/extensions/angle-instanced.arrays.html failing on ANGLE's D3D9
backend
Issue 401717 in chromium: Some content editable divs have missing content
until rerendering (for instance either by right clicking or zooming).
Re: Issue 391451 in chromium: Shading is lost when user invokes inline
editor in a cell and taps elsewhere
Re: Issue 401700 in chromium: Location Chooser
Re: Issue 400065 in chromium: App launcher forgets app sorting within folder
Re: Issue 401717 in chromium: Some content editable divs have missing
content until rerendering (for instance either by right clicking or
zooming).
Re: Issue 379031 in chromium: Browser crashes when using SOCKS5 to connect
to IPv6 address
Re: Issue 394529 in chromium: Images missing from 2003 sheet files
Re: Issue 399941 in chromium: Segfault in chrome-remote-desktop-host
Issue 401721 in chromium: Cannot cancel out of Print Preview, when
printing from Agenda view in Google Calendar
Re: Issue 401615 in chromium: canaries often take more than 8 hours to run
Re: Issue 168726 in chromium: Left/Right Shift key does not generate keyup
event if Right/Left Shift key was pressed while it was down
Re: Issue 394694 in chromium: Text in merged rendered in a different
size/font/style than in Excel (happens in 2003 and 2007)
Re: Issue 318425 in chromium: Crashes updating zoom bubble on OSX.
Re: Issue 401226 in chromium: MenuViewDragAndDropTest has flaky timeouts on
Windows
Issue 401724 in chromium: Box model for select-tags is broken, padding is
substracted from width
Re: Issue 389238 in chromium: Collect stats for individual bot cycle times
Re: Issue 401477 in chromium: ASSERTION FAILED: tracks[i].m_maxBreadth !=
infinity in blink::RenderGrid::computeUsedBreadthOfGridTracks
Re: Issue 400661 in chromium: webRequest ignores some URLs in
onBeforeRequest
Re: Issue 401479 in chromium: ASSERTION FAILED:
m_gridItemCoordinate.contains(gridItem) in
blink::RenderGrid::cachedGridCoordinate
Re: Issue 401053 in chromium: Garbage characters in file name when PPT
files are opened from certain links
Re: Issue 401471 in chromium: ASSERTION FAILED: !trackSizes.isEmpty() in
blink::StyleBuilderConverter::convertGridTrackList
Re: Issue 394855 in chromium: Badge wrench icon when important
VariationsService changes are available
Re: Issue 168726 in chromium: Left/Right Shift key does not generate keyup
event if Right/Left Shift key was pressed while it was down
Re: Issue 392702 in chromium: /git-lkgr crashes in the new version of
chromium-status.appspot.com
Re: Issue 394855 in chromium: Badge wrench icon when important
VariationsService changes are available
Re: Issue 352461 in chromium: 'git cl try -b' now requires specifying a
master, which developers probably do not know or care about
Issue 401728 in chromium: Background task fails CHECK in
ChromeURLRequestContextGetter::GetURLRequestContext() in some TabEviction
tests.
Re: Issue 399924 in chromium: Leak inside vp3_update_thread_context
Issue 401730 in chromium: Chromoting documentation says that Debian is
supported, which is not true
Re: Issue 401730 in chromium: Chromoting documentation says that Debian is
supported, which is not true
Re: Issue 275039 in chromium: Docserver: make DataSources independent
entities
Re: Issue 375442 in chromium: Apps/Extensions are not installed
automatically/missing
Re: Issue 379031 in chromium: Browser crashes when using SOCKS5 to connect
to IPv6 address
Re: Issue 275039 in chromium: Docserver: make DataSources independent
entities
--
--
Automated mail from issue updates at http://crbug.com/
Subscription options: http://groups.google.com/a/chromium.org/group/chromium-bugs

To unsubscribe from this group and stop receiving emails from it, send an email to chromium-bugs+***@chromium.org.
c***@googlecode.com
2014-08-12 20:40:33 UTC
Permalink
Your project notifications generated too many emails to send
individually. Here are the subject lines of the emails you would have
received:

Re: Issue 391816 in chromium: 2.7% regression in webrtc at 279837:281059
Issue 403010 in chromium: GPU screenshot_sync_tests and
tab_capture_end2end_tests not showing on the flakiness dashboard
Re: Issue 403010 in chromium: GPU screenshot_sync_tests and
tab_capture_end2end_tests not showing on the flakiness dashboard
Re: Issue 379005 in chromium: many bots don't upload to the test-results
server
Re: Issue 402715 in chromium: RenderTextHarfBuzz glyph placement should
match RenderTextLinux (Pango).
Re: Issue 401802 in chromium: [Destiny] Setup two conductive rigs for alex
& daisy
Re: Issue 400445 in chromium: Image transform is wrong when filter
reference is used
Re: Issue 389439 in chromium: Tripadvisor uses 100% CPU
Re: Issue 389439 in chromium: Tripadvisor uses 100% CPU
Re: Issue 399792 in chromium: Occasional total Chrome lockup / beach ball
when using Hangouts
Re: Issue 403010 in chromium: GPU screenshot_sync_tests and
tab_capture_end2end_tests not showing on the flakiness dashboard
Re: Issue 401802 in chromium: [Destiny] Setup two conductive rigs for alex
& daisy
Issue 403011 in chromium: ui::CompositorObservers are left attached to
ui::Compositor after destruction in Aura
Re: Issue 394478 in chromium: Pop-up menu items render blank (white on
white) when highlighted on Linux
Re: Issue 372857 in chromium: Update cached kiosk CRX
Re: Issue 398852 in chromium: Allowing to create the folder with blank name
while edit the 'Bookmark page'.
Re: Issue 402715 in chromium: RenderTextHarfBuzz glyph placement should
match RenderTextLinux (Pango).
Re: Issue 399055 in chromium: Restore window assets
Re: Issue 402337 in chromium: Main process hangs up after crash
Re: Issue 402961 in chromium: Unexpected error during recovery on Rambi
Re: Issue 400768 in chromium: Ash tray UI shows Bluetooth is disabled even
though its enabled and working.
Re: Issue 388844 in chromium: Odd font layout with non integral scale
factor on browser UI
Re: Issue 401486 in chromium: When the last character of a query is typed
in the Omnibox, the Answer disappears
Re: Issue 389439 in chromium: Tripadvisor uses 100% CPU
Issue 403012 in chromium: tab_capture_end2end_tests results are not showing
on the flakiness dashboard for several bots
Re: Issue 402550 in chromium: trace-viewer fail to build on python 2.7.2
Re: Issue 402974 in chromium: Move builder_alerts to appengine
Re: Issue 396764 in chromium: Change AVFoundation setting in chrome://flags
to be a tri value: default, QTKit, AVFoundation
Re: Issue 403003 in chromium: Daisy: Not able to install recovery image.
Re: Issue 396764 in chromium: Change AVFoundation setting in chrome://flags
to be a tri value: default, QTKit, AVFoundation
Re: Issue 385495 in chromium: 3.2%-3.7% regression in
dromaeo.jslibstylejquery at 276504:276705
Re: Issue 402715 in chromium: RenderTextHarfBuzz glyph placement should
match RenderTextLinux (Pango).
Re: Issue 385495 in chromium: 3.2%-3.7% regression in
dromaeo.jslibstylejquery at 276504:276705
Re: Issue 112509 in chromium: Typo in French Dev Dashboard
Re: Issue 17601 in chromium: JSON reader allow incomplete block comments
Issue 403013 in chromium: bad memory access in
mojo::internal::WeakServiceProvider::Clear
Re: Issue 385495 in chromium: 3.2%-3.7% regression in
dromaeo.jslibstylejquery at 276504:276705
Issue 403014 in chromium: Chrome uses 100 - 180% CPU and hangs immediately
upon opening
Re: Issue 403007 in chromium: WorkerDevToolsSanityTest.InspectSharedWorker
times out frequenly on Windows
Re: Issue 394226 in chromium: About/Help: OS updates should not
automatically begin downloading
Re: Issue 399055 in chromium: Restore window assets
Re: Issue 399149 in chromium: Android Autofill settings should use Spinner
for country input
Re: Issue 399799 in chromium: Chrome OS regards login with alternate email
address as different account
Re: Issue 401857 in chromium: Jump to option with polish (special) char in
select menu
Issue 403016 in chromium: Orientation Tab grayed out in mirror mode but
Orientation can be possible using hot key Ctrl+Shift+Refresh
Re: Issue 389663 in chromium: Graphic corruption on medium.com
Re: Issue 402322 in chromium: KeyboardEvent.key should implemented
Re: Issue 399416 in chromium: Show negative security indicator for
non-secure origins that operate on PII, credentials, et c.
Re: Issue 314190 in chromium: Use browser compositor to draw contents on Mac
Re: Issue 389360 in chromium: Browser crash with buffer overflow detected,
crash reports not generated
Issue 403017 in chromium: Refactor
NaClBrowserDelegateImpl::MapUrlToLocalFilePath into the extensions module
Issue 403018 in chromium: Polish UX of "Not <name>?" dialog
Re: Issue 403018 in chromium: Polish UX of "Not <name>?" dialog
Re: Issue 399067 in chromium: Correctly handle ChromeBooks that don't
support BT
Issue 403019 in chromium: Hangouts unusable
Issue 403021 in chromium: Names not showing up in Autofill settings
Re: Issue 403007 in chromium: WorkerDevToolsSanityTest.InspectSharedWorker
times out frequenly on Windows
Re: Issue 377770 in chromium: 16% regression in dromaeo.jslibtraversejquery
at 272489:272553
Re: Issue 402764 in chromium: DenyCertForHost not functionally ever used in
ssl_policy_backend.h and should be removed
Re: Issue 403019 in chromium: Hangouts unusable
Issue 403022 in chromium: constantly disappear unstablen cant used with
microsoft ?
Re: Issue 400379 in chromium: Remove BT address (server side) when Easy
unlock is turned off
Re: Issue 399055 in chromium: Restore window assets
Re: Issue 377770 in chromium: 16% regression in dromaeo.jslibtraversejquery
at 272489:272553
Re: Issue 403022 in chromium: constantly disappear unstablen cant used with
microsoft ?
Re: Issue 403019 in chromium: Hangouts unusable
Re: Issue 397552 in chromium: IndexedDB: Add histogram for open times
Re: Issue 400379 in chromium: Remove BT address (server side) when Easy
unlock is turned off
Re: Issue 398047 in chromium: add RTNLGRP_ND_USEROPT functional test
Re: Issue 391109 in chromium: Perf bisect fals with "fatal: git cat-file
<hash>: bad file"
Re: Issue 138613 in chromium: Look into sync notification effectiveness
Re: Issue 403015 in chromium: Security: Authenticated Cross Origin Request
through <script> element
Re: Issue 402684 in chromium: Problem with WebRTC and Hauppage Video
Capture device
Re: Issue 403018 in chromium: Polish UX of "Not <name>?" dialog
Re: Issue 402550 in chromium: trace-viewer fail to build on python 2.7.2
Re: Issue 402257 in chromium: Run extensions_unittests from memory tests
Re: Issue 170607 in chromium: "Synchronization Server is Busy, please try
again later" is displayed while user tries to Sync
Re: Issue 403019 in chromium: Hangouts unusable
Re: Issue 347708 in chromium: Chrome doesn't retry other video modes at
boot.
Re: Issue 402471 in chromium: [Shadow DOM] Content insertion points witch
attribute selector fails with numeric values
Re: Issue 388844 in chromium: Odd font layout with non integral scale
factor on browser UI
Re: Issue 380181 in chromium: getUserMedia - Desktop capture screen sharing
request not visible in extensions with small windows.
Re: Issue 323380 in chromium: Clean up ProfileSyncServiceHarness
Re: Issue 393529 in chromium: Regression : Simultaneously focus is
displaying on 'Sign in' & gear icon of 'Preferences' on www.bing.com
Re: Issue 401291 in chromium: Chromoting displays no video
Re: Issue 402777 in chromium: Regression: Shadow get chopped/cut on CSS
Filters.
Re: Issue 397574 in chromium: Clean up sync gyp files
Issue 403024 in chromium: Need to be able to distinguish "lid not present"
with servo
Re: Issue 402777 in chromium: Regression: Shadow get chopped/cut on CSS
Filters.
Re: Issue 395495 in chromium: Make App Info Dialog available from
chrome://extensions page
Re: Issue 390731 in chromium: Marvell 8897 p82 firmware verification.
Re: Issue 403014 in chromium: Chrome uses 100 - 180% CPU and hangs
immediately upon opening
Re: Issue 392965 in chromium: User-initiated connections failure reasons
Re: Issue 400379 in chromium: Remove BT address (server side) when Easy
unlock is turned off
Re: Issue 344930 in chromium: Implement/port atomic flips on i915
Re: Issue 367549 in chromium: Copy and Paste with a long text in Clipboard
fails
Re: Issue 385505 in chromium: 7.3% regression in
dromaeo.jslibeventprototype at 273150:274261
Re: Issue 392990 in chromium: Reporting of device's connection status
Re: Issue 345165 in chromium: Figure out the console story for freon
Re: Issue 369545 in chromium: UMA metric reporting for user-initiated wifi
scan
Re: Issue 401649 in chromium: [Destiny] Create conductive rig for MP Glimmer
Re: Issue 400768 in chromium: Ash tray UI shows Bluetooth is disabled even
though its enabled and working.
--
--
Automated mail from issue updates at http://crbug.com/
Subscription options: http://groups.google.com/a/chromium.org/group/chromium-bugs

To unsubscribe from this group and stop receiving emails from it, send an email to chromium-bugs+***@chromium.org.
c***@googlecode.com
2014-08-12 22:35:23 UTC
Permalink
Your project notifications generated too many emails to send
individually. Here are the subject lines of the emails you would have
received:

Re: Issue 399792 in chromium: Occasional total Chrome lockup / beach ball
when using Hangouts (QTKit)
Re: Issue 384594 in chromium: Zako/Stumpy/Panther: External monitor doesn't
come up after suspend-unplug-resume-plug scenario.
Re: Issue 402693 in chromium: Cast: audio stops playing forever if there's
a network glitch
Re: Issue 366935 in chromium: Standardize EGL_CHROMIUM_get_sync_values
Re: Issue 391506 in chromium: Screen stays on while using Google Play Music
Re: Issue 399729 in chromium: Convert linux_asan builder to recipes.
Re: Issue 387898 in chromium: WebView can't play audio/video from
file://android_asset/ URLs
Re: Issue 403003 in chromium: Daisy: Not able to install recovery image.
Re: Issue 403056 in chromium: Huge Mouse Cursor
Re: Issue 402693 in chromium: Cast: audio stops playing forever if there's
a network glitch
Re: Issue 402693 in chromium: Cast: audio stops playing forever if there's
a network glitch
Issue 403061 in chromium: Support an event to know when app windows are
occluded
Re: Issue 403061 in chromium: Support an event to know when app windows are
occluded
Re: Issue 399730 in chromium: Convert linux_browser_asan builder to recipes.
Re: Issue 402597 in chromium: Add GBM support for UDL
Re: Issue 395301 in chromium: Android Chromoting: Progress dialog not
visible when connecting to host.
Re: Issue 402597 in chromium: Add GBM support for UDL
Re: Issue 402898 in chromium: Key repeat should not be triggered for
blocked keyboard events.
Re: Issue 402734 in chromium: Client treats all signalling message drops /
timeouts as P2P errors
Re: Issue 402736 in chromium: Crash in [chrome -stl_map.h:837 ]
base::DictionaryValue::GetWithoutPathExpansion
Re: Issue 402735 in chromium: Client sometimes re-connects following a P2P
failure, leading to an "incompatible protocol" failure
Re: Issue 403056 in chromium: Huge Mouse Cursor
Re: Issue 400460 in chromium: ctrl-shift-0 does not reset the UI scale when
there is a browser window
Issue 403062 in chromium: Bluetooth: Status message is blank in the "Add
Bluetooth device" pop-up while pairing Bluetooth device.
Re: Issue 402921 in chromium: Update the iOS deployment target to 7.0
Re: Issue 397708 in chromium:
DelegatedFrameHost::CopyFromCompositingSurface broken in HiDPI
Re: Issue 386314 in chromium: Various USB devices are not detected in
recovery mode
Re: Issue 402693 in chromium: Cast: audio stops playing forever if there's
a network glitch
Re: Issue 402693 in chromium: Cast: audio stops playing forever if there's
a network glitch
Re: Issue 402102 in chromium: Black background color for google maps, in AW
TestShell
Issue 403064 in chromium: pronto word should not return an 'ump' error for
a noop
Re: Issue 402711 in chromium: All 802.1x fail with "Certificate not loaded"
Re: Issue 402693 in chromium: Cast: audio stops playing forever if there's
a network glitch
Re: Issue 402982 in chromium: Unable to type user name and password at
login screen after powerwash/recoevry install
Re: Issue 402737 in chromium: Client reports 403 errors trying to create
relay sessions
Re: Issue 394868 in chromium: mesa: add swrast support for gbm for cirrus
device
Re: Issue 403051 in chromium: Layout is too slow when appending lots of
content
Re: Issue 402739 in chromium: Client doesn't actually stop pestering the
host with messages after the connection has failed
Re: Issue 365844 in chromium: gcc: missing warnings due to
track-macro-expansion, when not using integrated cpp
Re: Issue 402182 in chromium: Peppy fails to start tab mirroring.
Re: Issue 394540 in chromium: go/simplechrome-ify builds from
chromiumos.chromium waterfall
Issue 403066 in chromium: [dom_distiller] display message when distillation
returns nothing
Re: Issue 402993 in chromium: Use SCTP instead of PseudoTCP
Re: Issue 398971 in chromium: I have to sign in to Google Chrome every
start up
Re: Issue 402182 in chromium: Peppy fails to start tab mirroring.
Re: Issue 403051 in chromium: Layout is too slow when appending lots of
content
Re: Issue 379005 in chromium: many bots don't upload to the test-results
server
Re: Issue 304341 in chromium: Move frame specific functionality from
RenderView(Host) to RenderFrame(Host)
Re: Issue 400850 in chromium:
RenderFrameHostManagerTest.AllowTargetedNavigationsAfterSwap is flaky on
TSANv2
Re: Issue 397817 in chromium: Two audio frames with same timestamp cause a
DCHECK fail
Re: Issue 402137 in chromium: Closing the V2 app doesn't disconnect IT2Me
session
Re: Issue 386822 in chromium: Figure out if we can use negative pitch
during rendering of webgl buffers
Issue 403068 in chromium: Testing
Re: Issue 403003 in chromium: Daisy: Not able to install recovery image.
Re: Issue 400850 in chromium:
RenderFrameHostManagerTest.AllowTargetedNavigationsAfterSwap is flaky on
TSANv2
Re: Issue 402210 in chromium: There is no way to get real fullscreen
connecting to Windows machine using V2 app
Re: Issue 304341 in chromium: Move frame specific functionality from
RenderView(Host) to RenderFrame(Host)
Re: Issue 372212 in chromium: fractional scale factor support on cros/linux
in addition to win
Issue 403069 in chromium: Easy Unlock: should not see prompt for permanent
Bluetooth pairing
Re: Issue 402982 in chromium: Unable to type user name and password at
login screen after powerwash/recoevry install
Issue 403070 in chromium: content_browsertests became unstable on valgrind
bot with potential bad memory access (use-after-free?)
Re: Issue 402914 in chromium: Retries broken in recipes
Re: Issue 402732 in chromium: Initialize SecureRandom Properly in
ThirdPartyTokenFetcher.java
Re: Issue 388844 in chromium: Odd font layout with non integral scale
factor on browser UI
Re: Issue 392939 in chromium: Cursor surface does not display on nyan_freon
Issue 403071 in chromium: python test.py is suddenly spammy
Re: Issue 402732 in chromium: Initialize SecureRandom Properly in
ThirdPartyTokenFetcher.java
Re: Issue 362294 in chromium: MS BUG # 629029 : AV glitches during high CPU
load
Re: Issue 402033 in chromium: Show a different repaint rect color for
elements that were painted for the first time
Re: Issue 402735 in chromium: Client sometimes re-connects following a P2P
failure, leading to an "incompatible protocol" failure
Issue 403072 in chromium: Network settings inaccessible.
Re: Issue 402127 in chromium: Update the kernel headers to include
DRM_MODE_CONNECTOR_DSI
Re: Issue 387898 in chromium: WebView can't play audio/video from
file://android_asset/ URLs
Re: Issue 397384 in chromium: When building an image, put the kernel in
both the A and B partitions.
Re: Issue 403051 in chromium: Layout is too slow when appending lots of
content
Re: Issue 393840 in chromium: Backport i915 pm_runtime patches to 3.14
Re: Issue 334269 in chromium: Switch to HarfBuzz for text shaping on Mac
Re: Issue 403070 in chromium: content_browsertests became unstable on
valgrind bot with potential bad memory access (use-after-free?)
Re: Issue 398844 in chromium: Setting video track's enabled field to false,
doesnot transmit a black frame on the remote end.
Re: Issue 402102 in chromium: Black background color for google maps, in AW
TestShell
Re: Issue 334269 in chromium: Switch to HarfBuzz for text shaping on Mac
Re: Issue 400922 in chromium: Fix and re-enable
BenchmarkSmokeTest.thread_times.simple_mobile_sites on Windows
Re: Issue 367401 in chromium: Add a test for DRRS
Re: Issue 403041 in chromium: shill: service: tweak SetProfile logging
Re: Issue 402102 in chromium: Black background color for google maps, in AW
TestShell
Issue 403073 in chromium: SafeBrowsingModuleVerifierWinTest failures on
DrMemory bots
Re: Issue 398844 in chromium: Setting video track's enabled field to false,
doesnot transmit a black frame on the remote end.
Re: Issue 124610 in chromium: clang -integrated-as for Chrome/Android
Re: Issue 402102 in chromium: Black background color for google maps, in AW
TestShell
Re: Issue 403070 in chromium: content_browsertests became unstable on
valgrind bot with potential bad memory access (use-after-free?)
Re: Issue 366804 in chromium: Create an extension for exporting a dma-buf
FD from an egl image
Re: Issue 402943 in chromium: WebNavigationApiTest.OpenTab failing because
of crashes in cc
Re: Issue 402695 in chromium: Screen jitter in MP4 while video is panning
Re: Issue 402943 in chromium: WebNavigationApiTest.OpenTab failing because
of crashes in cc
Re: Issue 360217 in chromium: glScissor not clamping values
Re: Issue 402766 in chromium:
MSE_ClearKey/EncryptedMediaTest.Playback_VP9Video_WebM/0 flaking
Re: Issue 279213 in chromium: No event (waiting buffering stalled suspend)
is fired when audio/video element has no more data to play.
Re: Issue 403068 in chromium: Testing
Re: Issue 402943 in chromium: WebNavigationApiTest.OpenTab failing because
of crashes in cc
Re: Issue 403068 in chromium: Testing
Re: Issue 402713 in chromium: maps_pixel_test is flaky failing on Mac 10.8
Release ATI GPU bot
Re: Issue 402766 in chromium:
MSE_ClearKey/EncryptedMediaTest.Playback_VP9Video_WebM/0 flaking
--
--
Automated mail from issue updates at http://crbug.com/
Subscription options: http://groups.google.com/a/chromium.org/group/chromium-bugs

To unsubscribe from this group and stop receiving emails from it, send an email to chromium-bugs+***@chromium.org.
c***@googlecode.com
2014-08-12 23:31:56 UTC
Permalink
Your project notifications generated too many emails to send
individually. Here are the subject lines of the emails you would have
received:

Re: Issue 274652 in chromium: Switch chromoting client to XMPP instead of
WCS
Issue 403086 in chromium: cros flash improvements: non-chroot mode support
Re: Issue 400011 in chromium: landmines should also clobber developer
checkouts
Re: Issue 274652 in chromium: Switch chromoting client to XMPP instead of
WCS
Re: Issue 403051 in chromium: Layout is too slow when appending lots of
content
Issue 403087 in chromium: ServiceWorker dedicated DevTool panel is empty
Re: Issue 400011 in chromium: landmines should also clobber developer
checkouts
Re: Issue 402162 in chromium: Desktop shortcut avatar doesn't update to
profile photo
Re: Issue 401954 in chromium:
shape-outside-floats-ellipse-margin-right.html is failing
Re: Issue 402537 in chromium: Android webview fails to upload files
Issue 403090 in chromium: frecon: add ebuild
Issue 403091 in chromium: Create link_freon-chromium-pfq and
daisy_freon-chromium-pfq builders
Re: Issue 403078 in chromium: frecon: add to repo manifest
Re: Issue 403084 in chromium: frecon: modify makefile to work with ebuilds
and external CC and CFLAGS
Re: Issue 403071 in chromium: python test.py is suddenly spammy
Re: Issue 402162 in chromium: Desktop shortcut avatar doesn't update to
profile photo
Issue 403092 in chromium: Fix evdev in frecon
Issue 403093 in chromium: cros flash improvements: no auth required for
users with internal Chrome enlistment
Re: Issue 403086 in chromium: cros flash improvements: non-chroot mode
support
Re: Issue 402537 in chromium: Android webview fails to upload files
Re: Issue 402786 in chromium: Auto roll bot is failing to identify
outstanding CLs
Re: Issue 387272 in chromium: VPX decoder crashes for VP9 streams with odd
width or height.
Re: Issue 403007 in chromium: WorkerDevToolsSanityTest.InspectSharedWorker
times out frequenly on Windows
Issue 403095 in chromium: minimize() doesn't work on Mac if the window is
full-screen
Re: Issue 37436 in chromium: [Meta] Update eTLD list for upstream changes
prior to Stable
Issue 403098 in chromium: UNADDRESSABLE ACCESS in PolicyPrefsTest
Issue 403099 in chromium: cros flash improvements: simplified command line
for OS image selection
Re: Issue 311614 in chromium: ReportStage is not run when build times out
(leaving metadata.json orphaned)
Issue 403100 in chromium: Add device status check step to
chrome-proxy-tests bot
Re: Issue 392492 in chromium: Selection.collapse throws errors when it
shouldn't
Re: Issue 225464 in chromium: reconcile Win x64 rel try bot and CQ configs
Re: Issue 402736 in chromium: Crash in [chrome -stl_map.h:837 ]
base::DictionaryValue::GetWithoutPathExpansion
Re: Issue 368278 in chromium: Multiprofiles Mode Google Apps Account Broken
Re: Issue 128460 in chromium: Initiator in Debugger Network Tab
shows "Other" for <embed> Flash object
Re: Issue 403003 in chromium: Daisy: Not able to install recovery image.
Re: Issue 402786 in chromium: Auto roll bot is failing to identify
outstanding CLs
Re: Issue 399469 in chromium: Improve gconv_strip.py speed.
Re: Issue 402987 in chromium: User scripts are not working anymore
Re: Issue 399469 in chromium: Improve gconv_strip.py speed.
Issue 403102 in chromium: Header on Guardian cannot be used as transition
element
Re: Issue 37436 in chromium: [Meta] Update eTLD list for upstream changes
prior to Stable
Issue 403101 in chromium: Locale should determine Accept-Language header
Re: Issue 37436 in chromium: [Meta] Update eTLD list for upstream changes
prior to Stable
Re: Issue 370696 in chromium: Navigation Transitions
Re: Issue 403102 in chromium: Header on Guardian cannot be used as
transition element
Re: Issue 395795 in chromium: daisy: Cannot associate due to corrupt probe
responses
Re: Issue 374103 in chromium: Chameleon: Add the Chameleond driver for
Three-In-One daughter card
Re: Issue 266107 in chromium: shill: prefer user-specific networks over
device-wide networks
Re: Issue 395795 in chromium: daisy: Cannot associate due to corrupt probe
responses
Re: Issue 398975 in chromium: Measure overhead of small files on 4K-block
file system
Re: Issue 402943 in chromium: WebNavigationApiTest.OpenTab failing because
of crashes in cc
Re: Issue 402786 in chromium: Auto roll bot is failing to identify
outstanding CLs
Issue 403104 in chromium: Chromecast resources (tracking)
Re: Issue 400460 in chromium: ctrl-shift-0 does not reset the UI scale when
there is a browser window
Re: Issue 399070 in chromium: Build a ubuntu image for GCE
Re: Issue 402982 in chromium: Unable to type user name and password at
login screen after powerwash/recoevry install
Re: Issue 403075 in chromium: Input doens't work on Google+ Chat -
Butterfly, Parrot
Re: Issue 388465 in chromium: Increase enterprise user reporting limit.
Re: Issue 384185 in chromium: shill: cellular: Enable Verizon OTA activation
Re: Issue 398262 in chromium: Canary master should close the tree on slave
failures
Re: Issue 394436 in chromium: Chameleon: Duplicate various connection
combinations
Re: Issue 402786 in chromium: Auto roll bot is failing to identify
outstanding CLs
Re: Issue 311614 in chromium: ReportStage is not run when build times out
(leaving metadata.json orphaned)
Re: Issue 402736 in chromium: Crash in [chrome -stl_map.h:837 ]
base::DictionaryValue::GetWithoutPathExpansion
Re: Issue 402808 in chromium: walgreens wont load
Re: Issue 400011 in chromium: landmines should also clobber developer
checkouts
Issue 403105 in chromium: Missing X to close in blue-space
Re: Issue 396292 in chromium: Add graph for CQ false rejection rate
Re: Issue 266107 in chromium: shill: prefer user-specific networks over
device-wide networks
Issue 403106 in chromium: Navigation transitions do not take scroll
position into account
Re: Issue 403105 in chromium: Missing X to close in blue-space
Re: Issue 402207 in chromium: Autofill settings doesn't show organization
(company)
Re: Issue 398262 in chromium: Canary master should close the tree on slave
failures
Re: Issue 399318 in chromium: Make all canary slaves non-tree closer
Re: Issue 401193 in chromium: shill: "has_ever_connected" is improperly
cleared on profile load
Issue 403107 in chromium: V2 apps do not have their own entry in the
Cmd-Tab order on Mac
Re: Issue 336558 in chromium: Implement power monitoring platform APIs on
Win
Re: Issue 403051 in chromium: Layout is too slow when appending lots of
content
Re: Issue 380650 in chromium: Rietveld one-click revert does not work after
new ndb Reitveld version
Re: Issue 402779 in chromium: The animated favicon doesn't work in google
Chrome .
Re: Issue 403061 in chromium: Support an event to know when app windows are
occluded
Re: Issue 402736 in chromium: Crash in [chrome -stl_map.h:837 ]
base::DictionaryValue::GetWithoutPathExpansion
Re: Issue 395795 in chromium: daisy: Cannot associate due to corrupt probe
responses
Re: Issue 402747 in chromium: Background-Image Bugs while scrolling
Re: Issue 403051 in chromium: Layout is too slow when appending lots of
content
Issue 403109 in chromium: Chromoting v2 app stalls on "Connecting..."
spinner, due to Native Client errors
Re: Issue 403107 in chromium: V2 apps do not have their own entry in the
Cmd-Tab order on Mac
Issue 403110 in chromium: Add all standard emojis to ChromeVox
Re: Issue 403109 in chromium: Chromoting v2 app stalls on "Connecting..."
spinner, due to Native Client errors
Issue 403111 in chromium: Crash in [chrome -event_dispatcher.cc:48 ]
ui::EventDispatcherDelegate::DispatchEvent
Re: Issue 403098 in chromium: UNADDRESSABLE ACCESS in PolicyPrefsTest
Issue 403112 in chromium: Navigations transitions do not run smoothly
Re: Issue 370696 in chromium: Navigation Transitions
Re: Issue 403112 in chromium: Navigations transitions do not run smoothly
Re: Issue 391008 in chromium: ChromeVox: focus and speech always follow
mouse cursor on touch devices
Re: Issue 403098 in chromium: UNADDRESSABLE ACCESS in PolicyPrefsTest
Re: Issue 402859 in chromium: Regression: Download progress bar is seen
already filled for apps added second time in App Launcher.
Re: Issue 403098 in chromium: UNADDRESSABLE ACCESS in PolicyPrefsTest
Re: Issue 400011 in chromium: landmines should also clobber developer
checkouts
Re: Issue 368834 in chromium: Simplify sync data type enable and disable
logic
Re: Issue 403098 in chromium: UNADDRESSABLE ACCESS in PolicyPrefsTest
Re: Issue 402808 in chromium: walgreens wont load
--
--
Automated mail from issue updates at http://crbug.com/
Subscription options: http://groups.google.com/a/chromium.org/group/chromium-bugs

To unsubscribe from this group and stop receiving emails from it, send an email to chromium-bugs+***@chromium.org.
c***@googlecode.com
2014-08-14 18:55:36 UTC
Permalink
Your project notifications generated too many emails to send
individually. Here are the subject lines of the emails you would have
received:

Re: Issue 399146 in chromium: Android autofill profile editor should use
locale-aware inputs
Re: Issue 402422 in chromium: History won't delete
Re: Issue 403747 in chromium: Tap bounding boxes should include more than
just the touch release
Re: Issue 402359 in chromium: Flickering caused by compositor-driven
scrolling with non-composited fixed position elements
Re: Issue 403035 in chromium: Chromevox highlight is not shown above a
modal <dialog>
Re: Issue 397498 in chromium: Regression: Localization applied for only
single app in App launcher
Re: Issue 402080 in chromium: Paygen should not retry the stage on test
failures
Re: Issue 394444 in chromium: Janky scrolling in PDF
Re: Issue 402422 in chromium: History won't delete
Re: Issue 352942 in chromium: Regression: navigator.maxTouchPoints = 1 in
Chrome Canary Desktop on Windows 7 (no touch capability)
Re: Issue 396231 in chromium: chrome://system: "/bin/cat:
/tmp/boot-times-sent: No such file or directory"
Issue 403864 in chromium: What timing of release suite on Snow
Re: Issue 401118 in chromium: PDF files are loading with incorrect color
schemes including, but not limited to pinks and greens
Issue 403865 in chromium: WebView.getHitTestResult().getType() Returns
UNKNOWN_TYPE on Text Link on Android 4.4
Re: Issue 399146 in chromium: Android autofill profile editor should use
locale-aware inputs
Re: Issue 389215 in chromium: Video on twitch.tv pegs the CPU
Re: Issue 397498 in chromium: Regression: Localization applied for only
single app in App launcher
Re: Issue 403740 in chromium: Chrome fails to load apps for other Chrome
users on startup
Re: Issue 380227 in chromium: In-browser warning in advance of NPAPI
disappearing
Re: Issue 403740 in chromium: Chrome fails to load apps for other Chrome
users on startup
Re: Issue 403831 in chromium: If API level is <16, disallow unlocking
because we don't know whether the phone has a PIN/pattern or not
Re: Issue 385359 in chromium: Remove users' ability to allow NPAPI plug-ins
to "Always run on this site"
Re: Issue 385364 in chromium: Remove enterprise whitelisting option for
NPAPI
Re: Issue 383553 in chromium: On Mac OS X 10.9, chrome://memory is
partially broken, and UMA memory reporting is fully broken
Re: Issue 403583 in chromium: WON'T WORK
Re: Issue 403589 in chromium: gracvias
Re: Issue 403591 in chromium: ERROR
Re: Issue 395380 in chromium: Can't change to another release channel
Re: Issue 403637 in chromium: error de ambas aplicación computadora y
dispositivo androides
Re: Issue 388389 in chromium: Grubhub scrolling seems raster bound
Re: Issue 387959 in chromium: Breakpad breaks under the bootstrap sandbox
Issue 403867 in chromium: HistoricNetworkStatsInfoToValue
Re: Issue 399113 in chromium: Chrome to Git: "Official Build:
deadbeefdeadbeef..." instead of "Official Build: 1223456"
Re: Issue 43667 in chromium: Mac doesn't sleep when Chrome is running.
Re: Issue 403867 in chromium: HistoricNetworkStatsInfoToValue only gets
pref updates every hour on desktop
Re: Issue 396820 in chromium: Pop up windows open in same window
Re: Issue 386772 in chromium: Unblock color bitmap fonts
Re: Issue 396820 in chromium: Pop up windows open in same window
Re: Issue 399146 in chromium: Android autofill profile editor should use
locale-aware inputs
Re: Issue 403787 in chromium: 25.2%-69.5% regression in blink_perf at
289159:289184
Re: Issue 392170 in chromium: --disable-web-security doesn't allow for
cross-domain access anymore
Re: Issue 402087 in chromium: Need python-magic module
Re: Issue 1019 in chromium: Set image as wallpaper (update: You can now
grab the extension from the gallery)
Re: Issue 399146 in chromium: Android autofill profile editor should use
locale-aware inputs
Re: Issue 403142 in chromium: ImageTest:TestValidInterpreter fails to parse
files that aren't readable by non-root
Issue 403868 in chromium: Update home card UI to match mocks
Re: Issue 403834 in chromium: Calculate sha1 and sha256 for payloads during
Paygen
Re: Issue 402807 in chromium: scrollHeight does not changes in Beta version
with change in font-size of div
Re: Issue 402918 in chromium: NumLock does not work on USB keyboards
Issue 403869 in chromium: Debug built crashes on start using Linux kernel
3.16 due to SHMMAX change
Re: Issue 352942 in chromium: Regression: navigator.maxTouchPoints = 1 in
Chrome Canary Desktop on Windows 7 (no touch capability)
Re: Issue 402807 in chromium: scrollHeight does not changes in Beta version
with change in font-size of div
Issue 403870 in chromium: Ozone-Freon cursor sluggish
Issue 403871 in chromium: Simple proxy is down
Re: Issue 402807 in chromium: scrollHeight does not changes in Beta version
with change in font-size of div
Re: Issue 391652 in chromium: Windows task manager shows running 32 bit
version Chrome Canary instead 64 bit
Issue 403872 in chromium: Remove PersonalAutofillPopulator
Re: Issue 403869 in chromium: Debug built crashes on start using Linux
kernel 3.16 due to SHMMAX change
Re: Issue 357774 in chromium: Remove
apps-gallery-install-auto-confirm-for-tests command line flag
Re: Issue 403859 in chromium: [mirror] Increase spacing between icon and
text label
Re: Issue 401963 in chromium: webrtc/libjingle logging broken on windows
Re: Issue 400145 in chromium: Unable to play HTTP live streaming (HLS)
Re: Issue 352942 in chromium: Regression: navigator.maxTouchPoints = 1 in
Chrome Canary Desktop on Windows 7 (no touch capability)
Re: Issue 31519 in chromium: rpm install does not respect --prefix option
Re: Issue 403870 in chromium: Ozone-Freon cursor sluggish
Re: Issue 403747 in chromium: Tap bounding boxes should include more than
just the touch release
Re: Issue 394692 in chromium: If DirectWrite flag is enabled font weights
for Segoe UI are not handled properly
Re: Issue 352942 in chromium: Regression: navigator.maxTouchPoints = 1 in
Chrome Canary Desktop on Windows 7 (no touch capability)
Re: Issue 401802 in chromium: [Destiny] Setup two conductive rigs for alex
& daisy
Issue 403873 in chromium: Add Seek interface to StringDataSource
Re: Issue 403869 in chromium: Debug built crashes on start using Linux
kernel 3.16 due to SHMMAX change
Re: Issue 403873 in chromium: Add Seek interface to StringDataSource
Issue 403874 in chromium: Search index stale
Re: Issue 248918 in chromium: Implement navigator.maxTouchPoints
Issue 403876 in chromium: devtools touch emulation doesn't affect
navigator.maxTouchPoints
Re: Issue 403870 in chromium: Ozone-Freon cursor sluggish on pixel
Re: Issue 399055 in chromium: Restore window assets
Issue 403878 in chromium: Add Seek interface to file data source
Issue 403879 in chromium: process w:space attribute on borders in core
Re: Issue 403536 in chromium: Rename Client type to ServiceWorkerClient
Re: Issue 403083 in chromium: Combine LocationBarController::Action and
ExtensionToolbarModel::Action
Re: Issue 400933 in chromium: Use the webrtc::AudioProcessing float
interface in MediaStreamAudioProcessor
Re: Issue 402543 in chromium: Update to VS2013 Update3
Re: Issue 402119 in chromium: Guest mode crashes
Re: Issue 399660 in chromium: Update desktop placeholder avatar to latest
design
Re: Issue 403628 in chromium: RangeHistoryWebUITest.monthViewGrouped timing
out on drmemory bot
Re: Issue 399660 in chromium: Update desktop placeholder avatar to latest
design
Re: Issue 392749 in chromium: Regression: Scroll text is not displayed
properly.
Re: Issue 402543 in chromium: Update to VS2013 Update3
Re: Issue 402119 in chromium: Guest mode crashes
Re: Issue 403687 in chromium: A couple of tests in SSLUITest are timing out
on drmemory bots
Re: Issue 403628 in chromium: RangeHistoryWebUITest.monthViewGrouped timing
out on drmemory bot
Re: Issue 402119 in chromium: Guest mode crashes
Re: Issue 392749 in chromium: Regression: Scroll text is not displayed
properly.
Re: Issue 400933 in chromium: Use the webrtc::AudioProcessing float
interface in MediaStreamAudioProcessor
Re: Issue 403083 in chromium: Combine LocationBarController::Action and
ExtensionToolbarModel::Action
Re: Issue 402543 in chromium: Update to VS2013 Update3
Issue 403880 in chromium: Integrate the Seek() interface with XML parser
Re: Issue 354261 in chromium: Make pure GN build work on Windows
Re: Issue 304309 in chromium: TabStripModelTest.FastShutdown failing on
Blink Mac canary bots
Re: Issue 397741 in chromium: Print Preview UI refresh
Re: Issue 402051 in chromium: WebKit Linux ASAN timing out during
webkit_tests
--
--
Automated mail from issue updates at http://crbug.com/
Subscription options: http://groups.google.com/a/chromium.org/group/chromium-bugs

To unsubscribe from this group and stop receiving emails from it, send an email to chromium-bugs+***@chromium.org.
c***@googlecode.com
2014-08-19 17:21:12 UTC
Permalink
Your project notifications generated too many emails to send
individually. Here are the subject lines of the emails you would have
received:

Re: Issue 400489 in chromium: GA error: FileStore should check if window is
null before persisting cache
Re: Issue 405010 in chromium: DCHECK keeps failing on OOBE in Debug mode
Re: Issue 400489 in chromium: GA error: FileStore should check if window is
null before persisting cache
Re: Issue 405010 in chromium: DCHECK keeps failing on OOBE in Debug mode
Re: Issue 313532 in chromium: Get will-change into spec: Its crazy hard as
a web developer to make layers
Re: Issue 313573 in chromium: Layers created with
-webkit-backface-visibility: hidden force child layer creation
Re: Issue 405057 in chromium: Accessibility: add tab and keyboard
navigation to Windows user menu
Re: Issue 378975 in chromium: Add a flag to let render wait for gdb & Java
debugger during startup
Re: Issue 404405 in chromium: Volume controls do not work while the menu is
visible
Re: Issue 400651 in chromium: Tabs need to be restored after every reboot
Re: Issue 404952 in chromium: Add --install support to cros flash so it can
fully replace image_to_usb.sh
Issue 405093 in chromium: 2.2%-16.1% regression in
page_cycler.top_10_mobile at 287147:287221
Re: Issue 405093 in chromium: 2.2%-16.1% regression in
page_cycler.top_10_mobile at 287147:287221
Issue 405094 in chromium: 1.3%-861.3% regression in smoothness benchmarks
at 280183:282786
Re: Issue 405094 in chromium: 1.3%-861.3% regression in smoothness
benchmarks at 280183:282786
Re: Issue 363812 in chromium: chromeos-3.10: update r8152 driver to support
USB 3.0 RTL8153 dongle
Re: Issue 363812 in chromium: chromeos-3.10: update r8152 driver to support
USB 3.0 RTL8153 dongle
Re: Issue 393873 in chromium: Typecheck JavaScript with Closure Compiler
Re: Issue 389159 in chromium: Monitor if a video capture device sends
frames and in case of time out do something sensible
Re: Issue 365851 in chromium: Consolidate the hi DPI / lo DPI compositing
triggers behind a single flag
Re: Issue 388780 in chromium: Implement geometry interfaces
Re: Issue 388780 in chromium: Implement geometry interfaces
Re: Issue 345520 in chromium: Entering emulated device mode for a mobile
device should make compositor behavoir mimic android
Re: Issue 393873 in chromium: Typecheck JavaScript with Closure Compiler
Issue 405096 in chromium: Chrome storage API doesn't work in DevTools
extension when docked
Re: Issue 356207 in chromium: Make will-change:clip create a clipping layer
Re: Issue 140781 in chromium: DevTools: UX change to speed up development
cycle
Re: Issue 379155 in chromium: Infinite intrinsic size for images result in
zero sized images in Windows
Re: Issue 389159 in chromium: Monitor if a video capture device sends
frames and in case of time out do something sensible
Re: Issue 405073 in chromium: Impl-side painting is very slow on obscenely
large pages
Re: Issue 404650 in chromium: LatencyInfo has high GPU process overhead
Issue 405097 in chromium: User's UI language is not configurable
Re: Issue 402983 in chromium: RenderLayer calls
RenderObject::mapRectToPaintInvalidationBacking with wrong parameters
Re: Issue 403979 in chromium: hyperlinks' underlines not rendered correctly
Issue 405098 in chromium: Display host out-of-date warning on the host
Re: Issue 402994 in chromium: RenderInline calls
RenderObject::mapRectToPaintInvalidationBacking with wrong parameters
Issue 405099 in chromium: unit tests on branch failing due to sqlalchemy
import
Re: Issue 405073 in chromium: Impl-side painting is very slow on obscenely
large pages
Re: Issue 404650 in chromium: LatencyInfo has high GPU process overhead
Issue 405100 in chromium: Kernel hang in memory allocator
Issue 405101 in chromium: [Android WebView] Reset parent draw constraints
on tear down
Re: Issue 405102 in chromium: 3.6%-54.2% regression in
scheduler.tough_scheduling_cases at 289800:289837
Issue 405102 in chromium: 3.6%-54.2% regression in
scheduler.tough_scheduling_cases at 289800:289837
Re: Issue 393777 in chromium: Chrome-Git Migration: Official:
master.chrome.continuous
Re: Issue 402983 in chromium: RenderLayer calls
RenderObject::mapRectToPaintInvalidationBacking with wrong parameters
Re: Issue 378948 in chromium: Clip-path seems to cause re-paint on transform
Re: Issue 405067 in chromium: If "Default" CA certs is selected in EAP,
Network config UI writes an empty CACertPEM to Shill.
Re: Issue 405067 in chromium: If "Default" CA certs is selected in EAP,
Network config UI writes an empty CACertPEM to Shill.
Re: Issue 396980 in chromium: Chrome doesn't hide the OS X menu bar after
entering fullscreen mode when having multiple screens.
Re: Issue 404634 in chromium: New window animation triggered on initiating
drag and drop
Re: Issue 405028 in chromium: Regression: Chrome crashes as soon as user is
signed in with 'Enterprise managed bookmark' credentials.
Re: Issue 405099 in chromium: unit tests on branch failing due to
sqlalchemy import
Re: Issue 379155 in chromium: Infinite intrinsic size for images result in
zero sized images in Windows
Re: Issue 393777 in chromium: Chrome-Git Migration: Official:
master.chrome.continuous
Re: Issue 396980 in chromium: Chrome doesn't hide the OS X menu bar after
entering fullscreen mode when having multiple screens.
Re: Issue 397004 in chromium: 3.6%-66.7% regression in page_cycler.dhtml at
285012:285039
Re: Issue 404878 in chromium: WebRTC Local Audio is broken on page reload
Re: Issue 270421 in chromium: [Android] Forward and play host audio
Re: Issue 270421 in chromium: [Android] Forward and play host audio
Re: Issue 236588 in chromium: Wifi speed video lags on webm videos
Issue 405104 in chromium: Non-visible tiles from large PictureLayerImpl are
drawn by the browser compositor on www.revolveclothing.com
Re: Issue 403042 in chromium: logging_CrashSender ignores the output of
crash_sender
Re: Issue 404482 in chromium: 1.1%-106.8% regression in
tab_switching.top_10 at 290064:290085
Re: Issue 351636 in chromium: Replace NPObject usage in ppapi with gin
Re: Issue 390492 in chromium: Bookmarks are not displayed when offline
Re: Issue 405081 in chromium: 16.1%-341.9% regression in
smoothness.tough_pinch_zoom_cases at 279734:279882
Re: Issue 399671 in chromium: telemetry smoothness test on top_25 could
have a bogus 400+ms frame time reported
Re: Issue 405067 in chromium: If "Default" CA certs is selected in EAP,
Network config UI writes an empty CACertPEM to Shill.
Re: Issue 405104 in chromium: Non-visible tiles from large PictureLayerImpl
are drawn by the browser compositor on www.revolveclothing.com
Issue 405105 in chromium: Regression: Mac Reload and Chrome Menu icons
broken.
Re: Issue 404420 in chromium: Chrome Remote Desktop client sees significant
delays in signaling messaegs, leading to ERROR_P2P_FAILUREs
Re: Issue 405047 in chromium: need freon pfq builders
Re: Issue 405106 in chromium: 1.2%-19.9% regression in
startup.cold.dirty.blank_page at 289644:289825
Issue 405106 in chromium: 1.2%-19.9% regression in
startup.cold.dirty.blank_page at 289644:289825
Re: Issue 405105 in chromium: Regression: Mac Reload and Chrome Menu icons
broken.
Issue 405107 in chromium: Create a dashboard view for bvt-cq tests
Re: Issue 405097 in chromium: User's UI language is not configurable
Re: Issue 399671 in chromium: telemetry smoothness test on top_25 could
have a bogus 400+ms frame time reported
Re: Issue 395044 in chromium: [Mirror] Guest profile doesn't honor
IncognitoModeAvailability policy setting
Re: Issue 391739 in chromium: 92.7% regression in
scheduler.tough_scheduling_cases at 279837:281059
19 issues changed in chromium
Re: Issue 405058 in chromium: [REGRESSION] DevTools: undo in elements panel
does not work
Issue 405108 in chromium: Add trybot cycle time graphs to
chrome-monitor.appspot.com
Re: Issue 393873 in chromium: Typecheck JavaScript with Closure Compiler
Re: Issue 402089 in chromium: Retry failed tests by default
Re: Issue 393873 in chromium: Typecheck JavaScript with Closure Compiler
Re: Issue 404717 in chromium: 2.4%-16% regression in blink_perf at
290182:290188
Re: Issue 323212 in chromium: telemetry_unittests on blink master does not
upload to test-results.appspot
Re: Issue 405105 in chromium: Regression: Mac Reload and Chrome Menu icons
broken.
Re: Issue 382080 in chromium: google-talk plugin 5.4.1.0-1 crashes
Re: Issue 405099 in chromium: unit tests on branch failing due to
sqlalchemy import
Re: Issue 405108 in chromium: Add trybot cycle time graphs to
chrome-monitor.appspot.com
Re: Issue 389238 in chromium: Collect stats for individual bot cycle times
Re: Issue 393873 in chromium: Typecheck JavaScript with Closure Compiler
Re: Issue 374175 in chromium: Media-queries for screen size transiently
incorrect during page load
Re: Issue 344568 in chromium: [Pinch-to-zoom] Move Clank overlay scrollbars
out of Blink
Re: Issue 405108 in chromium: Add trybot cycle time graphs to
chrome-monitor.appspot.com
Re: Issue 368058 in chromium: Determine why bluetooth tests fail in
conductive rigs
Re: Issue 399671 in chromium: telemetry smoothness test on top_25 could
have a bogus 400+ms frame time reported
Re: Issue 399671 in chromium: telemetry smoothness test on top_25 could
have a bogus 400+ms frame time reported
Issue 405109 in chromium: [Daisy] No Image on external monitor after
Re: Issue 393873 in chromium: Typecheck JavaScript with Closure Compiler
--
--
Automated mail from issue updates at http://crbug.com/
Subscription options: http://groups.google.com/a/chromium.org/group/chromium-bugs

To unsubscribe from this group and stop receiving emails from it, send an email to chromium-bugs+***@chromium.org.
c***@googlecode.com
2014-08-19 18:09:32 UTC
Permalink
Your project notifications generated too many emails to send
individually. Here are the subject lines of the emails you would have
received:

Re: issue 402357 in chromium: Regression: The browser crashes on Sign-out.
Issue 405116 in chromium: 1.5%-9.3% regression in
scheduler.tough_scheduling_cases at 289938:290086
Re: Issue 405116 in chromium: 1.5%-9.3% regression in
scheduler.tough_scheduling_cases at 289938:290086
Re: Issue 128457 in chromium: Can't disconnect/cancel VPN connection while
its connecting
Re: Issue 405109 in chromium: [Daisy] No Image on external monitor after
Re: Issue 362315 in chromium: MRU stack for Athena
Re: Issue 405036 in chromium: audio streaming constantly choppy
Re: Issue 405099 in chromium: testToTCompatibility should not run on
branches
Re: Issue 404881 in chromium: shill: ip_address_store: no Contains()
function
Re: Issue 404955 in chromium: Regression: Weird behavior is seen after
cancelling the print preview for 2D Canvas Experiment
Re: Issue 405116 in chromium: 1.5%-9.3% regression in
scheduler.tough_scheduling_cases at 289938:290086
Re: Issue 405099 in chromium: testToTCompatibility should not run on
branches
Re: Issue 400781 in chromium: Incorrect rendering in WebGL with D3D11 ANGLE
Re: Issue 368925 in chromium: Layout managers should use window events
instead of e.g. SetChildBoundsDirect
Issue 405118 in chromium: 1.3%-4% regression in page_cycler.bloat at
290083:290142
Re: Issue 405118 in chromium: 1.3%-4% regression in page_cycler.bloat at
290083:290142
Re: Issue 405120 in chromium: 6.2% regression in page_cycler.morejs at
290249:290255
Issue 405120 in chromium: 6.2% regression in page_cycler.morejs at
290249:290255
Issue 405121 in chromium: 4.8% regression in page_cycler.intl_hi_ru at
290187:290188
Re: Issue 405121 in chromium: 4.8% regression in page_cycler.intl_hi_ru at
290187:290188
Re: Issue 405122 in chromium: 3.7% regression in page_cycler.morejs at
289895:289925
Issue 405123 in chromium: apps grid / custom pages in Athena home card
Issue 405122 in chromium: 3.7% regression in page_cycler.morejs at
289895:289925
Re: Issue 404203 in chromium: Extension icons are not scaled down from
larger resolutions
Re: Issue 405099 in chromium: testToTCompatibility should not run on
branches
Re: Issue 403868 in chromium: Update home card UI to match mocks
Re: Issue 404203 in chromium: Extension icons are not scaled down from
larger resolutions
Issue 405125 in chromium: media/media-controls-clone-crash.html leak
reported
Re: Issue 405126 in chromium: 1.1% regression in
smoothness.key_mobile_sites at 288621:288621
Re: Issue 404736 in chromium: I get "This extension may have been corrupted
by malware: when using PasswordBox
Issue 405126 in chromium: 1.1% regression in smoothness.key_mobile_sites at
288621:288621
Re: Issue 404892 in chromium: Ruby does not render correctly if rb is not
closed
Re: Issue 371584 in chromium: Long lag after seeking during video
Issue 405129 in chromium: 1.3%-4.7% regression in
page_cycler.intl_es_fr_pt-BR at 288930:289055
Re: Issue 405129 in chromium: 1.3%-4.7% regression in
page_cycler.intl_es_fr_pt-BR at 288930:289055
Issue 405128 in chromium: 8.1% regression in page_cycler.intl_ko_th_vi at
284418:284420
Re: Issue 405128 in chromium: 8.1% regression in page_cycler.intl_ko_th_vi
at 284418:284420
Re: Issue 375530 in chromium: Error in background page of cast extension:
Unchecked runtime.lastError while running cast.channel.send: Unknown
Issue 405130 in chromium: Hangouts should pass OAuth Token when calling
into It2meHelpee
Issue 405131 in chromium: TaskBar Icon resolution changes after refresh
when using --app switch
Re: Issue 402247 in chromium: Youtube speed option does not work. (Found
the origin of the problem hope you guys can fix it)
Re: Issue 404424 in chromium: Voice Recognition no longer present
Re: Issue 405099 in chromium: testToTCompatibility should not run on
branches
Re: Issue 405129 in chromium: 1.3%-4.7% regression in
page_cycler.intl_es_fr_pt-BR at 288930:289055
Re: Issue 404934 in chromium: IME extension's options pages are broken
Re: Issue 32967 in chromium: Some feeds not properly detected by the RSS
extensions
Re: Issue 400401 in chromium: make waterfall dropdown in the top-right
sticky (i.e. localstorage)
Re: Issue 365877 in chromium: Unified approach to override default-tile-size
Re: Issue 405077 in chromium: Exceptions no longer thrown
Re: Issue 405132 in chromium: 11.3% regression in startup.cold.blank_page
at 286240:286289
Issue 405132 in chromium: 11.3% regression in startup.cold.blank_page at
286240:286289
Re: Issue 400401 in chromium: make waterfall dropdown in the top-right
sticky (i.e. localstorage)
Re: Issue 405132 in chromium: 11.3% regression in startup.cold.blank_page
at 286240:286289
Re: Issue 405126 in chromium: 1.1% regression in
smoothness.key_mobile_sites at 288621:288621
Re: Issue 404934 in chromium: IME extension's options pages are broken
Re: Issue 401253 in chromium: ADNS not enabled on some ChromeOS systems
Re: Issue 404991 in chromium: Regression: Plugins blocked icon not shown
for PDF file on blocking plugins.
Re: Issue 403734 in chromium: Regression : Drop down list is not displaying
properly on www.hdfcbank.com
Re: Issue 405050 in chromium: Regression: Able to create supervised user
with same name as that of the existing one available in the import list.
Re: Issue 405050 in chromium: Regression: Able to create supervised user
with same name as that of the existing one available in the import list.
Re: Issue 396827 in chromium: Project Mirror : Sync error notification is
not displayed in the hot dog settings menu [Mac]
Re: Issue 404892 in chromium: Ruby does not render correctly if rb is not
closed
Re: Issue 404809 in chromium: Make incremental_chrome_dll work in Release
Re: Issue 396827 in chromium: Project Mirror : Sync error notification is
not displayed in the hot dog settings menu [Mac]
Re: Issue 161960 in chromium: MRU Tab switching
Re: Issue 405131 in chromium: TaskBar Icon resolution changes after refresh
when using --app switch
Re: Issue 404955 in chromium: Regression: Weird behavior is seen after
cancelling the print preview for 2D Canvas Experiment
10 issues changed in chromium
Issue 405133 in chromium: Clicking on the graph for combined alerts should
graph all combined alerts
Re: Issue 403734 in chromium: Regression : Drop down list is not displaying
properly on www.hdfcbank.com
Re: Issue 376606 in chromium: mac_chromium_rel and mac_chromium_compile_dbg
regularly have many pending jobs
Re: Issue 384113 in chromium: crrev.com/<revision> should redirect to the
gitiles view of the matching chromium SVN commit
Re: Issue 395627 in chromium: Regression: Autofill selection effect is
still seen even if selected value is removed in www.wikipedia.org.
Re: Issue 401856 in chromium: flakiness dashboard needs to work in a
git-only world
Issue 405134 in chromium:
fast/forms/calendar-picker/datepicker-crash-after-keydown.html flaky in ASAN
Re: Issue 404717 in chromium: 2.4%-16% regression in blink_perf at
290182:290188
Re: Issue 404952 in chromium: Add --install support to cros flash so it can
fully replace image_to_usb.sh
Re: Issue 393777 in chromium: Chrome-Git Migration: Official:
master.chrome.continuous
Re: Issue 395805 in chromium: gtest results json does not include retry
information.
Re: Issue 405135 in chromium: 1.2%-1.9% regression in page_cycler.bloat at
288362:288471
Issue 405135 in chromium: 1.2%-1.9% regression in page_cycler.bloat at
288362:288471
Re: Issue 405099 in chromium: testToTCompatibility should not run on
branches
Re: Issue 390705 in chromium: [Stumpy, Zako, panther] Secondary monitor
lost display after unplug/hotplug
Re: Issue 405109 in chromium: [Daisy] No Image on external monitor or
internal display after suspend/resume via lid close
Re: Issue 404656 in chromium: ViewHostMsg_DidChangeScrollOffset is
redundant and costly
Re: Issue 236462 in chromium: Remove MathML
Re: Issue 404407 in chromium: Chrome: Crash Report -
SystemMenuModelDelegate::GetLabelForCommandId
Re: Issue 399578 in chromium: Hanging on certain websites - only when using
IPv6
Re: Issue 404915 in chromium: Mismatch between sizes alerts and graphs
Re: Issue 404656 in chromium: ViewHostMsg_DidChangeScrollOffset is
redundant and costly
Re: Issue 399578 in chromium: Hanging on certain websites - only when using
IPv6
Re: Issue 404407 in chromium: Chrome: Crash Report -
SystemMenuModelDelegate::GetLabelForCommandId
Issue 405137 in chromium: Compile failures on 8011 builder: Stable
Re: Issue 404285 in chromium: Unnecessary request for a cached resource
Re: Issue 395805 in chromium: gtest results json does not include retry
information.
Re: Issue 394283 in chromium: 1.5%-30.2% regression in page_cycler.morejs
at 277549:281762
Re: Issue 404958 in chromium: 9.2%-22.9% regression in page_cycler.moz at
281763:282472
Re: Issue 405074 in chromium: Add pdbs to isolate files
Re: Issue 405137 in chromium: Compile failures on 8011 builder: Stable
Re: Issue 404924 in chromium: I can't get rid of uninstalled extensions
Re: Issue 405041 in chromium: Google Chrome is allowing the untrusted
websites to run the javascript
Re: Issue 165079 in chromium: Many contractions using traditional ("curly")
apostrophes are not recognized by the English spellcheck
--
--
Automated mail from issue updates at http://crbug.com/
Subscription options: http://groups.google.com/a/chromium.org/group/chromium-bugs

To unsubscribe from this group and stop receiving emails from it, send an email to chromium-bugs+***@chromium.org.
c***@googlecode.com
2014-08-19 22:16:39 UTC
Permalink
Your project notifications generated too many emails to send
individually. Here are the subject lines of the emails you would have
received:

Re: Issue 405295 in chromium: Dependency on infobars_core from chrome_child
Re: Issue 405299 in chromium: "The command line is too long." on Win perf
bot
Re: Issue 384597 in chromium: NativeViewGLSurfaceEGL:RealSwapBuffers takes
up to 16ms CPU time on Moto E
Re: Issue 404922 in chromium: Chrome 38 Dev - Context menu display off
screen
Re: Issue 378338 in chromium: Unable to create a supervised user as
some "TPM error" message is shown.
Re: Issue 378338 in chromium: Unable to create a supervised user as
some "TPM error" message is shown.
Re: Issue 378338 in chromium: Unable to create a supervised user as
some "TPM error" message is shown.
Re: Issue 405297 in chromium: Auto-branch Skia at Chrome branch point
Issue 405303 in chromium: page_cycler.intl_ko_th_vi flaky on Windows
Re: Issue 402338 in chromium: Chrome_Android: Crash Report -
blink::Node::commonAncestor
Re: Issue 405040 in chromium: PrivetLocalPrinterListerTest.PrinterAddedTest
is flaky under Valgrind
Re: Issue 405303 in chromium: page_cycler.intl_ko_th_vi flaky on Windows
Re: Issue 341356 in chromium: The new Chromebox will appear as chromebook
on other devices
Re: Issue 378338 in chromium: Unable to create a supervised user as
some "TPM error" message is shown.
Re: Issue 405299 in chromium: "The command line is too long." on Win perf
bot
Re: Issue 405299 in chromium: "The command line is too long." on Win perf
bot
Re: Issue 404823 in chromium: buildbot failure emails are not being sent to
devs on the blamelist
Re: Issue 405266 in chromium: Every Android perf bisect fails with
AttributeError
Re: Issue 401809 in chromium: Can't type into omnibox on very first launch
Re: Issue 404407 in chromium: Chrome: Crash Report -
SystemMenuModelDelegate::GetLabelForCommandId
Re: Issue 404856 in chromium: Bluetooth not found on new M-39 Canary
Re: Issue 358271 in chromium: Implement EME APIs using Promises
Re: Issue 358271 in chromium: Implement EME APIs using Promises
Re: Issue 405266 in chromium: Every Android perf bisect fails with
AttributeError
Re: Issue 405100 in chromium: Kernel hang in memory allocator
Re: Issue 403898 in chromium: set up crrev.com redirect using netscaler +
httpd config
Re: Issue 384395 in chromium: Why does the website settings popup view have
a close button?
Re: Issue 90918 in chromium: ntp4 trash icon covers part of the dot list
Re: Issue 400551 in chromium: Android autofill settings UI: first text
field automatically grabs focus
Re: Issue 398065 in chromium: tapping in the search field doesn't seem to
trigger the search
Re: Issue 403597 in chromium: Android Chrome Autofill doesn't show control
items
Re: Issue 378338 in chromium: Unable to create a supervised user as
some "TPM error" message is shown.
Re: Issue 405268 in chromium: Navigation transitions shouldn't be applied
on page reloads
Issue 405305 in chromium: OOP PDF not allowed to use histograms?
Re: Issue 402330 in chromium: Regression: Delay is seen while loading the
page in chrome://settings.
Re: Issue 403734 in chromium: Regression : Drop down list is not displaying
properly on www.hdfcbank.com
Re: Issue 405295 in chromium: Dependency on browser code from chrome_child
via variations
Issue 405307 in chromium: unsafe-eval error in the OOP PDF plugin
Re: Issue 402354 in chromium: Regression: Highlight is broken in for
minimize button of chat window in Google+
Re: Issue 403734 in chromium: Regression : Drop down list is not displaying
properly on www.hdfcbank.com
Re: Issue 403811 in chromium: Office365 website (email, calendar) not
working properly
Re: Issue 405056 in chromium: Accessibility: add tab and keyboard
navigation to Mac user menu
Re: Issue 402777 in chromium: Regression: Shadow get chopped/cut on CSS
Filters.
Re: Issue 405250 in chromium: Animation leaves area unupdated after getting
hidden.
Re: Issue 405056 in chromium: Accessibility: add tab and keyboard
navigation to Mac user menu
Re: Issue 403107 in chromium: V2 apps do not have their own entry in the
Cmd-Tab order on Mac
Re: Issue 404793 in chromium: many uninitialized reads reported in vp9 code
in remoting_unittests
Issue 405308 in chromium: Chrome bug in Translation template Issue
Re: Issue 356763 in chromium: Add ubertracing to telemetry
Re: Issue 405100 in chromium: Kernel hang in memory allocator
Issue 405310 in chromium: Script to pull recent stats from dashboad
Re: Issue 405250 in chromium: Animation leaves area unupdated after getting
hidden.
Re: Issue 356763 in chromium: Add ubertracing to telemetry
Re: Issue 405250 in chromium: Animation leaves area unupdated after getting
hidden.
Re: Issue 390587 in chromium: Incremental invalidation bugs
Re: Issue 404221 in chromium: chrome.proxy should be available to Chrome
Apps
Re: Issue 405308 in chromium: Chrome bug in Translation template Issue
Re: Issue 404938 in chromium: Views Textfield: Mouse drag selection
difficulty with narrow characters, doesn't always update with .
Re: Issue 403948 in chromium: Chromotocast needs Google Play Services
library for build
Re: Issue 405265 in chromium: Bad kerning in UI
Re: Issue 404019 in chromium: CSV output for dashboard data
Re: Issue 338889 in chromium: Implement SSLServerSocket for OpenSSL
Re: Issue 404387 in chromium: text input in link bug dialog should be
focused by default in sheriff-o-matic
Issue 405313 in chromium: Out of process PDF does not put visited PDFs in
the browser history
Re: Issue 403843 in chromium: Cast Host Extension in Chromoting host needs
video interruption support
Re: Issue 403938 in chromium: Chromotocast requires libjingle flag
ENABLE_EXTERNAL_AUTH to be off
Re: Issue 404891 in chromium: Teach 'without patch' logic in
ChromiumTryServer recipe to set patch_result property
Issue 405314 in chromium: Unable to hear audio from Link m/c during Google
Hangouts
Re: Issue 392852 in chromium: Universal selector in :-webkit-any does not
trigger subtree recalc
Re: Issue 365851 in chromium: Consolidate the hi DPI / lo DPI compositing
triggers behind a single flag
Re: Issue 153315 in chromium: underrun when multiple tabs play flapper
Re: Issue 403943 in chromium: Chromotocast port allocator requires TURN
server configuration
Re: Issue 129267 in chromium: Shockwave Flash crashed on Chrome Canary
21.0.1146.0.
Re: Issue 404211 in chromium: Chromoting should disconnect Cast when it
disconnects from the host
Re: Issue 128797 in chromium: Shockwave Flash crashed when looking pics in
the picasa of incognito window
Re: Issue 127288 in chromium: Win8 Flash games that require keyboard are
broken on tablets
Re: Issue 306898 in chromium: Bluetooth: Some speakers will not stay
connected
Re: Issue 54996 in chromium: [Snow Leopard, 10.1 flash player] if machine
doesn't have monitor connected, flash doesn't play and tab hangs
Re: Issue 130936 in chromium: Flash frequently crashing in
MMgc::GC::TracePointer
Re: Issue 405227 in chromium: Forms: revert console error on invalid
input[type=date] usage
Re: Issue 404693 in chromium: Add an maximized state to Chromoting v2
Re: Issue 405227 in chromium: Forms: revert console error on invalid
input[type=date] usage
Re: Issue 405314 in chromium: Unable to hear audio from Link m/c during
Google Hangouts
Re: Issue 403906 in chromium: Add abnormality detection monitoring
Re: Issue 404659 in chromium: User manager always focuses the first pod,
regardless of which profile opened it
Re: Issue 405130 in chromium: Hangouts should pass OAuth Token when calling
into It2meHelpee
Re: Issue 365844 in chromium: gcc: missing warnings due to
track-macro-expansion, when not using integrated cpp
Re: Issue 404659 in chromium: User manager always focuses the first pod,
regardless of which profile opened it
Re: Issue 109153 in chromium: Chrome: Crash Report - Stack
Signature: ppapi::proxy::URLLoader::ReadResponseBodyAc...
Re: Issue 148625 in chromium: Sometimes flash is fast forwarded during a
video
Re: Issue 255588 in chromium: Chrome: Crash Report - Magic Signature:
PepperDisplayContext3D::NeedsPlaneRender()
Re: Issue 405098 in chromium: Display host out-of-date warning on the host
Re: Issue 106142 in chromium: Add command buffer support for
GL_ANGLE_texture_usage and GL_EXT_texture_storage
Re: Issue 405237 in chromium: Chromoting logs an error on start-up
Re: Issue 404615 in chromium: KDE Wallet backward compatibility broken
Re: Issue 397572 in chromium: Mojo: mojo_wget crashes on shutdown
Re: Issue 404615 in chromium: KDE Wallet backward compatibility broken
Re: Issue 106142 in chromium: Add command buffer support for
GL_ANGLE_texture_usage and GL_EXT_texture_storage
Re: Issue 304466 in chromium: Youtube videos just stops after minute or two.
Issue 405315 in chromium: Base path breaks css doing url(../something.svg)
being CSS-relative
Re: Issue 404256 in chromium: Mapping right Ctrl to Meta isn't very
discoverable
Issue 405316 in chromium: visible_content_rect shouldn't be intersected
with the viewport
--
--
Automated mail from issue updates at http://crbug.com/
Subscription options: http://groups.google.com/a/chromium.org/group/chromium-bugs

To unsubscribe from this group and stop receiving emails from it, send an email to chromium-bugs+***@chromium.org.
c***@googlecode.com
2014-08-19 23:14:13 UTC
Permalink
Your project notifications generated too many emails to send
individually. Here are the subject lines of the emails you would have
received:

Re: Issue 405316 in chromium: visible_content_rect shouldn't be intersected
with the viewport
Re: Issue 383551 in chromium: ChromeVox can't read the interstitials on
ChromeOS
Re: Issue 230734 in chromium: Flash crashes every time when loading page
w/100 collapsed YT embeds
Re: Issue 216572 in chromium: chaps unittests sometimes fail
Re: Issue 404615 in chromium: KDE Wallet backward compatibility broken
Re: Issue 384557 in chromium: >4ms per frame in browser compositor on Moto E
Re: Issue 217037 in chromium: Look for TPM session / context / key leaks.
Re: Issue 404782 in chromium: [Destiny] Replace Falco_Li WP2-R chip with
old WP2 chip
Re: Issue 403597 in chromium: Android Chrome Autofill doesn't show control
items
Re: Issue 217531 in chromium: Chaps: Add support for more concurrency
Re: Issue 401988 in chromium: Unix generated PDFs print to blank page
Re: Issue 405100 in chromium: Kernel hang in memory allocator
Re: Issue 365844 in chromium: gcc: missing warnings due to
track-macro-expansion, when not using integrated cpp
Re: Issue 402935 in chromium: Chrome OS IME: media keys are not handled by
Mozc IME extension.
Re: Issue 404427 in chromium: Chromoting screen share warning popup steals
focus
Re: Issue 405327 in chromium: showing regression ranges in sheriff-o-matic
has a race
Re: Issue 384562 in chromium: 0.5ms per frame processing vsync
Re: Issue 404949 in chromium: Yosemite: new windows for new profile start
off screen
Re: Issue 161960 in chromium: MRU Tab switching
Re: Issue 241135 in chromium: 3D demo doesn't work on Lenovo site
Re: Issue 402935 in chromium: Chrome OS IME: media keys are not handled by
Mozc IME extension.
Re: Issue 218872 in chromium: Update trousers to latest
Issue 405331 in chromium: Revert button doesn't put special stuff in the log
Re: Issue 401809 in chromium: Can't type into omnibox on very first launch
Re: Issue 404826 in chromium: Crash when uploading DNG file to Drive
Re: Issue 159939 in chromium: Need Chrome Help page for Pepper Broker
Re: Issue 337847 in chromium: [Git] Test chromium CQ against sandbox in
pure-git mode
Re: Issue 379311 in chromium: Need to clear TPM ownership for enterprise
autotests
Re: Issue 219088 in chromium: Test request for login when TPM is not owned
(issue 163945)
Re: Issue 402247 in chromium: Youtube speed option does not work. (Found
the origin of the problem hope you guys can fix it)
Re: Issue 219088 in chromium: Test request for login when TPM is not owned
(issue 163945)
Issue 405333 in chromium: Run atest on all boards that are missing the
bluetooth label for pool:wificell
Issue 405334 in chromium: Angrybirds audio stopped working from M36
Re: Issue 368058 in chromium: Determine why bluetooth tests fail in
conductive rigs
Re: Issue 405316 in chromium: visible_content_rect shouldn't be intersected
with the viewport
Re: Issue 402148 in chromium: Nexus 7 crash on tablet rotation
Re: Issue 402148 in chromium: Nexus 7 crash on tablet rotation
Re: Issue 402610 in chromium: ASSERTION FAILED in
ScrollingCoordinator::setTouchEventTargetRects
Re: Issue 405314 in chromium: Unable to hear audio from Link m/c during
Google Hangouts
Re: Issue 403831 in chromium: If API level is <16, disallow unlocking
because we don't know whether the phone has a PIN/pattern or not
Re: Issue 405314 in chromium: Unable to hear audio from Link m/c during
Google Hangouts
Re: Issue 159939 in chromium: Need Chrome Help page for Pepper Broker
Re: Issue 169282 in chromium: Impl-side painting on all platforms
Re: Issue 403831 in chromium: If API level is <16, disallow unlocking
because we don't know whether the phone has a PIN/pattern or not
Re: Issue 169282 in chromium: Impl-side painting on all platforms
Re: Issue 405314 in chromium: Unable to hear audio from Link m/c during
Google Hangouts
Re: Issue 405308 in chromium: Chrome bug in Translation template Issue
Re: Issue 405334 in chromium: Angrybirds audio stopped working from M36
Re: Issue 159939 in chromium: Need Chrome Help page for Pepper Broker
Re: Issue 405274 in chromium: Every WinXP and Win8 bisect fails because of
a too long filename
Re: Issue 109937 in chromium: Cursor disappears when using full screen
flash video
Re: Issue 405319 in chromium: libchromeos XServerRunnerTest.FastSuccess
test crashes
Re: Issue 405274 in chromium: Every WinXP and Win8 bisect fails because of
a too long filename
Re: Issue 404217 in chromium: Write and verify seccomp policies for trunks
Re: Issue 405269 in chromium: win_perf_bisect_builder failing compile 9 out
of 10 builds
Re: Issue 403829 in chromium: content_to_screen_scale in
UpdateTilePriorities is incorrect
Issue 405339 in chromium: Cast: Implement adaptive latency
Re: Issue 404988 in chromium: Web page not displaying
Re: Issue 404938 in chromium: Views Textfield: Mouse drag selection
difficulty with narrow selection/characters.
Re: Issue 402777 in chromium: Regression: Shadow get chopped/cut on CSS
Filters.
Re: Issue 294178 in chromium: Weird mouse behavior is seen when spacebar is
tapped to scroll the page
Re: Issue 290581 in chromium: Can not send full screen flash video to
another monitor using windows Shift+Win+Arrow hotkey
Re: Issue 376077 in chromium: Omnibox popup is slow to paint on Linux &
ChromeOS when many suggestions are present
Re: Issue 330573 in chromium: Regression:Adobe flash plugin failed to play
video on websites
Re: Issue 400894 in chromium: tools/perf/record_wpr
smoothness_key_silk_cases fails
Re: Issue 405269 in chromium: win_perf_bisect_builder failing compile 9 out
of 10 builds
Re: Issue 397167 in chromium: Run Athena under Chrome
Re: Issue 397167 in chromium: Run Athena under Chrome
Re: Issue 400894 in chromium: tools/perf/record_wpr
smoothness_key_silk_cases fails
Re: Issue 400387 in chromium: switch testing to mocha instead of qunit
Re: Issue 392621 in chromium: Native CacheStorage API for ServiceWorker
Re: Issue 405113 in chromium: On reinstallation of chrome, plugin that was
blocked by webStore due to malware, was still installed
Re: Issue 404014 in chromium: Sign in for the app and within google
services does not retain session when using 2-step verif.
Re: Issue 404410 in chromium: M-38: Nyan blaze/big failed to build -
chromeos-chrome
Re: Issue 405006 in chromium: chrome won't open any page, not even settings
(only works with "-no-sandbox", maybe a sandbox startup failure?)
Re: Issue 374369 in chromium: GPU rasterization slow with large box shadows
Re: Issue 402247 in chromium: Youtube speed option does not work. (Found
the origin of the problem hope you guys can fix it)
Re: Issue 405320 in chromium: [Mirror] User name clipped in menu
Re: Issue 405268 in chromium: Navigation transitions shouldn't be applied
on page reloads
Issue 405340 in chromium: Renderer/DOM assertion failure in Settings page
on button press
Re: Issue 384562 in chromium: 0.5ms per frame processing vsync
Issue 405341 in chromium: M37 PFQ release failed
unittest/masterslavesynccompletion
Re: Issue 402247 in chromium: Youtube speed option does not work. (Found
the origin of the problem hope you guys can fix it)
Re: Issue 405274 in chromium: Every WinXP and Win8 bisect fails because of
a too long filename
Re: Issue 403012 in chromium: tab_capture_end2end_tests results are not
showing on the flakiness dashboard for several bots
Re: Issue 325672 in chromium: Video description text is not displayed on
youtube after playing video
Re: Issue 405314 in chromium: Unable to hear audio from Link m/c during
Google Hangouts
Re: Issue 404885 in chromium: Audio corrupting in video file
Issue 405342 in chromium: calling chrome.bluetoothLowEnergy for newly
discovered devices fail.
Re: Issue 404885 in chromium: Audio corrupting in video file
Re: Issue 405314 in chromium: Unable to hear audio from Link m/c during
Google Hangouts
Re: Issue 399012 in chromium: 6.6%-36% regression in
startup.cold.blank_page at 286149:286159
Re: Issue 403107 in chromium: V2 apps do not have their own entry in the
Cmd-Tab order on Mac
Re: Issue 405241 in chromium: Sheriff-o-matic should indicate how long
something has been failing
Re: Issue 395488 in chromium: depot_tools not using its own version of
Python
Re: Issue 402148 in chromium: Nexus 7 crash on tablet rotation
Re: Issue 403554 in chromium: Pinned tabs lost when accessing extensions
settings from incognito window
Re: Issue 404776 in chromium: Pinned tabs lost when accessing extensions
settings from incognito window
Re: Issue 337847 in chromium: [Git] Test chromium CQ against sandbox in
pure-git mode
Re: Issue 405099 in chromium: testToTCompatibility should not run on
branches
Re: Issue 405341 in chromium: M37 PFQ release failed
unittest/masterslavesynccompletion
Re: Issue 403554 in chromium: Pinned tabs lost when accessing extensions
settings from incognito window
--
--
Automated mail from issue updates at http://crbug.com/
Subscription options: http://groups.google.com/a/chromium.org/group/chromium-bugs

To unsubscribe from this group and stop receiving emails from it, send an email to chromium-bugs+***@chromium.org.
c***@googlecode.com
2014-08-20 23:15:23 UTC
Permalink
Your project notifications generated too many emails to send
individually. Here are the subject lines of the emails you would have
received:

Re: Issue 389212 in chromium: Switch chromite's gsutil to version 4.4.
Re: Issue 404662 in chromium: Add "People" section to Chrome icon context
menu
Re: Issue 366433 in chromium: Audio choppy with HTML5 player (YouTube and
Play Music) on Goobuntu.
Re: Issue 405709 in chromium: ManagedProfileUITest.CreateConfirmationText
flaking on Mac 10.6
Re: Issue 399939 in chromium: WebRTC hangout video input broken, gives a
green screen
Re: Issue 405495 in chromium: Bookmark context menu "Add folder..." , "Add
Page.."allows to create folder or Bookmark with empty name(empty string)
Re: Issue 405718 in chromium: No sad face on the tab is shown when it is
killed from the task manager
Re: Issue 405709 in chromium: ManagedProfileUITest.CreateConfirmationText
flaking on Mac 10.6
Re: Issue 142818 in chromium: Passwords not saved for HTTPS sites with self
signed certs
Issue 405727 in chromium: powerd should include logs in crash reports
Re: Issue 402543 in chromium: Update to VS2013 Update3
Re: Issue 400145 in chromium: Unable to play HTTP live streaming (HLS)
Issue 405730 in chromium: Clicking "Restart to update" does nothing
Issue 405729 in chromium: Must auto-reboot Linux Intel and Linux AMD FYI
bots
Issue 405731 in chromium: Implement EME isTypeSupported to match latest
draft
Re: Issue 405729 in chromium: Must auto-reboot Linux Intel and Linux AMD
FYI bots
Re: Issue 405451 in chromium: gles2_conform_test fails on Linux/Intel and
Linux/ATI bots
Re: Issue 318358 in chromium: Add a summary page to the perf dashboard.
Re: Issue 405730 in chromium: Clicking "Restart to update" does nothing
Issue 405732 in chromium: Include Chrome logs in crash reports
Issue 405733 in chromium: 34% regression in speedometer at 288752:288849
Re: Issue 405733 in chromium: 34% regression in speedometer at 288752:288849
Issue 405734 in chromium: 34% regression in speedometer at 288752:288849
Re: Issue 405734 in chromium: 34% regression in speedometer at 288752:288849
Re: Issue 395039 in chromium: On dual screen mode Fullscreen has wasted
pixels on top
Re: Issue 289779 in chromium: Chrome windows show up as black rectangles in
the picker when Aero is disabled
Re: Issue 402543 in chromium: Update to VS2013 Update3
Re: Issue 402543 in chromium: Update to VS2013 Update3
Re: Issue 403744 in chromium: Regression: Unable to scroll webpages with
long content using tap/touch and moving vertical scroll-bar.
Re: Issue 402543 in chromium: Update to VS2013 Update3
Re: Issue 397312 in chromium: duck: submit overlay-specific changes once it
passes Pre-CQ
Re: Issue 402543 in chromium: Update to VS2013 Update3
Re: Issue 393331 in chromium: RAF based WebGL conformance tests flaky
(timeout) on Mac Release bot
Re: Issue 402713 in chromium: maps_pixel_test is flaky failing on Mac 10.8
Release ATI GPU bot
Re: Issue 404395 in chromium: Netflix error code M7363-1261-00000002
Re: Issue 402543 in chromium: Update to VS2013 Update3
Re: Issue 404395 in chromium: Netflix error code M7363-1261-00000002
Re: Issue 403982 in chromium: Missing/incomplete tiles outside of visible
rect for tiling should not cause redraws
Re: Issue 404267 in chromium:
GLES2DecoderImpl::HandleWaitAsyncTexImage2DCHROMIUM takes too long on
simple linkedin page
Issue 405735 in chromium: UI glitch on seek bar on vimeo player
Re: Issue 405729 in chromium: Must auto-reboot Linux Intel and Linux AMD
FYI bots
Re: Issue 395796 in chromium: ExtensionApiTest.SharedModule[InstallEvent]
are timing out on Win7 Tests bot
Re: Issue 403982 in chromium: Missing/incomplete tiles outside of visible
rect for tiling should not cause redraws
Re: Issue 404612 in chromium: Google Chrome crashes on startup with
exception C0000005
Re: Issue 405238 in chromium: 30.5% regression in
scheduler.tough_scheduling_cases at 290525:290535
Re: Issue 405735 in chromium: UI glitch on seek bar on vimeo player
Re: Issue 399148 in chromium: Site hangs on Chrome OS only
Re: Issue 405353 in chromium: 10.3%-49.9% regression in page_cycler.dhtml
at 290525:290536
Re: Issue 404717 in chromium: 2.4%-16% regression in blink_perf at
290182:290188
Issue 405736 in chromium: 31.4% regression in page_cycler.moz at
287147:287215
Re: Issue 405736 in chromium: 31.4% regression in page_cycler.moz at
287147:287215
Re: Issue 399587 in chromium: Sync settings "Use default settings" changes
advanced settings view even if "Confirm" isn't clicked
Re: Issue 159000 in chromium: Some interactive_ui_tests have been more
flaky than others...
Re: Issue 404564 in chromium: Part of tabstrip vanishes on undoing theme in
fullscreen mode.
Re: Issue 395796 in chromium: ExtensionApiTest.SharedModule[InstallEvent]
are timing out on Win7 Tests bot
Re: Issue 404564 in chromium: Part of tabstrip vanishes on undoing theme in
fullscreen mode.
Re: Issue 159000 in chromium: Some interactive_ui_tests have been more
flaky than others...
Issue 405737 in chromium: 81.6%-628.3% regression in
smoothness.tough_canvas_cases at 284981:285451
Re: Issue 405737 in chromium: 81.6%-628.3% regression in
smoothness.tough_canvas_cases at 284981:285451
Issue 405738 in chromium: Daisy Chaining Moblabs does not work.
Re: Issue 404564 in chromium: Part of tabstrip vanishes on undoing theme in
fullscreen mode.
Re: Issue 405729 in chromium: Must auto-reboot Linux Intel and Linux AMD
FYI bots
Re: Issue 405739 in chromium: 11.8% regression in
rasterize_and_record_micro.key_silk_cases at 281671:282412
Issue 405739 in chromium: 11.8% regression in
rasterize_and_record_micro.key_silk_cases at 281671:282412
Issue 405740 in chromium: 4.4% regression in
rasterize_and_record_micro.key_silk_cases at 281003:281066
Re: Issue 405740 in chromium: 4.4% regression in
rasterize_and_record_micro.key_silk_cases at 281003:281066
Re: Issue 383551 in chromium: ChromeVox can't read the interstitials on
ChromeOS
Issue 405741 in chromium: 21.8%-45.6% regression in
rasterize_and_record_micro.key_silk_cases at 280248:282721
Re: Issue 404505 in chromium: Add utility for D-Bus stub code generation
for chrome D-Bus
Re: Issue 405741 in chromium: 21.8%-45.6% regression in
rasterize_and_record_micro.key_silk_cases at 280248:282721
Re: Issue 403573 in chromium: Using Ctrl+Shift+N to open a new incognito
window from a maximized Chrome window opens a blank window
Re: Issue 198977 in chromium: shill: make code glint clean
Re: Issue 404505 in chromium: Add utility for D-Bus stub code generation
for chrome D-Bus
Re: Issue 399192 in chromium: chromeVox is not verbalizing after killing
the tasks present in task manager.
Re: Issue 405604 in chromium: Possible memory leak in Chrome
Re: Issue 341335 in chromium: Chrome's new Windows 8 Mode (in Chrome 32)
Doesn't Allow Digitizer Pen Input
Re: Issue 405692 in chromium: daisy paladin timed out on HWTest
Re: Issue 271838 in chromium: Add timeouts for special tasks
Re: Issue 396927 in chromium: [Skate/Spring] via HDMI-DVI lost display
after unplug/closing lid/plug/open lid
Re: Issue 404961 in chromium: Rotating is not saved.
Re: Issue 403470 in chromium: autotest: print exception immediately in the
test logs
Re: Issue 404856 in chromium: Bluetooth not found on new M-39 Canary
Re: Issue 395707 in chromium: build77-a1 seems to have lost its local disk
Re: Issue 403002 in chromium: ctrl + w is not working for closing built in
video player
Re: Issue 403470 in chromium: autotest: print exception immediately in the
test logs
Re: Issue 392670 in chromium: Kiosk apps not showing up at device startup
Re: Issue 405692 in chromium: daisy paladin timed out on HWTest
Re: Issue 271838 in chromium: Add timeouts for special tasks
Re: Issue 78368 in chromium: Compile Chrome resources
Re: Issue 405686 in chromium: android_chromium_gn_compile_rel flaking 7% of
the time with
gen/ui/android/ui_strings_grd_grit_output/values-am/android_ui_strings.xml
error
Re: Issue 403002 in chromium: ctrl + w is not working for closing built in
video player
Re: Issue 405686 in chromium: android_chromium_gn_compile_rel flaking 7% of
the time with
gen/ui/android/ui_strings_grd_grit_output/values-am/android_ui_strings.xml
error
Re: Issue 78368 in chromium: Compile Chrome resources
Re: Issue 405729 in chromium: Must auto-reboot Linux Intel and Linux AMD
FYI bots
Re: Issue 404301 in chromium: Getting InvalidStateError after multiple 4MB
writes with FileWriter
Re: Issue 392670 in chromium: Kiosk apps not showing up at device startup
Re: Issue 405692 in chromium: daisy paladin timed out on HWTest
Re: Issue 271838 in chromium: Add timeouts for special tasks
Re: Issue 403982 in chromium: Missing/incomplete tiles outside of visible
rect for tiling should not cause redraws
Re: Issue 405519 in chromium: Touch completely fails intermittently
Re: Issue 402321 in chromium: Black tiles are shown when gpu memory is OOM.
Re: Issue 392670 in chromium: Kiosk apps not showing up at device startup
--
--
Automated mail from issue updates at http://crbug.com/
Subscription options: http://groups.google.com/a/chromium.org/group/chromium-bugs

To unsubscribe from this group and stop receiving emails from it, send an email to chromium-bugs+***@chromium.org.
Continue reading on narkive:
Loading...