Discussion:
101 messages from Google Code
(too old to reply)
c***@googlecode.com
2010-08-25 19:08:43 UTC
Permalink
Your project notifications generated too many emails to send
individually. Here are the subject lines of the emails you would have
received:

Re: Issue 53336 in chromium: Autofill profile is not available immediately
after browser is launched with NTP.
Re: Issue 49254 in chromium: Reliabiliry bot crash in
internal::ClientSocketPoolBaseHelper::OnAvailableSocketSlot
Re: Issue 39264 in chromium: Add build date and channel name to About
Chrome version info
Re: Issue 52387 in chromium: Use after free in CacheCreator::DoCallback()
Re: Issue 53336 in chromium: Autofill profile is not available immediately
after browser is launched with NTP.
Re: Issue 51831 in chromium: Autofill on Windows does not work for the
first autofillable page encountered.
Re: Issue 9023 in chromium: Enable downloads to a temporary location (view
vs. save)
Re: Issue 44777 in chromium: Scroll bar mouse click is sticky.
Re: Issue 52910 in chromium: new tab thumbnails broken
Re: Issue 9023 in chromium: Enable downloads to a temporary location (view
vs. save)
Re: Issue 53165 in chromium: Resizing looks broken and leaks memory when
compositor is active
Re: Issue 50006 in chromium: Browser Crash when moving tabs from right to
left @ x11_util::(anonymous namespace)::X11ErrorHandler(_XDisplay*,
XErrorEvent*)
Re: Issue 52910 in chromium: new tab thumbnails broken
Re: Issue 44777 in chromium: Scroll bar mouse click is sticky.
Re: Issue 44777 in chromium: Scroll bar mouse click is sticky.
Issue 53339 in chromium: The location tracking blocked notification icon
still shows, even after the exception is removed.
Re: Issue 53180 in chromium: on URL change pinned tab changes instead of
opening new tab
Re: Issue 50419 in chromium: Deleting a duplicate also deletes the original
Bookmark
Re: Issue 47210 in chromium: Pressing control in the omnibox is weird in
Mac OS X
Re: Issue 48589 in chromium: Bundled Flash does not map ctrl/cmd properly
Re: Issue 50257 in chromium: Regression: mouse drag does not select text
properly
Re: Issue 52879 in chromium: Chrome processes got stuck on quitting
Re: Issue 53117 in chromium: System Services menu items not showing up in
contextual menus
Issue 53340 in chromium: Windows: After installing
http://support.microsoft.com/kb/2264107 with 0xFFFFFF option Chrome fails
to load avutil-50.dll
Re: Issue 53340 in chromium: Windows: After installing
http://support.microsoft.com/kb/2264107 with 0xFFFFFF option Chrome fails
to load avutil-50.dll
Re: Issue 3543 in chromium: Checkboxes and scroll bar arrows sometimes
disappear under Windows classic
Re: Issue 52798 in chromium: Crash when opening new tab with compositor on
and find bar open
Re: Issue 45400 in chromium: Browser crash @
RenderViewHost::FilesSelectedInChooser
Re: Issue 53340 in chromium: Windows: After installing
http://support.microsoft.com/kb/2264107 with 0xFFFFFF option Chrome fails
to load avutil-50.dll
Re: Issue 53162 in chromium: Valgrind errors following OutOfMemoryDeathTest
fix
Re: Issue 50553 in chromium: Crash when closing chrome -
BalloonViewImpl::DelayedClose
Issue 53341 in chromium: Scrolling a page that contains 3D CSS transforms
and fixed position elements results in rendering problems
Re: Issue 53341 in chromium: Scrolling a page that contains 3D CSS
transforms and fixed position elements results in rendering problems
Re: Issue 53245 in chromium: Renderer crash:[Google Chrome Framework -
NotificationPresenterImpl.cpp:92]
WebKit::NotificationPresenterImpl::notificationObjectDestroyed
Re: Issue 53320 in chromium: Bookmark Folder Menu Flashes when
Adding/Removing Bookmarks
Re: Issue 53333 in chromium: Kill Chrome instances before starting Mac QA
bots
Re: Issue 11321 in chromium: Allow user to set global default page zoom
level
Re: Issue 53118 in chromium: Sync breaks after closing and reopening Chrome
Re: Issue 51831 in chromium: Autofill on Windows does not work for the
first autofillable page encountered.
Re: Issue 51146 in chromium: Plain-text information leak of
https://user:password due to autosuggest
Re: Issue 53341 in chromium: Scrolling a page that contains 3D CSS
transforms and fixed position elements results in rendering problems
Re: Issue 53138 in chromium: Flaky Mac browser tests crashing with: pure
virtual method called
Re: Issue 53328 in chromium: Some times Autofill profile is not saved
Re: Issue 33044 in chromium: Option to always open new tab from Omnibox
Issue 53342 in chromium: Background color not applied to full height
Re: Issue 32812 in chromium: Snow Leopard: Breakpad failed to create .dmp
file for all plugin crashes
Re: Issue 50265 in chromium: Crash in net::SpdySessionPool::ClearSessions
Issue 53343 in chromium: Download bar leaves a blank grey space after being
closed
Issue 53344 in chromium: stop displaylink for background tabs
Re: Issue 47893 in chromium: Crash in
BrowserRenderProcessHost::OnMessageReceived().
Issue 53345 in chromium: GPU Compositing Generates Errors when Compiled
With Views
Issue 53346 in chromium: "ScopedTempDir unable to delete" on win slaves
Re: Issue 35078 in chromium: Shockwave crash under NPP_Destroy
Re: Issue 50006 in chromium: Browser Crash when moving tabs from right to
left @ x11_util::(anonymous namespace)::X11ErrorHandler(_XDisplay*,
XErrorEvent*)
Re: Issue 29437 in chromium: Renderer crash in
WebCore::ArchiveFactory::isArchiveMimeType(WebCore::String const&)
Re: Issue 40789 in chromium: Change TryJobMailNotifier to add a note for a
specific try server
Re: Issue 46512 in chromium: Implement sync for Chrome web apps
Re: Issue 51632 in chromium: Mac: Crash in
disk_cache::SparseControl::DoAbortCallbacks.
Re: Issue 23426 in chromium: Bookmarks should support option to always open
in new tab
Re: Issue 50265 in chromium: Crash in net::SpdySessionPool::ClearSessions
Re: Issue 53063 in chromium: Sync unconfigurable, running forever, endlessly
Re: Issue 40789 in chromium: Change TryJobMailNotifier to add a note for a
specific try server
Re: Issue 52414 in chromium: Scrollbar, selectbox glitch, missing tick box
since ATI driver upgrade
Re: Issue 53316 in chromium: Crash on javascript execution
Re: Issue 53063 in chromium: Sync unconfigurable, running forever, endlessly
Re: Issue 52965 in chromium: Screen Capture isn't synced
Re: Issue 53294 in chromium: Chrome extension sync hang
Re: Issue 50437 in chromium: Contents of Bookmark Folder Menu Incorrectly
Offsets by 2px after Bookmark Cut/Delete/Paste
Re: Issue 44774 in chromium: Tracking bug : Toast
Re: Issue 52703 in chromium: Sync setup wizard hangs on "Configure sync"
dialog
Re: Issue 53063 in chromium: Sync unconfigurable, running forever, endlessly
Re: Issue 50706 in chromium: Reloading pages marked to be always translated
don't get translated.
Re: Issue 52798 in chromium: Crash when opening new tab with compositor on
and find bar open
Re: Issue 52315 in chromium: Sync setup should display progress to user
during sync process
Re: Issue 19993 in chromium: Add a UI indicator to improve perceived sync
responsiveness during setup
Issue 53347 in chromium: Incognito image for incognito downloads
Re: Issue 52916 in chromium: Improved SSL status dialogs
Re: Issue 53314 in chromium: New "inset" parameter for box-shadow rendered
incorrectly
Re: Issue 24704 in chromium: Application Failed to initialize properly
(0xc0000022)
Re: Issue 53325 in chromium: Professional KIOSK mode
Re: Issue 51954 in chromium: Customize sync hangs
Re: Issue 52338 in chromium: Sync: Strings surface in English and not in
the correct locale
Issue 53348 in chromium: Element inspector error
Re: Issue 26600 in chromium: Regression: Window icon shows throbber
Issue 53349 in chromium: Invalid read of size 4 in PL_HashTableLookupConst
Re: Issue 51062 in chromium: Canary build has been unable to sync my account
Re: Issue 53293 in chromium: DevTools: clean up flags enabling inspector
Re: Issue 52517 in chromium: Accelerated compositing: always redrawing even
when page is static
Re: Issue 53349 in chromium: Invalid read of size 4 in
PL_HashTableLookupConst
Re: Issue 46512 in chromium: Implement sync for Chrome web apps
Re: Issue 49025 in chromium: Starting Chrome for the first time with no
network causes a renderer crash.
Re: Issue 53347 in chromium: Incognito image for incognito downloads
Re: Issue 53299 in chromium: Webpage's appearance wrong
Re: Issue 51955 in chromium: Incognito downloads are no more showing up in
the downloads page.
Re: Issue 53274 in chromium: Accelerated Compositing: expose events are not
handled
Re: Issue 53349 in chromium: Invalid read of size 4 in
PL_HashTableLookupConst
Re: Issue 53298 in chromium: Google Apps mail tab becomes unresponsive when
I receive a chat message
Re: Issue 44463 in chromium: ChromeFrame: crash in third party DLLs due to
firing WebBrowser Events out of order
Re: Issue 52798 in chromium: Crash when opening new tab with compositor on
and find bar open
Re: Issue 52798 in chromium: Crash when opening new tab with compositor on
and find bar open
Re: Issue 53205 in chromium: Chrome_Mac: Crash Bookmark Button array out of
index
--
Automated mail from issue updates at http://crbug.com/
Subscription options: http://groups.google.com/a/chromium.org/group/chromium-bugs
c***@googlecode.com
2010-08-26 06:56:15 UTC
Permalink
Your project notifications generated too many emails to send
individually. Here are the subject lines of the emails you would have
received:

Re: Issue 50715 in chromium: Clear history won't clear that last 18 days
Re: Issue 52126 in chromium: AutoFill doesn't fill address information on
www.gorillaclothing.com
Re: Issue 52416 in chromium: Spell check not working
Re: Issue 48428 in chromium: Chrome Mac Edition: The Window Size is
different when PopUp Window was opened by JavaScript
Re: Issue 52752 in chromium: Incorrect validation for zero-length
DrawArrays calls
Re: Issue 39616 in chromium: XML with XSL not shown under file:// scheme
Issue 53388 in chromium: extension installation dialogue cannot handle 5000
character URLs
Re: Issue 53385 in chromium: UninitCondition in
RenderViewHost::OnMsgNavigate()
Issue 53389 in chromium: Hang, CPU usage hike on large pages.
Re: Issue 43595 in chromium: Sometimes the plugin doesn't load on Youtube
Re: Issue 53022 in chromium: will not quit through dock menu
Re: Issue 52762 in chromium: i18n: Autofill: Text and Buttons on Add
Address and Credit Card are cropped.
Re: Issue 53303 in chromium: V8 Error.stack is slow when the stack contains
local functions
Re: Issue 1383 in chromium: window.focus from child window does not put
focus back on the parent (opener) window.
Re: Issue 48100 in chromium: SPDY: Implement Flow Control
Issue 53390 in chromium: Website: foldit.wikia.com - clicking 'edit page'
causes app to crash
Re: Issue 53388 in chromium: extension installation dialogue cannot handle
5000 character URLs
Re: Issue 7533 in chromium: DCHECK hit with trunk build
Re: Issue 47126 in chromium: Crash -
WebCore::AccessibilityRenderObject::isChecked
Re: Issue 51143 in chromium: Regression - Fixed positioning algorithm is
broken when scrolling up
Re: Issue 52991 in chromium: Youtube queue bar inconsistency
Re: Issue 53165 in chromium: Resizing looks broken and leaks memory when
compositor is active
Issue 53391 in chromium: Compositor doesn't work in fullscreen mode
Issue 53392 in chromium: Crash in
WebCore::CompositeEditCommand::insertNodeAt()
Re: Issue 53391 in chromium: Compositor doesn't work in fullscreen mode
Re: Issue 53391 in chromium: Compositor doesn't work in fullscreen mode
Re: Issue 53360 in chromium: Need to call
ProfileManager::ShutdownSessionServices() in all cases on shutdown
Re: Issue 53165 in chromium: Resizing looks broken and leaks memory when
compositor is active
Re: Issue 53391 in chromium: Compositor doesn't work in fullscreen mode
Re: Issue 53165 in chromium: Resizing looks broken and leaks memory when
compositor is active
Issue 53393 in chromium: Fonts specified in CSS don't display in Chrome or
Firefox but do with Midori
Re: Issue 27797 in chromium: Download shelf needs auto hide
Re: Issue 51819 in chromium: Sun Convergence does not support chromium
Issue 53395 in chromium: .gifs play to slow
Re: Issue 53382 in chromium: hole punching approach breaks window shadow
Re: Issue 53381 in chromium: Search in address box doesn't work
Re: Issue 53367 in chromium: Support for resuming downloads (not a
duplicate)
Re: Issue 53363 in chromium: Chrome gives POST requests too high priorities
Re: Issue 27431 in chromium: Special extension install mode for gallery
Issue 53396 in chromium: Incognito mode content blocking wildcard issues
Re: Issue 53393 in chromium: Fonts specified in CSS don't display in Chrome
or Firefox but do with Midori
Re: Issue 53384 in chromium: "load" event not emitted for HTML5 audio tag
Re: Issue 53388 in chromium: extension installation dialogue cannot handle
5000 character URLs
Re: Issue 53348 in chromium: Element inspector doesnt scroll to inspected
element
Re: Issue 53345 in chromium: GPU Compositing Generates Errors when Compiled
With Views
Re: Issue 53330 in chromium: [Content Settings] Plugins can't always be
unblocked without going through Options manually
Re: Issue 53314 in chromium: New "inset" parameter for box-shadow rendered
incorrectly
Re: Issue 37142 in chromium: Intermediate certs received along with
generated client cert will not be saved
Re: Issue 14808 in chromium: Double-clicking a local html file with Chrome
as default browser doesn't open the file
Issue 53397 in chromium: Duplicate key press events
Re: Issue 27797 in chromium: Download shelf needs auto hide
Re: Issue 52201 in chromium: Spin-button of the second number field doesn't
work
Re: Issue 52201 in chromium: Spin-button of the second number field doesn't
work
Issue 53398 in chromium: Google Chrome Cancels Logout and Shutdown When
Open (Mac)
Re: Issue 52201 in chromium: Spin-button of the second number field doesn't
work
Re: Issue 23581 in chromium: use string16 cleanup wstring in shared code
Re: Issue 27431 in chromium: Special extension install mode for gallery
Issue 53399 in chromium: about:labs for chrome
Re: Issue 53299 in chromium: Webpage's appearance wrong
Re: Issue 53399 in chromium: about:labs for chrome
Re: Issue 50779 in chromium: Proxy auto-detect shortly after a network
change may fail.
Issue 53400 in chromium: Chrome suddenly not working for Netflix streaming
as of 8/25/10
Re: Issue 47075 in chromium: Javascript "TypeError: cannot call
method 'split' of undefined" suddenly appearing on a javascript page that
used to work
Re: Issue 50074 in chromium: Display the revision number on update step box
on the waterfall
Re: Issue 47075 in chromium: Javascript "TypeError: cannot call
method 'split' of undefined" suddenly appearing on a javascript page that
used to work
Re: Issue 53399 in chromium: about:labs for chrome
Re: Issue 53399 in chromium: about:labs for chrome
Re: Issue 53399 in chromium: about:labs for chrome
Re: Issue 53248 in chromium: New Tab Page modification to fit Glen's new
mocks
Re: Issue 53399 in chromium: about:labs for chrome
Re: Issue 53354 in chromium: Avoid confusing prediction stats when a site
has nested frames.
Re: Issue 24704 in chromium: Application Failed to initialize properly
(0xc0000022)
Issue 53401 in chromium: Facebook causes GPU-accelerated compositing to fail
Re: Issue 35198 in chromium: Extension Install Failure for all
extensions: "could not create directory for unzipping"
Re: Issue 53399 in chromium: about:labs for chrome
Re: Issue 47238 in chromium: Install Error 12: UNCOMPRESSION_FAILED
Re: Issue 25072 in chromium: All search providers removed each time chrome
auto updates
Re: Issue 38475 in chromium: IsDefaultSearchProvider and
SetDefaultSearchProvider methods
Re: Issue 53173 in chromium: Need to add UI to preferences dialog for
enabling/disabling background mode
Re: Issue 53399 in chromium: about:labs for chrome
Re: Issue 50450 in chromium: Add "about:labs" page
Re: Issue 25935 in chromium: Should be able to pass command line flags via
user defaults
Issue 53402 in chromium: dos not support malayalam language sites
Issue 53403 in chromium: dos not support malayalam language sites
Re: Issue 53296 in chromium: Netflix Instant Streaming in Chromium
Re: Issue 53362 in chromium: Assert hit in field_trial.cc(100) : Check
failed: !global_->PreLockedFind(trial->name())
Re: Issue 53296 in chromium: Netflix Instant Streaming in Chromium
Issue 53404 in chromium: make single threaded application like v8 use all
cores of the cpu effectively by software
Re: Issue 45365 in chromium: Chrome needs a bookmarks sidebar, bookmarks
unusable without one
Re: Issue 25935 in chromium: Should be able to pass command line flags via
user defaults
Re: Issue 25935 in chromium: Should be able to pass command line flags via
user defaults
Re: Issue 53346 in chromium: "ScopedTempDir unable to delete" on win slaves
Re: Issue 42148 in chromium: PyAuto tests should produce output similar to
gtest
Re: Issue 53296 in chromium: Netflix Instant Streaming in Chromium
Re: Issue 53398 in chromium: Google Chrome Cancels Logout and Shutdown When
Open (Mac)
Issue 53405 in chromium: ShownSectionsHandlerTest.{MigrateUserPrefs,
MigrateUserPrefs1To2} fail after WebKit roll
Re: Issue 35284 in chromium: Extend AutomationProxy to support
Cancel/Delete/Retry/Resume a download
Issue 53406 in chromium: DevTools sanity tests start failing after rolling
WebKit from 65992 to 66033
Re: Issue 53405 in chromium: ShownSectionsHandlerTest.{MigrateUserPrefs,
MigrateUserPrefs1To2} fail after WebKit roll
Re: Issue 49380 in chromium: PyAuto: Need hooks for plugin settings under
content settings
Re: Issue 53405 in chromium: ShownSectionsHandlerTest.{MigrateUserPrefs,
MigrateUserPrefs1To2} fail after WebKit roll
--
Automated mail from issue updates at http://crbug.com/
Subscription options: http://groups.google.com/a/chromium.org/group/chromium-bugs
c***@googlecode.com
2010-08-30 22:18:06 UTC
Permalink
Your project notifications generated too many emails to send
individually. Here are the subject lines of the emails you would have
received:

Re: Issue 53676 in chromium: Tab crashes
Re: Issue 43650 in chromium: Outlook 2010 email hyperlink crashes Chrome if
not running
Re: Issue 23802 in chromium: Can't print labels from Paypal.
Re: Issue 53769 in chromium: Homepage and pinned tabs
Issue 53876 in chromium: HtmlDialogUIDelegate::GetDOMMessageHandlers should
be const
Re: Issue 53388 in chromium: extension installation dialogue cannot handle
5000 character URLs
Re: Issue 53388 in chromium: extension installation dialogue cannot handle
5000 character URLs
Re: Issue 53864 in chromium: Extension Icon Feature Request
Re: Issue 53676 in chromium: Tab crashes
Re: Issue 53862 in chromium: Zoom in/out has implicit side effect.
Re: Issue 26363 in chromium: Chrome tab gets stuck on the mouse cursor when
dragging into its own window
Re: Issue 53799 in chromium: chrome.tabs.onAttached.addListener fires too
early
Re: Issue 52393 in chromium: Windows Live sites crashes
Re: Issue 36009 in chromium: Jar and docx files being downloaded get
renamed with extension zip; csv with xls
Re: Issue 53840 in chromium: Extensions API, Context menu icon does not
appear under Linux
Re: Issue 53390 in chromium: Website: foldit.wikia.com - clicking 'edit
page' causes app to crash
Re: Issue 52718 in chromium: multiple emails cannot be selected within
hotmail
Re: Issue 17182 in chromium: Chrome fails to delete multiple messages from
hotmail (Windows Live) account
Re: Issue 47546 in chromium: "Clear all" in Pinned Downloads tab causes new
Downloads tab to open
Re: Issue 44862 in chromium: Google Chrome crash when any links are open
via Windows Live messenger (14.0.8089.726) on Windows 7
Re: Issue 19589 in chromium: Bookmark Sync: doesn't work with Google Apps
accounts
Re: Issue 53070 in chromium: Chrome 6.0.472.36 beta freezes when trying to
access wikipedia
Re: Issue 33311 in chromium: Changing zoom for a site affects all tabs open
with that domain/hostname
Re: Issue 53736 in chromium: API for get zoom level
Re: Issue 30583 in chromium: Zoom level get/set API
Re: Issue 53095 in chromium: Chrome_Linux: Crash Report - Stack Signature:
-178C0ED
Re: Issue 52448 in chromium: implement app list overflow UI
Re: Issue 53872 in chromium: chrome chrashes if system temp directory does
not exist
Re: Issue 52848 in chromium: chrome for linux SVG problem
Re: Issue 52446 in chromium: generalize NTP app config UI to support larger
list of options
Re: Issue 53233 in chromium: Strictly define a failure mode for VarFromUtf8
Re: Issue 53057 in chromium: Extension replaced new-tab page does not open
on startup
Re: Issue 53754 in chromium: reload lose position
Re: Issue 19589 in chromium: Bookmark Sync: doesn't work with Google Apps
accounts
Re: Issue 52717 in chromium: text field problem on return from locked
desktop - ubuntu karmic
Re: Issue 52717 in chromium: text field problem on return from locked
desktop - ubuntu karmic
Re: Issue 30583 in chromium: Zoom level get/set API
Re: Issue 53585 in chromium: Extension disabling does not close all open
views
Re: Issue 10941 in chromium: Tests Tab1Tab3, Tab1Tab2 are failing with fair
amount of consistency
Re: Issue 19589 in chromium: Bookmark Sync: doesn't work with Google Apps
accounts
Re: Issue 52624 in chromium: Enable spdy for benchmarking
Re: Issue 53786 in chromium: Extensions using contextMenu API won't install
on Chrome 5.x
Re: Issue 46383 in chromium: Implement audio in Pepper v2
Re: Issue 53585 in chromium: Extension disabling does not close all open
views
Re: Issue 48964 in chromium: Increase SPDY A/B test to 100%
Re: Issue 53307 in chromium: Installing a bunch of browser actions can
crowd out Omnibox and Wrench menu upon Chrome restart
Re: Issue 19589 in chromium: Bookmark Sync: doesn't work with Google Apps
accounts
Issue 53877 in chromium: Plugin crash on closing tab
Re: Issue 53307 in chromium: Installing a bunch of browser actions can
crowd out Omnibox and Wrench menu upon Chrome restart
Re: Issue 52270 in chromium: Chrome Launch Problem
Re: Issue 39503 in chromium: MAJOR ERROR in distinguishing Serbian from
Croatian language
Re: Issue 39684 in chromium: Serbian latin offered as Croatian
Re: Issue 39503 in chromium: MAJOR ERROR in distinguishing Serbian from
Croatian language
Re: Issue 41780 in chromium: Pepper fullscreen APIs
Re: Issue 49483 in chromium: Another failure to display fonts properly
Re: Issue 53040 in chromium: Unicode characters fail to display
Re: Issue 53558 in chromium: Recently closed tabs list only includes from
last session in 6.x
Issue 53878 in chromium: Saving a web page corrupts element attribute
values in the saved output HTML
Re: Issue 53319 in chromium: Google Chrome Checker Not Updating
Re: Issue 53585 in chromium: Extension disabling does not close all open
views
Re: Issue 52863 in chromium: Duplicate copies of gles2_c_lib in the
multi-DLL build causes problems
Re: Issue 45754 in chromium: URL in omnibox should fade out at right edge.
Re: Issue 53727 in chromium: YouTube video player "trails" while scrolling
up
Re: Issue 53768 in chromium: chrome.exe won't be terminated on exit after
visiting HTTPS webpage
Re: Issue 53585 in chromium: Extension disabling does not close all open
views
Re: Issue 53806 in chromium: cannot access video on the Weather Channel due
to "missing plug-in"
Re: Issue 53558 in chromium: Recently closed tabs list only includes from
last session in 6.x
Re: Issue 53676 in chromium: Tab crashes
Re: Issue 39398 in chromium: Implement caps bits for Pepper audio
Re: Issue 41782 in chromium: Pepper cursors APIs
Re: Issue 53874 in chromium: add link to all extensions by a developer
Re: Issue 44936 in chromium: [pepper] consider changing mouse coordinates
to be float instead of int
Re: Issue 49064 in chromium: Flash ExternalInterface call improperly
wrapped in try block
Re: Issue 53558 in chromium: Recently closed tabs list only includes from
last session in 6.x
Re: Issue 53852 in chromium: tabs on left seems not well
Re: Issue 45359 in chromium: Run Pepper unit tests in Native Client
Re: Issue 52701 in chromium: Chorome is not providing save password
notification for NTLM based username/password
Re: Issue 50799 in chromium: HTTP basic auth login prompt in unfocused tab
fires GTK assertion and DCHECK
Issue 53879 in chromium: remove browse_extent from docs
Re: Issue 53819 in chromium: Error 10 (net::ERR_ACCESS_DENIED): Unknown
error
Re: Issue 53872 in chromium: chrome chrashes if system temp directory does
not exist
Re: Issue 53820 in chromium: [Extensions] contextMenus: allow icons to be
displayed next to labels.
Re: Issue 53879 in chromium: remove browse_extent from docs
Re: Issue 53726 in chromium: Tab drag issue
Re: Issue 51829 in chromium: Configure Sync never finishes setting up
Re: Issue 50298 in chromium: Within-page navigation and pushState make the
stop/reload button blink, favicon flicker
Issue 53880 in chromium: Renderer crash when Google search
Re: Issue 50068 in chromium: Bookmarklets do not work with pinned tabs
Re: Issue 49565 in chromium: Stop/reload flicker during load
Re: Issue 49565 in chromium: Stop/reload flicker during load of PDF
Re: Issue 41776 in chromium: Pepper networking/P2P APIs
Re: Issue 46371 in chromium: Implement Pepper 2D API in Native Client
Re: Issue 46372 in chromium: Implement Pepper v2 event APIs in Native Client
Re: Issue 46373 in chromium: Implement Pepper file APIs in Native Client
Re: Issue 46384 in chromium: Implement Pepper 3D in Native Client
Re: Issue 46386 in chromium: Convert all v1 demos/tests/applications to v2
Re: Issue 50931 in chromium: HistoryTester.VerifyHistoryLength3
consistently failing on Mac Valgrind (3)
Re: Issue 46385 in chromium: Implement Pepper Audio in Native Client
Re: Issue 53879 in chromium: remove browse_urls from docs
Issue 53881 in chromium: NetLog is never in Passive Mode anymore
Re: Issue 47222 in chromium: Pepper URL Loader API
--
Automated mail from issue updates at http://crbug.com/
Subscription options: http://groups.google.com/a/chromium.org/group/chromium-bugs
c***@googlecode.com
2010-08-31 16:01:45 UTC
Permalink
Your project notifications generated too many emails to send
individually. Here are the subject lines of the emails you would have
received:

Re: Issue 45924 in chromium: Mssing chinese input on "Write a comment"
boxes at facebook.com
Re: Issue 24704 in chromium: Application Failed to initialize properly
(0xc0000022)
Re: Issue 51470 in chromium: JSON.stringify() encodes UTF-8 strings
differently to Safari and Firefox
Re: Issue 53319 in chromium: Google Chrome Mail Checker Not Updating
Re: Issue 49523 in chromium: Phantom Tabs always and forever.
Issue 53944 in chromium: Google Chrome Quits Unexpectedly -- Happens each
time I open this application
Issue 53945 in chromium: Google Chrome Quits Unexpectedly -- Happens each
time I open this application
Re: Issue 19589 in chromium: Bookmark Sync: doesn't work with Google Apps
accounts
Issue 53946 in chromium: Transparent Favicon not being used for Bookmark
Re: Issue 19589 in chromium: Bookmark Sync: doesn't work with Google Apps
accounts
Re: Issue 53865 in chromium: unit_tests
DeviceOrientationProviderTest.ObserverNotRemoved is flaky
Issue 53947 in chromium: --bookmark-menu no longer works
Re: Issue 53250 in chromium: CHECK failure in
ConfigurationPolicyProviderWin::GroupPolicyChangeWatcher
Re: Issue 19589 in chromium: Bookmark Sync: doesn't work with Google Apps
accounts
Re: Issue 53946 in chromium: Transparent Favicon not being used for Bookmark
Re: Issue 44992 in chromium: White flashes during QuickTime playback
Re: Issue 38967 in chromium: Accelerated plugins (GPU, Core Animation) need
to support layering
Re: Issue 35164 in chromium: Mac UI test valgrind failure, unintialized in
gl_context_init_client_state
Re: Issue 53947 in chromium: --bookmark-menu no longer works
Re: Issue 53221 in chromium: Need to handle when OpenGL renderers change
Re: Issue 52466 in chromium: Loading password failed
Re: Issue 43797 in chromium: Browser crash in CGLGetPixelFormatRetainCount()
Re: Issue 53344 in chromium: stop displaylink for background tabs
Re: Issue 53867 in chromium: quake2-gwt-port crashes occasionally with
compositor on on Mac OS X
Re: Issue 53919 in chromium: chrome is downloading pages without loading
them in the browser
Re: Issue 52101 in chromium: Simultaneous XMLHttpRequest limit only 2
Re: Issue 52101 in chromium: Simultaneous XMLHttpRequest limit only 2
Re: Issue 147 in chromium: Warn when closing with multiple tabs open
Issue 53948 in chromium: CSS property outline not displayed on table
Re: Issue 52787 in chromium: [CF] History items for gcf: links don't
persist after IE8 restart
Re: Issue 52982 in chromium: Browser doesn't resizing properly
Re: Issue 53920 in chromium: when i drag a hyperLink to sub bookMark then
ScrollBar begin Scroll
Re: Issue 52502 in chromium: [CF] Back/Forward doesn't work in new registry
way.
Re: Issue 53875 in chromium: Fix erroneous error reporting in Chrome Frame
reliability tests.
Re: Issue 17951 in chromium: cmd-ctrl-d should show dictionary entry of
currently highlighted word
Re: Issue 17951 in chromium: cmd-ctrl-d should show dictionary entry of
currently highlighted word
Re: Issue 51988 in chromium: Unknown leaks in heapchecker net test runs
Re: Issue 53250 in chromium: CHECK failure in
ConfigurationPolicyProviderWin::GroupPolicyChangeWatcher
Issue 53950 in chromium: failure to load updated info on website
Re: Issue 53768 in chromium: chrome.exe won't be terminated on exit after
visiting HTTPS webpage
Re: Issue 33350 in chromium: fast/dom/location-hash.html failure due to
ENABLE(HISTORY_ALWAYS_ASYNC)
Re: Issue 10270 in chromium:
LayoutTests/fast/dom/frame-loading-via-document-write.html is broken due to
WebKit bug
Re: Issue 53308 in chromium: Uses of webRequest & webNavigation events
Re: Issue 53547 in chromium: fast/events/tabindex-focus-chain.html crashing
on chromium
Re: Issue 53547 in chromium: fast/events/tabindex-focus-chain.html crashing
on chromium
Re: Issue 53422 in chromium: Complete system freeze when opening a page
from an external application
Re: Issue 53852 in chromium: tabs on left seems not well
Re: Issue 53507 in chromium: Write more tests for ppapi's Var interface
Re: Issue 50788 in chromium: ChromeFrame: implement a blacklist only mode
Re: Issue 52883 in chromium: [host + client] Chromoting has very low
performance
Re: Issue 9769 in chromium: Export bookmarks as shortcuts
Re: Issue 21884 in chromium: Parts of browser completely unresponsive
(frozen) while CPU usage on 100%
Re: Issue 53947 in chromium: --bookmark-menu no longer works
Re: Issue 48689 in chromium: Bookmarks menu disappeared in new Dev version
Re: Issue 53948 in chromium: CSS property outline not displayed on table
Re: Issue 53860 in chromium: Crash at base::subtle::RefCountedBase::AddRef
Re: Issue 53944 in chromium: Google Chrome Quits Unexpectedly -- Happens
each time I open this application
Re: Issue 51988 in chromium: Unknown leaks in heapchecker net test runs
Re: Issue 53944 in chromium: Google Chrome Quits Unexpectedly -- Happens
each time I open this application
Re: Issue 53945 in chromium: Google Chrome Quits Unexpectedly -- Happens
each time I open this application
Re: Issue 53838 in chromium: Click-to-play shows scrollbars for too small
plugins
Re: Issue 53940 in chromium: Flash in one tab hangs on closing different
tab.
Re: Issue 50731 in chromium: Canary build locking up at startup
Issue 53951 in chromium: GPU rendering on Linux broken when using compiz
(or other GL compositing manager)
Re: Issue 53918 in chromium: font for extention is too small to read
Re: Issue 50129 in chromium: REGRESSION: Extension label font extremely
small.
Re: Issue 53951 in chromium: GPU rendering on Linux broken when using
compiz (or other GL compositing manager)
Re: Issue 387 in chromium: Google Finance - Flash Hangs Browser (5 to 10
Seconds)
Issue 53952 in chromium: Escaped newlines in the ADMX policy templates.
Issue 53953 in chromium: Escaped newlines in the ADMX policy templates.
Re: Issue 50129 in chromium: REGRESSION: Extension label font extremely
small.
Re: Issue 50395 in chromium: Popup blocked animation shown when popup is
opened
Re: Issue 50000 in chromium: Popup-blocked animation continues after window
close.
Re: Issue 53928 in chromium: donate.cafindia.org not rendering correctly
Re: Issue 43797 in chromium: Browser crash in CGLGetPixelFormatRetainCount()
Re: Issue 53951 in chromium: GPU rendering on Linux broken when using
compiz (or other GL compositing manager)
Re: Issue 53927 in chromium: facebook.com not rendering correctly
Re: Issue 53923 in chromium: Bug in zooming
Re: Issue 53939 in chromium: Internal PDF plugin does copy the complete
lines instead of the selected text.
Re: Issue 53943 in chromium: doesn't close right
Re: Issue 53897 in chromium: Netflix streaming movies not working
Re: Issue 53400 in chromium: Can't access Netflix Instant Play in Chrome
7.0.*
Re: Issue 53791 in chromium: SWF files are downloaded when flash is disabled
Re: Issue 53938 in chromium: autocomplete suggests http for httpS-only
websites
Re: Issue 53922 in chromium: chrome 7 regression -> page messed up
Re: Issue 53921 in chromium: Chrome.exe binaries do not include valid
version information
Re: Issue 53816 in chromium: The body is empty in Chromium on
page "http://wiki.ubuntuusers.de/Startseite"
Re: Issue 53815 in chromium: video does not load
Re: Issue 10941 in chromium: Tests Tab1Tab3, Tab1Tab2 are failing with fair
amount of consistency
Re: Issue 52466 in chromium: Loading password failed
Re: Issue 53250 in chromium: CHECK failure in
ConfigurationPolicyProviderWin::GroupPolicyChangeWatcher
Re: Issue 53877 in chromium: Plugin crash on closing tab
Re: Issue 52189 in chromium: Actions toolbar resize bug
Issue 53954 in chromium: Search engine list in Google Chrome reset when
restarting the browser
Re: Issue 53860 in chromium: Crash at base::subtle::RefCountedBase::AddRef
Re: Issue 53578 in chromium: Chrome dev 7.0.503 is eating RAM; Canary
7.0.503 is normal
Re: Issue 51504 in chromium: Flash plugin crash when run with
--enable-internal-flash --in-process-plugins on Windows XP SP3
Re: Issue 6140 in chromium: Estonian: Wrong translation for "Other
bookmarks"
Issue 53955 in chromium: pdf viewer: can't copy an email address
Re: Issue 50882 in chromium: Settings for extension are not saved
Re: Issue 52916 in chromium: Improved SSL status dialogs
--
Automated mail from issue updates at http://crbug.com/
Subscription options: http://groups.google.com/a/chromium.org/group/chromium-bugs
c***@googlecode.com
2010-08-31 17:51:03 UTC
Permalink
Your project notifications generated too many emails to send
individually. Here are the subject lines of the emails you would have
received:

Re: Issue 50708 in chromium: Flash memory leak in Chrome dev 6.0.472.11 and
all prior versions.
Re: Issue 50142 in chromium: Flash video buffer issue
Re: Issue 53923 in chromium: Bug in zooming
Re: Issue 48248 in chromium: Wrong German localization of references to
Window menu
Issue 53957 in chromium: Web inspector up/down arrow when editing css
property clears other css properties
Re: Issue 50395 in chromium: Popup blocked animation shown when popup is
opened
Re: Issue 50000 in chromium: Popup-blocked animation continues after window
close.
Re: Issue 49309 in chromium: YouTube Videos Do Not Play On Forum
Re: Issue 49185 in chromium: Acrobat PDF files display with errors
Re: Issue 48967 in chromium: Flash crashes on Club Bing (ClubBing) Spelling
Bee game
Re: Issue 48828 in chromium: Flash: Video content in YouTube do not show up
until I scroll
Issue 53958 in chromium: Password manager - remember single password input
(no username)
Re: Issue 48815 in chromium: Java applet not loading more than once at two
different occasions
Re: Issue 46820 in chromium: Memory used by chrome.exe grows indefinitely
with flash object.
Re: Issue 53798 in chromium: fulltable crash when press Ctrl+W close chrome
last tab
Re: Issue 53422 in chromium: Complete system freeze when opening a page
from an external application
Re: Issue 46759 in chromium: Some YouTube Videos fail
Re: Issue 46423 in chromium: Chrome Flash crash
Re: Issue 37233 in chromium: Localization issues with RSS Subscription
Extension
Re: Issue 53386 in chromium: Cancel outstanding DNS jobs when switching
networks.
Re: Issue 23581 in chromium: use string16 cleanup wstring in shared code
Re: Issue 53682 in chromium: Interaction between Ubuntu, Chromium, Privoxy
& Google is defective
Re: Issue 53386 in chromium: Cancel outstanding DNS jobs when switching
networks.
Re: Issue 46285 in chromium: Adobe Flash Player Setting dialogue frozen
Re: Issue 43797 in chromium: Browser crash in CGLGetPixelFormatRetainCount()
Re: Issue 46048 in chromium: Frames stay abnormally when playing youtube
Re: Issue 45969 in chromium: Winamp volume goes down/Windows Media Player
11 playback stops while playing youtube videos
Re: Issue 52631 in chromium: Bookmark manager doesn't show any entries
Re: Issue 50708 in chromium: Flash memory leak in Chrome dev 6.0.472.11 and
all prior versions.
Re: Issue 44446 in chromium: Flash video doesn't work on opensuse 11.2 with
2 displays
Re: Issue 24704 in chromium: Application Failed to initialize properly
(0xc0000022)
Re: Issue 52940 in chromium: Auto Complete Failed
Re: Issue 44298 in chromium: megavideo
Re: Issue 43925 in chromium: VLC volume is quieter when Flash video starts
Re: Issue 43571 in chromium: Quicktime is not recognized
Re: Issue 19 in chromium: Automatic integrated windows authentication (aka
automatic NTLM / Negotiate Auth support)
Re: Issue 14521 in chromium: Renderer crash trying to display world map SVG
from Wikipedia
Re: Issue 42968 in chromium: Poor performance in Google Street View
Re: Issue 53895 in chromium: Consider removing the "24" pixel icon from the
app manifest
Re: Issue 53319 in chromium: Google Chrome Mail Checker Not Updating
Re: Issue 42968 in chromium: Poor performance in Google Street View
Re: Issue 53956 in chromium: Remove extra spdy logging
Re: Issue 53165 in chromium: Resizing looks broken and leaks memory when
compositor is active
Re: Issue 53682 in chromium: Interaction between Ubuntu, Chromium, Privoxy
& Google is defective
Issue 53959 in chromium: ChromeFrame: crash in
urlmon!CINet::INetAsyncConnect (wininet intercept)
Re: Issue 53954 in chromium: Search engine list in Google Chrome reset when
restarting the browser
Re: Issue 52166 in chromium: Search function never finds the string "synon"
Re: Issue 42595 in chromium: Earth view in Google Maps is extremely slow
Re: Issue 52940 in chromium: Auto Complete Failed
Re: Issue 29333 in chromium: use_system_xml causes many sites to fail to
load
Re: Issue 53121 in chromium: Windows Passthrough Authentication Broken
Re: Issue 53166 in chromium: Proxy authentication window never goes away
Re: Issue 53121 in chromium: Windows Passthrough Authentication Broken
Re: Issue 53440 in chromium: Windows Authentication Credentials Not Accepted
Re: Issue 50076 in chromium: HTTP Authentication: Add delegation support
for Kerberos
Re: Issue 53503 in chromium: Accessing an intranet site with Windows Auth
results in Error 9 (net::ERR_UNEXPECTED): Unknown error.
Re: Issue 42424 in chromium: [Cannot view image stream using flash player
and Chrome]
Re: Issue 44106 in chromium: Provide ability to move the tab bar under the
URL bar
Re: Issue 53954 in chromium: Search engine list in Google Chrome reset when
restarting the browser
Re: Issue 10913 in chromium: All default search engine settings were wiped
out
Re: Issue 53890 in chromium: proxy authentication required for every element
Re: Issue 53121 in chromium: Windows Passthrough Authentication Broken
Re: Issue 53121 in chromium: Windows Passthrough Authentication Broken
Re: Issue 51802 in chromium: Flash plugin crashes
Re: Issue 53121 in chromium: Windows Passthrough Authentication Broken
Re: Issue 53434 in chromium: Proxy keeps askes for authorization
Issue 53960 in chromium: Should we autoupdate extensions on first run of a
new Chrome version?
Re: Issue 46820 in chromium: Memory used by chrome.exe grows indefinitely
with flash object.
Re: Issue 10913 in chromium: All default search engine settings were wiped
out
Re: Issue 53282 in chromium: Chrome 6 fails to authenticate to proxy
Re: Issue 53783 in chromium: Default Search Engine and settings
continuously erases itself.
Re: Issue 52189 in chromium: Actions toolbar resize bug
Re: Issue 21055 in chromium: File download sometimes fail with an error
message in tray
Re: Issue 53121 in chromium: Windows Passthrough Authentication Broken
Re: Issue 53015 in chromium: after entering search in preferences, upon
closing and reopening it's gone
Re: Issue 10913 in chromium: All default search engine settings were wiped
out
Re: Issue 42080 in chromium: Flash video repeats vertically
Re: Issue 5569 in chromium: Modify Ctrl+Tab to change to most-recently-used
tab and/or show tab title/thumbnail previews
Re: Issue 52940 in chromium: Auto Complete Failed
Issue 53961 in chromium: There is no visible highlight on the screen widget
on the second tab stop under the Basic tab in Options
Re: Issue 50142 in chromium: Flash video buffer issue
Re: Issue 52124 in chromium: Import passwords from Firefox does not work on
Mac
Re: Issue 49378 in chromium: Deal with keychain popups with tests involving
username/passwords
Re: Issue 53938 in chromium: autocomplete suggests http for httpS-only
websites
Re: Issue 41593 in chromium: Flash crashes while trying to upload photo to
flickr
Re: Issue 49185 in chromium: Acrobat PDF files display with errors
Issue 53962 in chromium: Chrome does not update Windows 7 jump lists
correctly.
Re: Issue 42080 in chromium: Flash video repeats vertically
Re: Issue 41033 in chromium: Flash Downstream Caching / Variable
Initialization
Re: Issue 52940 in chromium: Auto Complete Failed
Issue 53963 in chromium: ChromeFrame: Crash Report - Stack Signature:
std::list<int,std::allocator<int> >::remove(int const &)-B18AD
Re: Issue 40815 in chromium: Linux Flash crashing
Re: Issue 53774 in chromium: Default search dissappearing after restarting
chrome 7
Re: Issue 40420 in chromium: JavaFX Stability Issue
Re: Issue 10913 in chromium: All default search engine settings were wiped
out
Issue 53964 in chromium: ChromeFrame: Crash Report - Stack Signature:
IOleDocumentViewImpl<ChromeActiveDocument>::GetRect(tagRECT *)-2F188
Re: Issue 39464 in chromium: DivX Video not working
Re: Issue 46978 in chromium: Chrome on Mac OS X randomly stops loading
pages.
Re: Issue 25592 in chromium: Unable to search from Omnibox in dev channel
Re: Issue 39078 in chromium: Chrome freezes when Java program starts and it
is not on that tab
Re: Issue 31546 in chromium: Enter key doesn't work when searching from
address bar
--
Automated mail from issue updates at http://crbug.com/
Subscription options: http://groups.google.com/a/chromium.org/group/chromium-bugs
c***@googlecode.com
2010-09-01 01:08:03 UTC
Permalink
Your project notifications generated too many emails to send
individually. Here are the subject lines of the emails you would have
received:

Re: Issue 50570 in chromium: Rounding error / off by one pixel when
rendering media resource load bar over HTTP
Re: Issue 50799 in chromium: HTTP basic auth login prompt in unfocused tab
fires GTK assertion and DCHECK
Re: Issue 35158 in chromium: ClearAuthenticationData doesn't clear
TalkMediator cookies
Re: Issue 51001 in chromium: Fix authwatcher lifetime properly
Re: Issue 28751 in chromium: XMPP Sync will not work behind a proxy server
Re: Issue 40489 in chromium: Mac "open the following pages" does not update
when sync occurs and dialog is open
Re: Issue 41399 in chromium: Bookmark sync sometimes fall way behind
Re: Issue 41554 in chromium: Non-favicon site takes over the preceding
favicon which was deleted.
Re: Issue 42003 in chromium: Crash in
syncable::MutableEntry::PutPredecessor on startup
Re: Issue 42142 in chromium: Crash in
syncable::Directory::CheckTreeInvariants on startup
Re: Issue 47090 in chromium: Implement common login for chrome services
Re: Issue 50293 in chromium: Remove auth code from Chrome Sync, replace
with common token service
Re: Issue 51432 in chromium: Sync: Error on successful sync sign-out
Re: Issue 19581 in chromium: Bookmark sync login is broken for
authenticating proxies
Re: Issue 51259 in chromium: cross_fuzz "google" object window reload NULL
pointer
Re: Issue 50292 in chromium: Token service should renew tokens whenever
Chromium OS login screen is used
Re: Issue 53637 in chromium: Chrome_ChromeOS: Crash Report - Stack
Signature: WebCore::GeolocationService::positionChanged()-39C159A
Re: Issue 48920 in chromium: marking ExtensionApiTest.Tabs as flaky on
chromeos debug build.
Re: Issue 54006 in chromium: Security: Extension history permission does
not generate a warning
Re: Issue 53598 in chromium: Add speech input feature to editable input
elements.
Re: Issue 48248 in chromium: Wrong German localization of references to
Window menu
Re: Issue 1906 in chromium: Shift-reload support
Re: Issue 29759 in chromium: reliability bot found crash in
WebCore::ImageEventSender
Re: Issue 42931 in chromium: Crash -
WebKit::FrameLoaderClientImpl::dispatchDidNavigateWithinPage
Re: Issue 54006 in chromium: Security: Extension history permission does
not generate a warning
Re: Issue 47275 in chromium: DevTools: [REGRESSION] Live editing while on a
breakpoint resets stack to after function execution.
Re: Issue 38475 in chromium: IsDefaultSearchProvider and
SetDefaultSearchProvider methods
Issue 54011 in chromium: PPB_Instance.ExecuteScript doesn't return
exceptions properly
Re: Issue 53991 in chromium: IncognitoSplitMode hanging on ChromeOS
Re: Issue 52926 in chromium: Consider adding a Pepper equivalent to
NPN_Evaluate
Re: Issue 53087 in chromium: Page navigation from content script doesn't
store old page in history
Re: Issue 51565 in chromium: Renderer crash:
WebCore::RenderBlock::layoutBlockChild
Re: Issue 42939 in chromium: showModalDialog fails to return
window.returnValue after being submitted from a form (asp based project)
Re: Issue 53690 in chromium: Yodlee Moneycenter does not load.
Re: Issue 42939 in chromium: showModalDialog fails to return
window.returnValue after being submitted from a form (asp based project)
Re: Issue 39849 in chromium: Add context creation attributes to GGL
Re: Issue 53598 in chromium: Add speech input feature to editable input
elements.
Issue 54012 in chromium: Fix transaction rollbacks in web_database
migration code.
Re: Issue 27797 in chromium: Download shelf needs auto hide
Re: Issue 44454 in chromium: Chrome crashes when downloading file with no
open tabs.
Re: Issue 44454 in chromium: Chrome crashes when downloading file with no
open tabs.
Re: Issue 54006 in chromium: Security: Extension history permission does
not generate a warning
Re: Issue 33777 in chromium: Java form saving fail
Re: Issue 49975 in chromium: Sync does not work in deleting
Favorites/Bookmarks file created under Other bookmarks between Linux and
windows.
Re: Issue 53690 in chromium: Yodlee Moneycenter does not load.
Re: Issue 10913 in chromium: All default search engine settings were wiped
out
Re: Issue 900 in chromium: No Windows Tiling
Re: Issue 20737 in chromium: 64-bit Linux crash server does not give useful
stack traces
Re: Issue 10913 in chromium: All default search engine settings were wiped
out
Re: Issue 33777 in chromium: Java form saving fail
Re: Issue 32026 in chromium: "Inactive Toast" provides confusing crash
notification and more
Re: Issue 52754 in chromium: A 0x0 blocked popup window hangs Flash on Hulu
Re: Issue 27797 in chromium: Download shelf needs auto hide
Re: Issue 32026 in chromium: "Inactive Toast" provides confusing crash
notification and more
Re: Issue 27797 in chromium: Download shelf needs auto hide
Re: Issue 41917 in chromium: Right clicking on a button in a Flash demo and
then left clicking elsewhere on the page initiates a button click
Re: Issue 40313 in chromium: New tab page thumbnail not displayed
(Thumbnails db corruption)
Re: Issue 27797 in chromium: Download shelf needs auto hide
Re: Issue 44378 in chromium: System-level toast should write client code to
HKLM, not HKCU
Re: Issue 27885 in chromium: [meta] Implement diagnostics and recovery mode
Re: Issue 11908 in chromium: Detect corrupted profile and recover gracefully
Re: Issue 11700 in chromium: Ameliorate problems due to renderer being
swapped out
Re: Issue 53969 in chromium: NewTabPage doesn't work correctly -
Only "Apps" or "Most Visited" or "Recently Closed" is to see maximized
Re: Issue 52893 in chromium: Unit test missing for Sandbox IPC bug 52682
Issue 54013 in chromium: Add a generalized mechanism for internal-only
extension APIs
Re: Issue 54012 in chromium: Fix transaction rollbacks in web_database
migration code.
Re: Issue 10913 in chromium: All default search engine settings were wiped
out
Re: Issue 266 in chromium: Chrome uses Windows' proxy settings
Re: Issue 52260 in chromium: Google Chrome does not support Windows 7 touch
panning (scroll) gestures
Re: Issue 54012 in chromium: Fix transaction rollbacks in web_database
migration code.
Re: Issue 52735 in chromium: Need to change docs app launch behavior
Re: Issue 54012 in chromium: Fix transaction rollbacks in web_database
migration code.
Re: Issue 47238 in chromium: Install Error 12: UNCOMPRESSION_FAILED
Re: Issue 53880 in chromium: Renderer crash when Google search
Re: Issue 53324 in chromium: Chromium crash on certain Google search terms
Re: Issue 39849 in chromium: Add context creation attributes to GGL
Re: Issue 53383 in chromium: failed to load chrome-extension:// resource in
incognito mode
Re: Issue 52153 in chromium: Consistency: chrome://bookmarks empty the
omnibar, while extensions and history do not empty the omnibar
Re: Issue 37356 in chromium: Tabbed bookmark manager should show
chrome://bookmarks/ in the URL bar/Omnibox
Re: Issue 27797 in chromium: Download shelf needs auto hide
Issue 54014 in chromium: Cannot save large embedded images (data URL)
Re: Issue 45160 in chromium: Context menu doesn't appear for long images
Issue 54015 in chromium: FarmVille covers Facebook chat bar
Re: Issue 51039 in chromium: chromium update must download
http://build.chromium.org/buildbot/continuous/LATEST/chrome-win32.zip when
update button was pressed
Re: Issue 53324 in chromium: Chromium crash on certain Google search terms
Re: Issue 53605 in chromium: Extensions docs auto-regeneration sometimes
produces spurious changes
Re: Issue 53998 in chromium: Renderer crash:
WebCore::SubresourceLoader::create
Issue 54016 in chromium: Chrome_ChromeOS: Crash Report - Stack Signature:
WebCore::Loader::Host::servePendingRequests-5EBE8FA
Issue 54017 in chromium: update chromium in option bar
Re: Issue 54016 in chromium: Chrome_ChromeOS: Crash Report - Stack
Signature: WebCore::Loader::Host::servePendingRequests-5EBE8FA
Re: Issue 54016 in chromium: Chrome_ChromeOS: Crash Report - Stack
Signature: WebCore::Loader::Host::servePendingRequests-5EBE8FA
Issue 54018 in chromium: video subtitle support
Re: Issue 53789 in chromium: It keeps aw snapping all over the place
Re: Issue 53324 in chromium: Chromium crash on certain Google search terms
Re: Issue 43292 in chromium: 100% CPU usage
Issue 54019 in chromium: video mpeg-4 support
Issue 54020 in chromium: h264 support
Re: Issue 53675 in chromium: Crashes on windows live help site
Re: Issue 52393 in chromium: Windows Live sites crashes
Re: Issue 53806 in chromium: cannot access video on the Weather Channel due
to "missing plug-in"
Issue 54021 in chromium: perfect http://html5test.com/
--
Automated mail from issue updates at http://crbug.com/
Subscription options: http://groups.google.com/a/chromium.org/group/chromium-bugs
c***@googlecode.com
2010-09-01 16:17:25 UTC
Permalink
Your project notifications generated too many emails to send
individually. Here are the subject lines of the emails you would have
received:

Re: Issue 54057 in chromium: Repeated Prox Authentification Required (NEW
in 7.0.503.0 dev)
Re: Issue 49523 in chromium: Phantom Tabs always and forever.
Re: Issue 53995 in chromium: HeapCheck detected leaks in
ClientSocketPoolBaseTest.AbortAllRequestsOnFlush
Re: Issue 10913 in chromium: All default search engine settings were wiped
out
Re: Issue 52876 in chromium: segfaults on http://localhost:631 (cups)
Re: Issue 53422 in chromium: Complete system freeze when opening a page
from an external application
Issue 54067 in chromium: Alpha blending error in GPU canvas
Re: Issue 49523 in chromium: Phantom Tabs always and forever.
Issue 54068 in chromium: Wrong texture in GPU canvas
Re: Issue 54067 in chromium: Alpha blending error in GPU canvas
Re: Issue 51404 in chromium: "Error 9 (net::ERR_UNEXPECTED): Unknown
error." while behind a proxy
Re: Issue 30101 in chromium: Wishlist: Port chromium to Solaris 10 /
OpenSolaris
Re: Issue 54068 in chromium: Wrong texture in GPU canvas
Issue 54069 in chromium: Crash reporter doesn't work with proxy
Re: Issue 54068 in chromium: Wrong texture in GPU canvas
Issue 54070 in chromium: canvas createLinearGradient() works in only the
most basic situations
Re: Issue 32845 in chromium: Add support for application tabs to tabstrip
Re: Issue 51404 in chromium: "Error 9 (net::ERR_UNEXPECTED): Unknown
error." while behind a proxy
Re: Issue 51860 in chromium: Google Chrome 6.0.472.33 does not always save
passwords for websites
Issue 54071 in chromium: Crash reporter gets chrome stuck in a loop with
using proxy
Re: Issue 51404 in chromium: "Error 9 (net::ERR_UNEXPECTED): Unknown
error." while behind a proxy
Re: Issue 53765 in chromium: Data race on
scoped_ptr&amp;lt;SpeechInputBubble&amp;gt; in speech tests
Re: Issue 54070 in chromium: canvas createLinearGradient() works in only
the most basic situations
Re: Issue 22806 in chromium: Google Chrome Frame stops rendering page about
half-way down.
Issue 54072 in chromium: Image rendering very slow
Re: Issue 31546 in chromium: Enter key doesn't work when searching from
address bar
Re: Issue 50307 in chromium: Implement exposé for tabs
Re: Issue 7268 in chromium: Complex Script: Chrome select text in the
opposite direction when dragging cursor to the end of the line
Re: Issue 50665 in chromium: Abort in progress connect jobs when switching
networks
Re: Issue 53995 in chromium: HeapCheck detected leaks in
ClientSocketPoolBaseTest.AbortAllRequestsOnFlush
Issue 54073 in chromium: Does not apply css-cursor definition to effecting
target
Re: Issue 36790 in chromium: Warning when closing a window with multiple
tabs opened.
Re: Issue 53386 in chromium: Cancel outstanding DNS jobs when switching
networks.
Re: Issue 27106 in chromium: Chrome ignores proxy settings
Re: Issue 53655 in chromium: When Chrome is set as default while
installing, importing data from previous default browser is broken
Issue 54074 in chromium: External Link Overload
Re: Issue 54071 in chromium: Crash reporter gets chrome stuck in a loop
with using proxy
Re: Issue 54069 in chromium: Crash reporter doesn't work with proxy
Re: Issue 53386 in chromium: Cancel outstanding DNS jobs when switching
networks.
Re: Issue 53995 in chromium: HeapCheck detected leaks in
ClientSocketPoolBaseTest.AbortAllRequestsOnFlush
Issue 54075 in chromium: Bug with menu item "Update Chromium" (build: 58164)
Re: Issue 54051 in chromium:
ClientSocketPoolBaseTest.AbortAllRequestsOnFlush causes memcheck failure
Re: Issue 53995 in chromium: HeapCheck detected leaks in
ClientSocketPoolBaseTest.AbortAllRequestsOnFlush
Issue 54076 in chromium: can't resize window less than 500px width
Re: Issue 24 in chromium: Proxy causes some or all network requests to fail
Issue 54077 in chromium: Automatically select entry to allow cookie in
cookie "Cookies set by this page" dialog
Re: Issue 53188 in chromium: Invalid read in ErrorPageTest.IFrame404 in
net::internal::ClientSocketPoolBaseHelper::CancelAllConnectJobs
Re: Issue 53188 in chromium: Invalid read in ErrorPageTest.IFrame404 in
net::internal::ClientSocketPoolBaseHelper::CancelAllConnectJobs
Issue 54078 in chromium: Random blue bar rendering in pages
Re: Issue 53138 in chromium: Flaky Mac browser tests crashing with: pure
virtual method called
Re: Issue 50950 in chromium: ConnectionTesterTest.RunAllTests crashes with
pure virtual function call on Mac (valgrind) bot
Re: Issue 53138 in chromium: Flaky Mac browser tests crashing with: pure
virtual method called
Re: Issue 24 in chromium: Proxy causes some or all network requests to fail
Re: Issue 26600 in chromium: Regression: Window icon shows throbber
Re: Issue 53769 in chromium: Homepage and pinned tabs
Re: Issue 53138 in chromium: Flaky Mac browser tests crashing with: pure
virtual method called
Re: Issue 24 in chromium: Proxy causes some or all network requests to fail
Issue 54079 in chromium: Peacekeeper performance on GPU-canvas is lower
than software
Issue 54080 in chromium: PDF files not displayed corectly (some data
missing)
Re: Issue 51404 in chromium: "Error 9 (net::ERR_UNEXPECTED): Unknown
error." / Error 338 (net::ERR_INVALID_AUTH_CREDENTIALS) while behind a proxy
Re: Issue 53635 in chromium: Save as frequently crashes after creating a
new folder
Re: Issue 51248 in chromium: Hexus site - flash advertisement doesn't
render properly and obscures the article and the page
Re: Issue 54034 in chromium: Flash video will not redraw after fullscreen.
Re: Issue 23145 in chromium: Feature: Kiosk Mode
Re: Issue 41286 in chromium: Use a different default icons for apps
Re: Issue 54034 in chromium: Flash video will not redraw after fullscreen.
Re: Issue 23145 in chromium: Feature: Kiosk Mode
Re: Issue 51404 in chromium: "Error 9 (net::ERR_UNEXPECTED): Unknown
error." / Error 338 (net::ERR_INVALID_AUTH_CREDENTIALS) while behind a proxy
Issue 54081 in chromium: regression: dangerous download confirmation on
gallery
Issue 54082 in chromium: Apps not working in chrome 7 with canary
Re: Issue 53656 in chromium: Chrome can't be made as default while
installing when it already exists
Re: Issue 27797 in chromium: Download shelf needs auto hide
Re: Issue 54017 in chromium: update chromium in wrench menu
Re: Issue 54006 in chromium: Security: Extension history permission does
not generate a warning
Re: Issue 54082 in chromium: Apps not working in chrome 7 with canary
Re: Issue 54017 in chromium: update chromium in wrench menu
Re: Issue 54075 in chromium: Bug with menu item "Update Chromium" (build:
58164)
Re: Issue 51454 in chromium: Update detectLanguage used by web page
translation feature so that it checks &amp; uses content-language meta tag
Re: Issue 54061 in chromium: Extension won't uninstall when disabled
Re: Issue 53035 in chromium: Extensions won't uninstall if disabled.
Re: Issue 49523 in chromium: Phantom Tabs always and forever.
Re: Issue 50076 in chromium: HTTP Authentication: Add delegation support
for Kerberos
Re: Issue 54034 in chromium: Flash video will not redraw after fullscreen.
Re: Issue 54063 in chromium: Can't uninstall disabled extensions
Re: Issue 53035 in chromium: Extensions won't uninstall if disabled.
Re: Issue 49523 in chromium: Phantom Tabs always and forever.
Re: Issue 49523 in chromium: Phantom Tabs always and forever.
Re: Issue 53655 in chromium: When Chrome is set as default while
installing, importing data from previous default browser is broken
Re: Issue 54078 in chromium: Random blue bar rendering in pages
Re: Issue 54082 in chromium: Apps not working and backwards letters with
--enable-accelerated-compositing
Issue 54083 in chromium: Artifacts (missing elements) in GPU canvas demos
on Linux
Re: Issue 54083 in chromium: Artifacts (missing elements) in GPU canvas
demos on Linux
Re: Issue 54060 in chromium: Chrome Dev 7 Won't remember Search Engine
Defaults
Re: Issue 10913 in chromium: All default search engine settings were wiped
out
Re: Issue 53733 in chromium: Romanian translation is broken :(
Re: Issue 54078 in chromium: Random blue bar rendering in pages
Re: Issue 49523 in chromium: Phantom Tabs always and forever.
Re: Issue 51711 in chromium: Fix gclient duplicate fetch
Re: Issue 46266 in chromium: jump in time for gclient
Re: Issue 53919 in chromium: chrome is downloading pages without loading
them in the browser
Issue 54084 in chromium: Enable parallel gclient checkout by default
--
Automated mail from issue updates at http://crbug.com/
Subscription options: http://groups.google.com/a/chromium.org/group/chromium-bugs
c***@googlecode.com
2010-09-01 18:18:31 UTC
Permalink
Your project notifications generated too many emails to send
individually. Here are the subject lines of the emails you would have
received:

Issue 54091 in chromium: Mouse hover over wrench icon in NNTP should show
tooltop
Re: Issue 52446 in chromium: Implement context menus for the NTP
Re: Issue 53390 in chromium: Website: foldit.wikia.com - clicking 'edit
page' causes app to crash
Issue 54092 in chromium: Chromium Crash
Re: Issue 54020 in chromium: H.264 support not consistent on
http://www.html5test.com ?
Re: Issue 54081 in chromium: regression: dangerous download confirmation on
gallery
Re: Issue 53775 in chromium: Navigation arrows difficult to read on dark
themes
Re: Issue 54019 in chromium: video mpeg-4 support
Re: Issue 54036 in chromium: MPEG-4 support
Re: Issue 54028 in chromium: Tim's watch is broken
Re: Issue 50772 in chromium: Google Chrome Crash using document.write
Re: Issue 51821 in chromium: fix popup apitest to not use toolstrips
Re: Issue 46601 in chromium: ExtensionApiTest.Popup is flaky on windows.
Re: Issue 52007 in chromium: Sync notifications don't get enabled on mac
builder
Re: Issue 9093 in chromium: Chrom Can not loaf any website when user read
IRM secured documents!!
Re: Issue 53856 in chromium: NOTREACHED in
TransportSecurityState::CanonicaliseHost()
Re: Issue 53580 in chromium: Elements panel breaks after calling "Edit as
HTML" on <body>
Re: Issue 53582 in chromium: Event listeners properties are displayed using
font other than used for properties
Re: Issue 53856 in chromium: NOTREACHED in
TransportSecurityState::CanonicaliseHost()
Re: Issue 53655 in chromium: When Chrome is set as default while
installing, importing data from previous default browser is broken
Re: Issue 53655 in chromium: When Chrome is set as default while
installing, importing data from previous default browser is broken
Re: Issue 53690 in chromium: Yodlee Moneycenter does not load.
Re: Issue 53635 in chromium: Save as frequently crashes after creating a
new folder
Re: Issue 54053 in chromium: autocomplete suggests http for httpS-only
websites
Re: Issue 53422 in chromium: Complete system freeze when opening a page
from an external application
Re: Issue 54053 in chromium: autocomplete suggests http for httpS-only
websites
Re: Issue 54089 in chromium: Invalid read in
HostResolverImplTest.OnlyAbortExistingRequestsOnIPAddressChange
Re: Issue 54090 in chromium: Invalid read in
HostResolverImplTest.OnlyAbortExistingRequestsOnIPAddressChange
Re: Issue 24 in chromium: Proxy causes some or all network requests to fail
Re: Issue 13291 in chromium: Screen reader support for web content is needed
Issue 54093 in chromium: Autofill: "Zip code" text field on the "Add
Address" sheet is out of the area
Re: Issue 52199 in chromium: Chrome Web Apps Wrench/Settings Icon
Disappears On Mouse Hover
Issue 54094 in chromium: 'Update Google Chrome' says there is an update
available always !
Re: Issue 45951 in chromium: location.reload() in dev tools fails to reload
a browser action popup (was: location.reload undefined [Chrome extension])
Re: Issue 54017 in chromium: "Upgrade Now" always in the wrench menu in
Views based interface
Issue 54095 in chromium: "Reset to default theme" button is always enabled
Re: Issue 54081 in chromium: regression: dangerous download confirmation on
gallery
Re: Issue 53733 in chromium: Romanian translation is broken :(
Re: Issue 45951 in chromium: location.reload() in dev tools fails to reload
a browser action popup (was: location.reload undefined [Chrome extension])
Issue 54096 in chromium: Autofill/Add Adress: "Edit" doesnt work.
Re: Issue 29333 in chromium: use_system_xml causes many sites to fail to
load
Issue 54097 in chromium: Run tests in parallel for speed
Issue 54098 in chromium: Run tests in parallel for speed
Issue 54099 in chromium: Choosing Autofill drop down/ "Autofill Options"
throws old dialog instead of DOMUI
Re: Issue 54094 in chromium: 'Update Google Chrome' says there is an update
available always !
Re: Issue 54017 in chromium: "Upgrade Now" always in the wrench menu in
Views based interface
Issue 54100 in chromium: Autofill/Add Credit Card : "Apply" and "Cancel"
buttons are labeled as "Undefined"
Re: Issue 54033 in chromium: Google chrome browser can not open any web
pages when user opening EMC IRM protected document (PVD Pdf)
Re: Issue 9093 in chromium: Chrom Can not loaf any website when user read
IRM secured documents!!
Issue 54101 in chromium: Longer search engine names("Youtube Video Search")
overlaps on its keywords when they make default.
Re: Issue 54101 in chromium: Longer search engine names("Youtube Video
Search") overlaps on its keywords when they make default.
Re: Issue 48913 in chromium: Clean up download code
Re: Issue 53127 in chromium: Need a way for users without admin privileges
to install and run Chrome Frame.
Issue 54102 in chromium: Extra non functional "Exception" button on
(Pop-ups,location and Notification)Content settings UI
Re: Issue 50517 in chromium: Crash in NTLM authentication on Linux with
default credentials
Re: Issue 50517 in chromium: Crash in NTLM authentication on Linux with
default credentials
Issue 54103 in chromium: Sync login input fields disabled, if user enters
wrong credentials.
Re: Issue 52746 in chromium: UITest should recover more gracefully if we
fail to WaitForInitialLoads, etc.
Issue 54104 in chromium: Chrome/Mac crashing multiple times per day
Issue 54105 in chromium: [CF] ChromeFrame diff installer for 7.0.512.0 is
not working
Re: Issue 46439 in chromium: Broken Transparency on Ubuntu 10.04
Re: Issue 29333 in chromium: use_system_xml causes many sites to fail to
load
Issue 54107 in chromium: [CF] ChromeFrame installer for 7.0.512.0 is not
working
Issue 54106 in chromium: Prefs/Basics/Startup/Add page: Failed to "Add" the
page from the list
Re: Issue 54107 in chromium: [CF] ChromeFrame installer for 7.0.512.0 is
not working
Re: Issue 54106 in chromium: Prefs/Basics/Startup/Add page: Failed to "Add"
the page from the list
Re: Issue 54017 in chromium: "Upgrade Now" always in the wrench menu in
Views based interface
Re: Issue 54107 in chromium: [CF] ChromeFrame installer for 7.0.512.0 is
not working
Re: Issue 46861 in chromium: Credit card exp month not filled out on
macys.com
Re: Issue 52260 in chromium: Google Chrome does not support Windows 7 touch
panning (scroll) gestures
Re: Issue 54107 in chromium: [CF] ChromeFrame installer for 7.0.512.0 is
not working
Re: Issue 27797 in chromium: Download shelf needs auto hide
Re: Issue 54105 in chromium: [CF] ChromeFrame diff installer for 7.0.512.0
is not working
Issue 54108 in chromium: Crash in ChromeAsyncSocket::DoClose() on Windows
Re: Issue 52505 in chromium: Autofill: Loss of autofill data with sync
enabled
Re: Issue 53138 in chromium: Flaky Mac browser tests crashing with: pure
virtual method called
Issue 54109 in chromium: Integrate downloads with system virus scanner
Re: Issue 49128 in chromium: Add "Clear AutoFill data" checkbox to Clear
Browsing Data dialog
Re: Issue 45039 in chromium: Query maps data for region abbreviation
mappings
Issue 54110 in chromium: Clean up media pipeline and filters.
Re: Issue 49128 in chromium: Add "Clear AutoFill data" checkbox to Clear
Browsing Data dialog
Re: Issue 46789 in chromium: Accelerated Compositing: Artifacts/blink when
enabling a transform
Issue 54111 in chromium: Sad tab on
http://sf.eater.com/archives/2010/07/06/beer_and_pastry.php
Re: Issue 54107 in chromium: [CF] ChromeFrame installer for 7.0.512.0 is
not working
Re: Issue 54017 in chromium: "Upgrade Now" always in the wrench menu in
Views based interface
Re: Issue 53867 in chromium: quake2-gwt-port crashes occasionally with
compositor on on Mac OS X
Re: Issue 53868 in chromium: Bookmarks/Folders in the Bookmarkbar are cut
after the 17th letter and a fade-out-effect is to see
Re: Issue 52124 in chromium: Import passwords from Firefox does not work on
Mac
Re: Issue 53989 in chromium: UninitCondition with
gleGetVertexSubmitFuncObjectAndKey on OSX
Re: Issue 44272 in chromium: Password autofill doesn't style textbox font
color
Re: Issue 51077 in chromium: UI polishes and tweaks to Autofill dropdown
menu
Re: Issue 53932 in chromium: Chromium crashes on certain flash javascript
code
Re: Issue 52524 in chromium: Crasher in infobar code
Re: Issue 54017 in chromium: "Upgrade Now" always in the wrench menu in
Views based interface
Issue 54112 in chromium: new tab page crash on expanding apps section
Re: Issue 35569 in chromium: 10.6 SDK compatibility fixes for February 12,
2010
Re: Issue 49084 in chromium: Automatically import Autofill profiles from
Toolbar (if installed)
Re: Issue 27797 in chromium: Download shelf needs auto hide
Re: Issue 54017 in chromium: "Upgrade Now" always in the wrench menu in
Views based interface
Re: Issue 54103 in chromium: Sync login input fields disabled, if user
enters wrong credentials.
Re: Issue 53151 in chromium: Sync: Signing in with invalid credentials
renders the dialog's username/password fields uneditable
--
Automated mail from issue updates at http://crbug.com/
Subscription options: http://groups.google.com/a/chromium.org/group/chromium-bugs
c***@googlecode.com
2010-09-01 20:00:40 UTC
Permalink
Your project notifications generated too many emails to send
individually. Here are the subject lines of the emails you would have
received:

Re: Issue 26862 in chromium: Localize GPU process name
Re: Issue 54109 in chromium: Integrate downloads with system virus scanner
Re: Issue 52504 in chromium: Share D3D surface and / or texture handles
between processes
Re: Issue 41036 in chromium: Changing audio device while viewing youtube
html5 video crashes chrome.
Re: Issue 45645 in chromium: HTML5 Video - Setting currentTime on some
videos fails
Re: Issue 45898 in chromium: ANGLE should handle rendering for WebGL and
NaCl
Re: Issue 43539 in chromium: "Report phishing site" option is missing from
report page
Re: Issue 54114 in chromium: tab crash on bookmark manager
Re: Issue 43097 in chromium: Refactor Demuxer such that Demuxer opens the
DataSource
Re: Issue 54112 in chromium: new tab page crash on expanding apps section
Re: Issue 52900 in chromium: Multiple Heapchecker leaks in
CreateNewFullscreenWidget
Re: Issue 54115 in chromium: ***@IPC::SendTask::Run
Re: Issue 54109 in chromium: Integrate downloads with system virus scanner
Re: Issue 53656 in chromium: Chrome can't be made as default while
installing when it already exists
Issue 54116 in chromium: "Recently closed" section should be hidable
Re: Issue 38475 in chromium: IsDefaultSearchProvider and
SetDefaultSearchProvider methods
Re: Issue 54090 in chromium: Invalid read in
HostResolverImplTest.OnlyAbortExistingRequestsOnIPAddressChange
Re: Issue 46601 in chromium: ExtensionApiTest.Popup is flaky on windows.
Issue 54117 in chromium: In wikimedia.org- garbage character does displayed
on page
Re: Issue 38992 in chromium: Reenable BrowserActionsContainerTest.Visibility
Re: Issue 50279 in chromium: Crash in WebCore::V8DOMWindow::toNative
Re: Issue 53193 in chromium: HTMLMediaElement.canPlayType gives false
positives in Chrome
Re: Issue 46601 in chromium: ExtensionApiTest.Popup is flaky on windows.
Re: Issue 52900 in chromium: Multiple Heapchecker leaks in
CreateNewFullscreenWidget
Re: Issue 50570 in chromium: Rounding error / off by one pixel when
rendering media resource load bar over HTTP
Issue 54118 in chromium: clean up RenderView::decidePolicyForNavigation for
extension cases
Re: Issue 52393 in chromium: Windows Live sites crashes
Re: Issue 43539 in chromium: "Report phishing site" option is missing from
report page
Re: Issue 54084 in chromium: Enable parallel gclient checkout by default
Issue 54119 in chromium: 7.0.512.0 is broken
Issue 54120 in chromium: In wikimedia.org- wikipedia- garbage character
does displayed on page
Re: Issue 54109 in chromium: Integrate downloads with system virus scanner
Re: Issue 54119 in chromium: 7.0.512.0 is broken
Re: Issue 42854 in chromium: Removing from downloads list results in
deleting file
Re: Issue 51131 in chromium: ChromeFrame: unit tests hits NOTREACHed in
Debug...
Re: Issue 54120 in chromium: In wikimedia.org- wikipedia- garbage character
does displayed on page
Re: Issue 54120 in chromium: In wikimedia.org- wikipedia- garbage character
does displayed on page
Re: Issue 54001 in chromium: DELETE verb still does not work
Re: Issue 54119 in chromium: 7.0.512.0 is broken
Re: Issue 54017 in chromium: "Upgrade Now" always in the wrench menu in
Views based interface
Re: Issue 54117 in chromium: In wikimedia.org- garbage character does
displayed on page
Re: Issue 54043 in chromium: Tab chrashes arbitrarily on google search
Re: Issue 53324 in chromium: Chromium crash on certain Google search terms
Re: Issue 54118 in chromium: clean up RenderView::decidePolicyForNavigation
for extension cases
Re: Issue 54090 in chromium: Invalid read in
HostResolverImplTest.OnlyAbortExistingRequestsOnIPAddressChange
Re: Issue 54017 in chromium: "Upgrade Now" always in the wrench menu in
Views based interface
Re: Issue 54049 in chromium: Chrome crashes when out of disk space
Re: Issue 53222 in chromium: Hosted apps should not show up in the
extensions management UI
Re: Issue 54104 in chromium: Chrome/Mac crashing multiple times per day
Re: Issue 54017 in chromium: "Upgrade Now" always in the wrench menu in
Views based interface
Re: Issue 42021 in chromium: Gmail Chat window minimizes and dissappears
when minimizing Gmail.
Re: Issue 50076 in chromium: HTTP Authentication: Add delegation support
for Kerberos
Re: Issue 54090 in chromium: Invalid read in
HostResolverImplTest.OnlyAbortExistingRequestsOnIPAddressChange
Re: Issue 48019 in chromium: GPU compositor cannot handle large layers
Issue 54121 in chromium: Accelerated 2D canvas does not support large
canvases
Re: Issue 54017 in chromium: "Upgrade Now" always in the wrench menu in
Views based interface
Re: Issue 54017 in chromium: "Upgrade Now" always in the wrench menu in
Views based interface
Re: Issue 46221 in chromium: About menu item should not disappear when
update available
Re: Issue 54017 in chromium: "Upgrade Now" always in the wrench menu in
Views based interface
Issue 54122 in chromium: No distinct icon for about:plugins
Re: Issue 54112 in chromium: new tab page crash on expanding apps section
Re: Issue 54114 in chromium: tab crash on bookmark manager
Issue 54123 in chromium: Change organic brand-code definitions to be
consistent
Re: Issue 54112 in chromium: new tab page crash on expanding apps section
Re: Issue 54017 in chromium: "Upgrade Now" always in the wrench menu in
Views based interface
Re: Issue 54017 in chromium: "Upgrade Now" always in the wrench menu in
Views based interface
Re: Issue 46221 in chromium: About menu item should not disappear when
update available
Re: Issue 54017 in chromium: "Upgrade Now" always in the wrench menu in
Views based interface
Re: Issue 54112 in chromium: new tab page crash on expanding apps section
Re: Issue 46221 in chromium: About menu item should not disappear when
update available
Re: Issue 54028 in chromium: Tim's watch is broken
Re: Issue 54017 in chromium: "Upgrade Now" always in the wrench menu in
Views based interface
Re: Issue 25336 in chromium: Safe browsing updates should be throttled
Re: Issue 54112 in chromium: new tab page crash on expanding apps section
Re: Issue 53598 in chromium: Add speech input feature to editable input
elements.
Re: Issue 54028 in chromium: Tim's watch is broken
Re: Issue 54047 in chromium: Chrome beta update server not available
(error: 12)
Re: Issue 53765 in chromium: Data race on
scoped_ptr&amp;lt;SpeechInputBubble&amp;gt; in speech tests
Re: Issue 54022 in chromium: open url from gnome-terminal crashes computer
Re: Issue 54000 in chromium: Chrome 7 launches ghost tab - closing it
crashes the whole browser
Re: Issue 54112 in chromium: new tab page crash on expanding apps section
Issue 54124 in chromium: if any app tab was opened after restarting beowser
it appears as pin tab
Issue 54125 in chromium: Weather Channel Runtime Failure
Re: Issue 54047 in chromium: Chrome beta update server not available
(error: 12)
Re: Issue 1906 in chromium: Shift-reload support
Re: Issue 53281 in chromium: maps.google.com zooming very weird with
compositor
Re: Issue 54006 in chromium: Security: Extension history permission does
not generate a warning
Re: Issue 25336 in chromium: Safe browsing updates should be throttled
Re: Issue 54086 in chromium: hit DCHECK navigating to extension gallery
Re: Issue 54112 in chromium: new tab page crash on expanding apps section
Re: Issue 54082 in chromium: Apps not working and backwards letters with
--enable-accelerated-compositing
Re: Issue 54000 in chromium: Chrome 7 launches ghost tab - closing it
crashes the whole browser
Re: Issue 54082 in chromium: Apps not working and backwards letters with
--enable-accelerated-compositing
Issue 54127 in chromium: Make a cancel button to "Clear browsing data"
Re: Issue 48913 in chromium: Clean up download code
Re: Issue 50060 in chromium: ui_test and browser_tests on mac test bots
(10.5 &amp;amp; 10.6) seem to leak processes when things go wrong and take
out the bot
Re: Issue 35275 in chromium: Download tests are so flaky, because they
don't wait properly
Re: Issue 54109 in chromium: Integrate downloads with system virus scanner
Re: Issue 54086 in chromium: hit DCHECK navigating to extension gallery
Re: Issue 54086 in chromium: hit DCHECK navigating to extension gallery
Re: Issue 54037 in chromium: Add an opt in crash reporting for Chromium
snapshots (behind a compile time flag)
--
Automated mail from issue updates at http://crbug.com/
Subscription options: http://groups.google.com/a/chromium.org/group/chromium-bugs
c***@googlecode.com
2010-09-01 21:58:37 UTC
Permalink
Your project notifications generated too many emails to send
individually. Here are the subject lines of the emails you would have
received:

Issue 54131 in chromium: regression: can't drag crx on to chrome to install
Re: Issue 54104 in chromium: Chrome/Mac crashing multiple times per day
Re: Issue 54131 in chromium: regression: can't drag crx on to chrome to
install
Re: Issue 51860 in chromium: Google Chrome 6.0.472.33 does not always save
passwords for websites
Re: Issue 48943 in chromium: [http://d2marine.com/]: Webpage does not load
Re: Issue 51349 in chromium: Accelerated compositing must fail gracefully
when gpu process fails to initialize
Re: Issue 54112 in chromium: new tab page crash on expanding apps section
Re: Issue 51349 in chromium: Accelerated compositing must fail gracefully
when gpu process fails to initialize
Re: Issue 53831 in chromium: chromium segfaults on EC2 Ubuntu Lucid Desktop
Re: Issue 44911 in chromium: Make app tab entrance/exit work beautifully
Re: Issue 44911 in chromium: Make app tab entrance/exit work beautifully
Re: Issue 54112 in chromium: new tab page crash on expanding apps section
Re: Issue 6905 in chromium: HistoryAutocomplete should score typed versus
untyped exact matches differently
Re: Issue 48604 in chromium: Failed to generate the crash report from
specific .dmp file
Issue 54133 in chromium: Yelp.com- Subscribe to the Yelp Blog! - page does
open with different content
Re: Issue 54133 in chromium: Yelp.com- Subscribe to the Yelp Blog! - page
does open with different content
Re: Issue 54029 in chromium: Pasting URL of gallery into omnibox results in
pinned tab
Re: Issue 6905 in chromium: HistoryAutocomplete should score typed versus
untyped exact matches differently
Re: Issue 27797 in chromium: Download shelf needs auto hide
Re: Issue 49094 in chromium: DOMUI: Implement the AutoFill sub-page tab for
the Personal Stuff options page
Re: Issue 53837 in chromium: Windows TSAN errors for
JingleThreadTest.PostTask
Re: Issue 53766 in chromium: Possible data race in libjingle
Issue 54134 in chromium: incognito : confirm or cancel download message is
seen on downloads page and not on download shelf
Re: Issue 47758 in chromium: Crash in [BalloonController closeBalloon:]
Re: Issue 54104 in chromium: Chrome/Mac crashing multiple times per day
Re: Issue 54096 in chromium: Autofill/Add Adress: "Edit" doesnt work.
Re: Issue 53766 in chromium: Possible data race in libjingle
Re: Issue 52649 in chromium: DOMUI: Implement search engine add/edit in
Browser options
Re: Issue 29625 in chromium: SPDY Proxy Support
Re: Issue 54100 in chromium: Autofill/Add Credit Card : "Apply"
and "Cancel" buttons are labeled as "Undefined"
Re: Issue 54101 in chromium: Longer search engine names("Youtube Video
Search") overlaps on its keywords when they make default.
Re: Issue 54069 in chromium: Crash reporter doesn't work with proxy
Re: Issue 51960 in chromium: ChromeFrame: Crash Report - Stack Signature:
CContentAnalyzer::IsBMP()-89C41
Re: Issue 54106 in chromium: Prefs/Basics/Startup/Add page: Failed to "Add"
the page from the list
Re: Issue 44911 in chromium: Make app tab entrance/exit work beautifully
Re: Issue 54102 in chromium: Extra non functional "Exception" button on
(Pop-ups,location and Notification)Content settings UI
Issue 54135 in chromium: Note in Reader bookmarklet doesn't work on pinned
tabs
Re: Issue 53585 in chromium: Extension disabling does not close all open
views
Re: Issue 54082 in chromium: Apps not working and backwards letters with
--enable-accelerated-compositing
Issue 54136 in chromium: zoom percentage doesn't reflect for about:* pages
Issue 54137 in chromium: must show a screenshot
Re: Issue 53585 in chromium: Extension disabling does not close all open
views
Re: Issue 53872 in chromium: chrome chrashes if system temp directory does
not exist
Re: Issue 53281 in chromium: maps.google.com zooming very weird with
compositor
Re: Issue 53249 in chromium: Input Text Fields: Mouse click incorrect
cursor position
Issue 54138 in chromium: Renderer Crash @ WebCore::CSSValueList::hasValue
Issue 54139 in chromium: new tab page : recently closed is missing
Issue 54140 in chromium: Events when moving windows are unclear
Issue 54141 in chromium: Zooming in/out on view-source:URL shouldn't affect
the actual URL
Re: Issue 53872 in chromium: chrome chrashes if system temp directory does
not exist
Re: Issue 48943 in chromium: [http://d2marine.com/]: Webpage does not load
Issue 54142 in chromium: Crash in the chrome browser process launched as
part of chrome frame.
Issue 54143 in chromium: Events documentation could use a warning
Issue 54144 in chromium: Under the Hood / Network/ Change Proxy settings
page is Incomplete and broken.
Re: Issue 52649 in chromium: DOMUI: Implement search engine add/edit in
Browser options
Re: Issue 52717 in chromium: text field problem on return from locked
desktop - ubuntu karmic
Re: Issue 53934 in chromium: Need to fake an XMPP server in the test sync
server
Re: Issue 20470 in chromium: chrome crash at
URLRequest::FollowDeferredRedirect
Issue 54145 in chromium: "Reset to defaults" functionality is not in DOM UI
Re: Issue 54126 in chromium: Glyph unicode - Stack overflow
Re: Issue 53872 in chromium: chrome chrashes if system temp directory does
not exist
Re: Issue 54144 in chromium: Under the Hood / Network/ Change Proxy
settings page is Incomplete and broken.
Issue 54146 in chromium: Clean up XmppSocketAdapter et al. in
jingle/notifier
Re: Issue 54070 in chromium: canvas createLinearGradient() works in only
the most basic situations
Re: Issue 54145 in chromium: "Reset to defaults" functionality is not in
DOM UI
Issue 54147 in chromium: ctrl+shift+del brings the clear browsing data
dialog than DOM UI
Re: Issue 37268 in chromium: url font too small and not readable in
constrained window
Re: Issue 54145 in chromium: "Reset to defaults" functionality is not in
DOM UI
Issue 54148 in chromium: need browser test for gallery downloads (both apps
and extensions)
Re: Issue 51960 in chromium: ChromeFrame: Crash Report - Stack Signature:
CContentAnalyzer::IsBMP()-89C41
Issue 54149 in chromium: Trying to save multiple files without interacting
with the download bar auto closes it
Re: Issue 51960 in chromium: ChromeFrame: Crash Report - Stack Signature:
CContentAnalyzer::IsBMP()-89C41
Re: Issue 54147 in chromium: ctrl+shift+del brings the clear browsing data
dialog than DOM UI
Re: Issue 54142 in chromium: Crash in the chrome browser process launched
as part of chrome frame.
Re: Issue 54071 in chromium: Crash reporter gets chrome stuck in a loop
with using proxy
Re: Issue 53138 in chromium: Flaky Mac browser tests crashing with: pure
virtual method called
Re: Issue 26015 in chromium: Browser crash @
JavascriptMessageBoxDialog::CloseModalDialog()
Re: Issue 54143 in chromium: Events documentation could use a warning
Re: Issue 54069 in chromium: Crash reporter doesn't work with proxy
Re: Issue 54140 in chromium: Events when moving windows are unclear
Re: Issue 54143 in chromium: Events documentation could use a warning
Re: Issue 54071 in chromium: Crash reporter gets chrome stuck in a loop
with using proxy
Re: Issue 54069 in chromium: Crash reporter doesn't work with proxy
Re: Issue 53697 in chromium: Chash in windows live and hotmail websites
Re: Issue 52393 in chromium: Windows Live sites crashes
Re: Issue 8752 in chromium: Problem with Chrome and Microsoft ISA Proxy
Server requiring authorisation
Re: Issue 54148 in chromium: need browser test for gallery downloads (both
apps and extensions)
Re: Issue 54126 in chromium: Glyph unicode - Stack overflow
Re: Issue 24704 in chromium: Application Failed to initialize properly
(0xc0000022)
Re: Issue 54069 in chromium: Crash reporter doesn't work with proxy
Re: Issue 21318 in chromium: Query FFmpeg libraries for codec support
Re: Issue 51757 in chromium: Layout Test
animations/suspend-resume-animation.html is failing
Issue 54150 in chromium: PPAPITest.Graphics2D is failing on Linux
Issue 54151 in chromium: need unit test to verify permissions behavior for
new permissions
Issue 54152 in chromium: http://www.keciborlumyo.net
Re: Issue 54150 in chromium: PPAPITest.Graphics2D is failing on Linux
Re: Issue 54142 in chromium: Crash in the chrome browser process launched
as part of chrome frame.
Issue 54153 in chromium: Bad magic number during extension install
Re: Issue 54126 in chromium: Glyph unicode - Stack overflow
Re: Issue 54153 in chromium: Bad magic number during extension install
Re: Issue 53891 in chromium: Crash when closing tab
--
Automated mail from issue updates at http://crbug.com/
Subscription options: http://groups.google.com/a/chromium.org/group/chromium-bugs
c***@googlecode.com
2010-09-01 23:35:02 UTC
Permalink
Your project notifications generated too many emails to send
individually. Here are the subject lines of the emails you would have
received:

Re: Issue 54155 in chromium: Renderer Crash @
WebCore::Editor::selectionStartCSSPropertyValue
Issue 54160 in chromium: Bookmark sorting options
Re: Issue 39517 in chromium: Request: Bookmark manager sorting by "date
added"
Re: Issue 27038 in chromium: "site:foo" triggers keyword UI if foo is a
keyword
Re: Issue 27038 in chromium: "site:foo" triggers keyword UI if foo is a
keyword
Issue 54161 in chromium: Intermittent ARM compile failures -- possible gcc
bug
Re: Issue 41697 in chromium: No title in bookmarks - Drag-n-drop bookmark
from address bar
Re: Issue 54069 in chromium: Crash reporter doesn't work with proxy
Re: Issue 49417 in chromium: Bookmark manager search clear problem
Re: Issue 54028 in chromium: Tim's watch is broken
Re: Issue 54028 in chromium: Tim's watch is broken
Re: Issue 52916 in chromium: Improved SSL status dialogs
Re: Issue 54102 in chromium: Extra non functional "Exception" button on
(Pop-ups,location and Notification)Content settings UI
Re: Issue 48862 in chromium: implement Exceptions dialogs for the various
content settings filters
Issue 54162 in chromium: [Accessibility] Pressing tab moves cursor out of
location bar.
Issue 54163 in chromium: Redirect loop when accessing Google Document owned
by Google Apps account
Re: Issue 53870 in chromium: on launching a new tab, flash of opened tabs
is seen on new tab page
Re: Issue 54154 in chromium: Creating a new tab flashes the page preview
Issue 54164 in chromium: context menu doesn't come up for www.youtube.com
videos (infrequent)
Re: Issue 54150 in chromium: PPAPITest.Graphics2D is failing on Linux
Issue 54165 in chromium: Large PDF size zoom
Issue 54166 in chromium: No sound in HTML5 videos
Re: Issue 54028 in chromium: Tim's watch is broken
Re: Issue 54093 in chromium: Autofill: "Zip code" text field on the "Add
Address" sheet is out of the area
Re: Issue 53609 in chromium: Autofill options : edit address field overlap
with border of dialog window
Re: Issue 54166 in chromium: No sound in HTML5 videos
Re: Issue 54069 in chromium: Crash reporter doesn't work with proxy
Re: Issue 53493 in chromium: options > basics > on startup : add and cancel
button don't work for adding url
Re: Issue 54106 in chromium: Prefs/Basics/Startup/Add page: Failed to "Add"
the page from the list
Issue 54167 in chromium: Crash on www.thewildernessdowntown.com when
pasting over highlighted text
Issue 54168 in chromium: time lag seen on playing cnn video
Re: Issue 54167 in chromium: Crash on www.thewildernessdowntown.com when
pasting over highlighted text
Re: Issue 54150 in chromium: PPAPITest.Graphics2D is failing on Linux
Re: Issue 19991 in chromium: Linux Certificate Management UI
Re: Issue 32410 in chromium: Implement sync for passwords
Re: Issue 48706 in chromium: Sync UI for setting and updating the sync
passphrase
Re: Issue 54155 in chromium: Renderer Crash @
WebCore::Editor::selectionStartCSSPropertyValue
Re: Issue 48702 in chromium: Re-encrypt sync nodes on passphrase change
Issue 54169 in chromium: att.net - adv. image displayed as a web page can
not displayed
Issue 54170 in chromium: Flash video does not appear on display :1 of
multi-xserver system
Re: Issue 54169 in chromium: att.net - adv. image displayed as a web page
can not displayed
Re: Issue 45698 in chromium: Staggered auto-enrollment for new sync
datatypes
Re: Issue 54006 in chromium: Security: Extension history permission does
not generate a warning
Re: Issue 42152 in chromium: Make syncapi mockable to help us test
ModelAssociators and ChangeProcessors
Re: Issue 53297 in chromium: CNN flash video won't play on 7.0.503.0
Re: Issue 41335 in chromium: Host content settings do not "live sync"
Re: Issue 16838 in chromium: Hotmail downloads attachment twice
Re: Issue 52768 in chromium: "Set up sync" preference dialog in Japanese is
too big.
Re: Issue 50444 in chromium: write a migration from the old token storage
mechanism to the new one
Re: Issue 50294 in chromium: Notification popup needed whenever
authorization has expired
Re: Issue 53979 in chromium: Crash in TranslateManager::Observe
Re: Issue 40264 in chromium: ProfileSyncService accessed from non-UI thread
Issue 54171 in chromium: Video content on cnn doesn't load sometimes
Re: Issue 38402 in chromium: Heap leak checker reports memory leaks in
ProfileSyncFactoryImpl::CreateProfileSyncService (unit_tests)
Re: Issue 34207 in chromium: ModelAssociation change numbers /
WriteTransaction timestamps
Re: Issue 53979 in chromium: Crash in TranslateManager::Observe
Re: Issue 54149 in chromium: Trying to save multiple files without
interacting with the download bar auto closes it
Issue 54172 in chromium: Seccomp sandbox interfering with benchmarking code
Re: Issue 54155 in chromium: Renderer Crash @
WebCore::Editor::selectionStartCSSPropertyValue
Re: Issue 53899 in chromium: Firefox3 search engine import sometimes fails
on ubuntu karmic
Re: Issue 53242 in chromium: GTK_IS_WINDOW failure when displaying an HTTP
auth prompt in a non-foreground tab
Re: Issue 27708 in chromium: REGRESSION: Can't copy an image and paste into
gmail or to the desktop
Issue 54173 in chromium: Incognito split mode extensions run even without
user opt-in
Re: Issue 19757 in chromium: syncapi shutdown blocks UI in janky way
Issue 54174 in chromium: task manager window resize transition is not smooth
Re: Issue 27708 in chromium: REGRESSION: Can't copy an image and paste into
gmail or to the desktop
Re: Issue 27708 in chromium: REGRESSION: Can't copy an image and paste into
gmail or to the desktop
Re: Issue 52545 in chromium: Notification UI tweaks
Re: Issue 19576 in chromium: Bookmark sync makes bookmarks appear in
History tab
Re: Issue 49566 in chromium: [AutoFill credit cards] Editing last 4 digit
card number is not saved.
Re: Issue 52545 in chromium: Notification UI tweaks
Re: Issue 18431 in chromium: Ctrl + Shift shortcut will make Chrome
exit "Search &lt;your search engine&gt;" mode
Re: Issue 44591 in chromium: Arrowing to keyword in omnibox dropdown does
not prevent ctrl from making search UI disappear
Re: Issue 41286 in chromium: Use a different default icons for apps
Re: Issue 54006 in chromium: Security: Extension history permission does
not generate a warning
Re: Issue 54052 in chromium: Clicking on a search keyword result in the
autocomplete popup does nothing
Re: Issue 52891 in chromium: [host] Fix IPC channel instability
Re: Issue 54173 in chromium: Incognito split mode extensions run even
without user opt-in
Re: Issue 52891 in chromium: [host] Fix IPC channel instability
Re: Issue 51178 in chromium: need extensions API for apps
Re: Issue 54149 in chromium: Trying to save multiple files without
interacting with the download bar auto closes it
Issue 54175 in chromium: Zombies with Downloads
Re: Issue 44591 in chromium: Arrowing to keyword in omnibox dropdown does
not prevent ctrl from making search UI disappear
Re: Issue 54150 in chromium: PPAPITest.Graphics2D is failing on Linux
Re: Issue 54172 in chromium: Seccomp sandbox interfering with benchmarking
code
Re: Issue 18431 in chromium: Ctrl + Shift shortcut will make Chrome
exit "Search &lt;your search engine&gt;" mode
Re: Issue 54052 in chromium: Clicking on a search keyword result in the
autocomplete popup does nothing
Re: Issue 54155 in chromium: Renderer Crash @
WebCore::Editor::selectionStartCSSPropertyValue
Issue 54176 in chromium: Install Errors 4, 5, and 6
Re: Issue 54172 in chromium: Seccomp sandbox interfering with benchmarking
code
Issue 54177 in chromium: Install Errors 4, 5, and 6
Re: Issue 54176 in chromium: Install Errors 4, 5, and 6
Re: Issue 53374 in chromium: Install Errors 5 and 6
Re: Issue 53165 in chromium: Resizing looks broken and leaks memory when
compositor is active
Issue 54178 in chromium: Error 12: TEMP_DIR_FAILED
Issue 54179 in chromium: Chrome shows unsafe download warning on installing
extensions
Issue 54180 in chromium: 'Update Google Chrome' menu option is persistent
after browser restart
Issue 54181 in chromium: Set V8 Executable Memory Capacity via
SetResourceConstraints API
Issue 54182 in chromium: Error 13: UNCOMPRESSION_FAILED
Issue 54183 in chromium: Developers need a way to handle API fragmentation
Issue 54184 in chromium: Webkit Mac bug: Antialiasing is "sticky" for
@font-face fonts
--
Automated mail from issue updates at http://crbug.com/
Subscription options: http://groups.google.com/a/chromium.org/group/chromium-bugs
Continue reading on narkive:
Loading...