Discussion:
100 messages from Google Code
(too old to reply)
c***@googlecode.com
2015-01-05 18:39:28 UTC
Permalink
Your project notifications generated too many emails to send
individually. Here are the subject lines of the emails you would have
received:

Re: Issue 445936 in chromium: Video YouTubeHTML5 test is failing due to
early launch of a ppapi process during login
Re: Issue 445936 in chromium: Video YouTubeHTML5 test is failing due to
early launch of a ppapi process during login
Re: Issue 445510 in chromium: Add instrumentation to capture stacks for
MessageLoop tasks that block for a long time
Re: Issue 445805 in chromium: 4.2% regression in
dromaeo.jslibtraversejquery at 309819:309819
Re: Issue 445671 in chromium: Error console errors don't clear when an
extension is reloaded
Re: Issue 445385 in chromium: Datalist of input can't be brought up after
replacing content of unrelated element
Re: Issue 446123 in chromium: 85.5% regression in
smoothness.tough_scrolling_cases at 309855:309863
Re: Issue 446124 in chromium: 96.3% regression in
smoothness.tough_scrolling_cases at 309860:309867
Re: Issue 446138 in chromium: Regression: Text/font size is decreased on
chrome://predictors.
Issue 446197 in chromium: malformed call to RecordAction warnings
Re: Issue 436810 in chromium: Blank print preview dialog after "using print
with system dialog".
Re: Issue 371538 in chromium: Componentize //chrome/browser/autocomplete
Re: Issue 370850 in chromium: ☂ Componentize //chrome/browser/history
Re: Issue 422685 in chromium: Backspace submits composition string
unexpectedly
Re: Issue 445657 in chromium: Browser action icon badges cut off by
Bookmarks Bar
Re: Issue 446185 in chromium: dia
Re: Issue 435783 in chromium: Chrome Extensions Freeze/Don't Load Randomly.
Re: Issue 446151 in chromium: Video playback missing for Facebook videos on
Link freon
Re: Issue 445645 in chromium: Telemetry tests are failing on Chromeboxes
Re: Issue 445587 in chromium: DevTools: preserve consistent backend vs
protocol commands state
Re: Issue 446151 in chromium: Video playback missing for Facebook videos on
Link freon
Re: Issue 445026 in chromium: Webpage becomes unresponsive after zoom out
for http://people.mozilla.org/~sicking/webgl/ray.html
Re: Issue 432786 in chromium: "Your camera is currently unavailable
another app may be using it" error displayed on the screen while system
wake up from preview mode
Re: Issue 433969 in chromium: video_ChromeHWDecodeUsed: Under link_freon
h264 hardware video decode fails and falls back to software playback
Re: Issue 433969 in chromium: video_ChromeHWDecodeUsed: Under link_freon
h264 hardware video decode fails and falls back to software playback
Issue 446201 in chromium: coreboot's spi_flash_cmd_write() allocates
unbounded amounts of stack space
Re: Issue 52489 in chromium: Hotel internet clobbers all my tabs
Re: Issue 442440 in chromium: wifi_sync: add chrome://flags UI
Re: Issue 443874 in chromium: chrome://net-internals/#visualizer is broken
Re: Issue 443746 in chromium: ChromeOS reports out-of-space error
downloading a file, but there's seemingly no UX showing the device's
storage capacity?
Re: Issue 442440 in chromium: wifi_sync: add chrome://flags UI
Re: Issue 440305 in chromium: Enable memory.top_7_stress
Re: Issue 446112 in chromium: Show Download Status in Notification Center
Re: Issue 412908 in chromium: Black rectangles instead of some content on
printouts.
Re: Issue 443020 in chromium: history.forward() can cause indefinite
loading spinner
Re: Issue 446010 in chromium: Chrome remote desktop plugin blocked
Re: Issue 440159 in chromium: 6.1%-117.9% regression in page_cycler.dhtml
at 296254:296338
Re: Issue 437932 in chromium: Schedule a late deadline when swap throttled
Re: Issue 446012 in chromium: login_OobeLocalization flake on stumpy
Re: Issue 415987 in chromium: Difficult to open an image from Files in the
browser.
Re: Issue 367027 in chromium: Files.app: protocol for browsing new external
filesystem files (MTP, ProvidedFS).
Re: Issue 446012 in chromium: login_OobeLocalization flake on stumpy
Re: Issue 430672 in chromium: Perf dashboard: Alert only if the graph "is
similar to" a step function graph.
Re: Issue 446183 in chromium: TabsTest#testOpenAndCloseNewTabButton is
failing
Re: Issue 418375 in chromium: Remove action_name_to_run from page_test
Re: Issue 445675 in chromium: 18%-22.3% regression in blink_perf.dom at
309751:309752
Re: Issue 446099 in chromium: Regression : Added path does not get saved on
mouse click in "Excluded folders" options in "workspace" of dev tools.
Re: Issue 303874 in chromium: debugd: fix parsing of boolean arguments
3 issues changed in chromium
Re: Issue 52489 in chromium: Hotel internet clobbers all my tabs
Re: Issue 429781 in chromium: MediaKeySystemOptions checking incomplete
Re: Issue 425186 in chromium: Implement
Navigator.requestMediaKeySystemAccess()
Re: Issue 374751 in chromium: EME should handle extended codecs like
non-EME canPlayType() does
3 issues changed in chromium
Issue 446202 in chromium: Histogram reporting methods in
data_reduction_proxy_usage_stats should not pass around a mutable URLRequest
Re: Issue 435174 in chromium: Audit cloud storage and pagesets for
mismatched bucket permissions
Re: Issue 445449 in chromium: ARC: Trybot result link has https causing DNS
error.
Re: Issue 425186 in chromium: Implement
Navigator.requestMediaKeySystemAccess()
Re: Issue 424387 in chromium: Add histograms to measure ResourceScheduler
request scheduling changes.
Re: Issue 52489 in chromium: Hotel internet clobbers all my tabs
3 issues changed in chromium
Issue 446203 in chromium: Animated gifs don't animate in Gallery
Re: Issue 442604 in chromium: Tabs alerts steal focus
Re: Issue 456 in chromium: Javascript alerts are modal to Chrome UI, not to
individual tab.
Re: Issue 445671 in chromium: Error console errors don't clear when an
extension is reloaded
Re: Issue 446157 in chromium: not opening
Re: Issue 425186 in chromium: Implement
Navigator.requestMediaKeySystemAccess()
Re: Issue 341591 in chromium: Bookmarks multiplying like crazy
Re: Issue 446203 in chromium: Animated gifs don't animate in Gallery
Re: Issue 437640 in chromium: privetd: Write end to end WiFi bootstrapping
integration test
Re: Issue 443770 in chromium: apmanager: add firewall rule for dhcp server
Re: Issue 445357 in chromium: SYncopate Google Web Font shows bold
everywhere
Re: Issue 443787 in chromium: Get gizmo boards into the lab
Re: Issue 386786 in chromium: UpdateDrawProperties is slow
Re: Issue 446160 in chromium: Feature request: Accept regexp in search box
(ctrl + f)
Re: Issue 445880 in chromium: Parallelize test execution to speed up
buildbot runs
Re: Issue 445433 in chromium: 12.4% regression in blink_perf.parser at
309340:309342
Re: Issue 445439 in chromium: 31.4% regression in
smoothness.simple_mobile_sites at 309587:309587
Re: Issue 445612 in chromium: 5.5% regression in dromaeo.domcoreattr at
309744:309747
Re: Issue 422685 in chromium: Backspace submits composition string
unexpectedly
Re: Issue 445951 in chromium: cannot access to configuration page of
chromebook
Re: Issue 401423 in chromium: Select file dialog has no focus on ubuntu
unity
Re: Issue 445671 in chromium: Error console errors don't clear when an
extension is reloaded
Re: Issue 441924 in chromium: ARC: Verify list of supported extensions.
Re: Issue 93292 in chromium: "(exe:10921): Gdk-WARNING **: XID collision,
trouble ahead" message when trying to download pdf file multiple times
Re: Issue 430110 in chromium: crnet: ios crnet binaries are too big
Issue 446207 in chromium: ASSERTION FAILED: !shouldUseThreading() in
blink::HTMLDocumentParser::append
Re: Issue 427718 in chromium: Switch chrome/android from stlport to libc++
Re: Issue 426392 in chromium: Add captured state to Monkey
Re: Issue 445880 in chromium: Parallelize test execution to speed up
buildbot runs
Re: Issue 425229 in chromium: MacViews: Get views based chrome browser
building and running on the Mac
Re: Issue 424795 in chromium: Setting audioContext.destination.channelCount
to more than 8 breaks Web Audio API
Re: Issue 426392 in chromium: Add captured state to Monkey
Re: Issue 357528 in chromium: Mouse wheel stops working after reload in
www.google.com
Re: Issue 441924 in chromium: ARC: Verify list of supported extensions.
Re: Issue 433202 in chromium: Changing benchmark radically changes selected
series
Re: Issue 436959 in chromium: print dialog box attaches to the bottom of
pop-up windows
Re: Issue 436959 in chromium: print dialog box attaches to the bottom of
pop-up windows
Re: Issue 444085 in chromium: Extension is disabled by content verification
for all users (with CV enabled)
Re: Issue 436959 in chromium: print dialog box attaches to the bottom of
pop-up windows
--
--
Automated mail from issue updates at http://crbug.com/
Subscription options: http://groups.google.com/a/chromium.org/group/chromium-bugs

To unsubscribe from this group and stop receiving emails from it, send an email to chromium-bugs+***@chromium.org.
c***@googlecode.com
2015-01-05 22:00:11 UTC
Permalink
Your project notifications generated too many emails to send
individually. Here are the subject lines of the emails you would have
received:

Re: Issue 445320 in chromium: HW VP8 encoding offload is not enabled by
default on AOS
Re: Issue 424159 in chromium: APPCRASH chrome.exe
Re: Issue 394130 in chromium: Unify open_resource logic for SFI and non-SFI
codepaths
Re: Issue 444524 in chromium: Regression: Chrome crashes as soon as
behavior is set as 'Detect important content' for any website in Plug-in
exceptions.
Re: Issue 444094 in chromium: history.pushState shouldn't save scroll
position
Re: Issue 446113 in chromium: Observing larger Findin Searchbox
Re: Issue 446243 in chromium: Crash on update on two Freon chromeboxes
Re: Issue 432409 in chromium: Files.app: An error raised when clicking on
thumbnails on the preview panel.
Issue 446254 in chromium: chromium-cq-status doesn't render stats
Issue 446255 in chromium: New Avatar Button appears active with an inactive
Windows glass frame.
Re: Issue 446241 in chromium: mario incremental build failing in power
manager.
Re: Issue 333398 in chromium: Delay between ebuild commit and uprev commit
Re: Issue 441840 in chromium: ex lengths are computed incorrectly
Re: Issue 445071 in chromium: 10- and 12-bit video support - decode only
Re: Issue 444721 in chromium: Teach deploy_production script to update
golo_proxy server
Re: Issue 446255 in chromium: New Avatar Button appears active with an
inactive Windows glass frame.
Issue 446256 in chromium: Optimize-out overdraw in display list 2D canvas.
Re: Issue 446222 in chromium: Blink AutoRollBot is down
Re: Issue 445672 in chromium: X server memory leak each time chrome open up
a new window
Re: Issue 445362 in chromium: Sound echos on Chromebook
Re: Issue 442952 in chromium: UNKNOWN in blink::DOMPluginArray::refresh
Re: Issue 385874 in chromium: EME code should not be using MIME types
Issue 446257 in chromium: Kiosk apps are not persisting data when run on
enterprise enrolled devices
Issue 446258 in chromium: Support audio-only or video-only mode in
media::RendererImpl.
Re: Issue 430179 in chromium: images in position: fixed element hidden on
scroll
Re: Issue 445788 in chromium: Google Chrome for MAC OS X sigsegv crash :
Clicking on the small icon into the location bar (before the URL) on an
about:blank page loaded with by special JavaScript/HTML code
Re: Issue 446257 in chromium: Kiosk apps are not persisting data when run
on enterprise enrolled devices
Re: Issue 446092 in chromium: Chrome OS: fails to open a PDF file via Files
app
Re: Issue 446257 in chromium: Kiosk apps are not persisting data when run
on enterprise enrolled devices
Re: Issue 446257 in chromium: Kiosk apps are not persisting data when run
on enterprise enrolled devices
Issue 446259 in chromium: Chrome ignores BDO tags for sizing but renders it
the correct directionality
Re: Issue 445614 in chromium: When navigating a page with temporary zoom
level to a link with the same origin, zoom should not change.
Re: Issue 176727 in chromium: Heavy I/O generated by chrome during
inactivity - what happen/some craches?
Re: Issue 25431 in chromium: Implement support for MP4 reference movies
Re: Issue 445614 in chromium: When navigating a page with temporary zoom
level to a non-in-page link, zoom mode should revert to default.
Issue 446261 in chromium: 3 SVG tests are failing on XP
Re: Issue 446258 in chromium: Support audio-only or video-only mode in
media::RendererImpl.
Re: Issue 446259 in chromium: Chrome ignores BDO tags for sizing but
renders it the correct directionality
Issue 446262 in chromium: Visual overflow is often wrong with writing modes
other than horizontal-tb
Re: Issue 445451 in chromium: [WebRTC] updateIce() fails with "Failed to
execute 'updateIce' on 'RTCPeerConnection': Could not update the ICE Agent
with the given configuration."
Re: Issue 394726 in chromium: "ok google" hangs browser for a second or two
on NTP
Re: Issue 446091 in chromium: Poor Performance with Dual Discrete Nvidia
GPUs on Mac OS X
Re: Issue 398112 in chromium: Webapps don't change the height of the
ContentViewRenderView when the keyboard pops up
Re: Issue 441962 in chromium: APP Menu in Persian is disturded
Re: Issue 446243 in chromium: Crash on update on two Freon chromeboxes
Re: Issue 444679 in chromium: [WebRTC] {offerToReceiveAudio: 1 or true}
generates m=video with a=sendonly
Re: Issue 421946 in chromium: transform-style not respecting transforms in z
Re: Issue 446039 in chromium: chrome app reports audio/ogg for theora video
file
Re: Issue 444524 in chromium: Regression: Chrome crashes as soon as
behavior is set as 'Detect important content' for any website in Plug-in
exceptions.
Re: Issue 446257 in chromium: Kiosk apps are not persisting data when run
on enterprise enrolled devices
Re: Issue 444679 in chromium: [WebRTC] {offerToReceiveAudio: 1 or true}
generates m=video with a=sendonly
Re: Issue 439764 in chromium: Video decoding slow/low fps with d3d11
Re: Issue 444914 in chromium: Freon: external keyboard number keys on the
right side panel disabled
Re: Issue 446091 in chromium: Poor Performance with Dual Discrete Nvidia
GPUs on Mac OS X
Re: Issue 437229 in chromium: Regression: Unnecessary navigation of link is
shown in 'Terry-June' Demo.
Re: Issue 353425 in chromium: Chromium building is not portable
Re: Issue 446113 in chromium: Observing larger Findin Searchbox
Re: Issue 445670 in chromium: High-bandwidth downloads cause silent
ethernet connection failure
Re: Issue 446232 in chromium: Smart Lock: Crashing on Chrome Canary on
Sign-in screen
Re: Issue 445510 in chromium: Add instrumentation to capture stacks for
MessageLoop tasks that block for a long time
Re: Issue 443203 in chromium: Interstitial fonts broken
Re: Issue 446173 in chromium: "Privacy error" page - strange fonts
Re: Issue 418795 in chromium: PortForwardingTest.LoadPageWithStyleAnsScript
fails in mac_trunk 8011 builder
Issue 446263 in chromium: Unprefixed EME should prompt in
requestMediaKeySystemAccess() rather than when generating the license
request
Re: Issue 136305 in chromium: Incorrect naming of .tar.gz downloaded files
Re: Issue 441883 in chromium: Android cronet builders periodically
failing "provision_devices" b/c devices offline.
Re: Issue 438721 in chromium: HTML5 video freezes during playback of first
content range
Re: Issue 444163 in chromium: Slimming Paint crashes
rasterize_and_record_micro.top_25_smooth
Re: Issue 446257 in chromium: Kiosk apps are not persisting data when run
on enterprise enrolled devices
Issue 446264 in chromium: Update the fill icon in sheet to match Google
Sheet fill icon
Re: Issue 446113 in chromium: Observing larger Findin Searchbox
Re: Issue 443734 in chromium: Chrome very slow to start with lots of tabs.
Re: Issue 442308 in chromium: Chromebook Pixel -> Chromebook Acer C720
H.264 video not working
Re: Issue 441962 in chromium: APP Menu in Persian is disturded
Re: Issue 436379 in chromium: tabs switched away from wrongly
trigger "pages unresponsive" dialog
Re: Issue 441687 in chromium: Poor quality H.264 video Chromebook ->
Chromebook for both parties.
Re: Issue 446113 in chromium: Observing larger Findin Searchbox
Re: Issue 413167 in chromium: crbug.com uses RC4 and does not support
TLSv1.2
Re: Issue 437229 in chromium: Regression: Unnecessary navigation of link is
shown in 'Terry-June' Demo.
Re: Issue 363562 in chromium: auto should not be a valid/default value
for 'widows'
Re: Issue 443376 in chromium: extend create element factory
Re: Issue 444625 in chromium: Add all servers to server_db
Re: Issue 444581 in chromium: some sites do not scroll in chrome 40 on
android
Re: Issue 441694 in chromium: Chromebook -> Firefox very low quality
(unusable) video using h264.
Re: Issue 394726 in chromium: "ok google" hangs browser for a second or two
on NTP
Re: Issue 445618 in chromium: Mojo Windows: test_structs.mojom C++ bindings
don't compile
Re: Issue 441694 in chromium: Chromebook -> Firefox very low quality
(unusable) video using h264.
Issue 446265 in chromium: Remove Bitmap allocations for pattern (tiled)
drawing
Re: Issue 446232 in chromium: Smart Lock: Crashing on Chrome Canary on
Sign-in screen
Re: Issue 445610 in chromium: chrome://net-internals consistently crashes
for Chrome on Android
Re: Issue 408536 in chromium: build105-a1: tmp directory full on Mac 10.8
Perf (2) - ?
Re: Issue 389194 in chromium: Add Push API support from inside Service
Worker
Re: Issue 443024 in chromium: Search engine keywords renamed, but no dupes
are visible; many entries deleted
Re: Issue 440646 in chromium: settings/autofillEditAddress: shift+tab
doesn’t focus close button for name/phone/email
Re: Issue 445362 in chromium: Sound echos on Chromebook
Re: Issue 446113 in chromium: Observing larger Findin Searchbox
Re: Issue 444428 in chromium: Multiple bookmark drag and drop tests broken
on ozone
Re: Issue 444524 in chromium: Regression: Chrome crashes as soon as
behavior is set as 'Detect important content' for any website in Plug-in
exceptions.
Re: Issue 385913 in chromium: Chromium Hackability Code Yellow
Re: Issue 446229 in chromium: Images become transparent or vanish when I
hover over them
--
--
Automated mail from issue updates at http://crbug.com/
Subscription options: http://groups.google.com/a/chromium.org/group/chromium-bugs

To unsubscribe from this group and stop receiving emails from it, send an email to chromium-bugs+***@chromium.org.
c***@googlecode.com
2015-01-05 23:02:45 UTC
Permalink
Your project notifications generated too many emails to send
individually. Here are the subject lines of the emails you would have
received:

Re: Issue 445977 in chromium: DCHECK(!IsSurfaceless) hit on Chrome startup
Re: Issue 445610 in chromium: chrome://net-internals consistently crashes
for Chrome on Android
Re: Issue 443522 in chromium: Focus is missing on "Add a new word" textbox
while tabbing
Re: Issue 445877 in chromium: Regression : time(ms) text seen chopped from
right side in compositor frame time counter of dev tools.
Re: Issue 372802 in chromium: Make all calls to
RenderLayerScrollableArea::setScrollOffset happen during the same part of
the document lifecycle.
Re: Issue 420741 in chromium: Process scroll updates after compositing
update
Re: Issue 444239 in chromium: 22.7% regression in
image_decoding.image_decoding_measurement at 309237:309243
Re: Issue 444721 in chromium: Teach deploy_production script to update
golo_proxy server
Issue 446281 in chromium: Permissions not matching between cros client and
web client
Re: Issue 441872 in chromium: Double click to print single event details
Re: Issue 445788 in chromium: Google Chrome for MAC OS X sigsegv crash :
Clicking on the small icon into the location bar (before the URL) on an
about:blank page loaded with by special JavaScript/HTML code
Re: Issue 438083 in chromium: Can't toggle 'My Drive' folder closed without
selecting it too
Re: Issue 445455 in chromium: 23.1%-48.7% regression in blink_perf.canvas
at 305268:305332
Issue 446283 in chromium: Omnibox on Android Should Use Full List of
Keyboard Suggestions, not only most likely
Re: Issue 446113 in chromium: Observing larger Findin Searchbox
Re: Issue 369387 in chromium: Omnibox Swype-Like Keyboard Should Auto-Add
Word Break
Re: Issue 133097 in chromium: Support Lion scrolling overhang areas in the
compositor thread
Re: Issue 418886 in chromium: [2003 Specific] Cell height is not resized
automatically for rotated text in .xls (2003) file
Re: Issue 443752 in chromium: Tab just opened via extension always reports
devicePixelRatio=1 disregarding the actual devicePixelRatio
Re: Issue 446271 in chromium: Enter one-line summary
Re: Issue 446267 in chromium: Google Maps blank on linux
Re: Issue 444930 in chromium: BrowserCdmManager should be part of content/
public API for content embedders
Re: Issue 446248 in chromium: Overdraw issue with display list 2D canvas
Re: Issue 445010 in chromium: 69.8% regression in blink_perf.animation at
308965:309558
Re: Issue 430866 in chromium: [polymer-qowt] : Highlighted text is not
re-set on selecting “None” from text highlight options.
Re: Issue 430866 in chromium: [polymer-qowt] : Highlighted text is not
re-set on selecting “None” from text highlight options.
Re: Issue 444271 in chromium: 16.7% regression in graphics_GLMark2 at
22430000656400000:22440000656900000
Re: Issue 444030 in chromium: 1.9%-56.3% regression in browser_tests at
1418125561:1418134106
Re: Issue 445848 in chromium: Regression: Image on WebGL experiments
flickers on clicking 'copy image' context menu.
Re: Issue 440415 in chromium: Enable local storage of wheels for infra.git
Issue 446288 in chromium: Chromoting: cleanup desktop shape handling
Re: Issue 443660 in chromium: 16.2% regression in blink_perf.parser at
308785:308939
Issue 446290 in chromium: 404 HTTP errors should not be "quickoffice crash"
errors
Re: Issue 446257 in chromium: Kiosk apps are not persisting data when run
on enterprise enrolled devices
Re: Issue 444085 in chromium: Extension is disabled by content verification
for all users (with CV enabled)
Re: Issue 442535 in chromium: 22.4%-23.2% regression in blink_perf.parser
at 301710:301767
Re: Issue 446011 in chromium: Make non-complex text in complex path faster
Re: Issue 446261 in chromium: 3 SVG tests are failing on XP
Re: Issue 446086 in chromium: HW accelerated encoding via MediaCodec not
working on all Lollipop devices
Issue 446291 in chromium: In the autotest graphite support code, remove
dependencies on other autotest modules.
Re: Issue 433459 in chromium: consolidate boilerplate and cleanup
cbuildbot_config.py
Re: Issue 433459 in chromium: consolidate boilerplate and cleanup
cbuildbot_config.py
Re: Issue 444625 in chromium: Add all servers to server_db
Re: Issue 433459 in chromium: consolidate boilerplate and cleanup
cbuildbot_config.py
Re: Issue 446177 in chromium: New NSS seems to introduce races between key
generation and key lookup
Re: Issue 440201 in chromium: 37.2% regression in smoothness.top_25_smooth
at 307067:307115
Issue 446292 in chromium: Drive errors need better handling
Re: Issue 446011 in chromium: Make non-complex text in complex path faster
Re: Issue 419701 in chromium: getProfileUserInfo returns id, but not email
Re: Issue 444501 in chromium: Not able to launch "get help" app and "get
help with using chrome os" button is not working.
Re: Issue 439680 in chromium: 4.9% regression in
thread_times.key_silk_cases at 306835:306990
Re: Issue 444786 in chromium: 3.9% regression in
rasterize_and_record_micro.key_silk_cases at 309418:309422
Re: Issue 378527 in chromium: SVG Javascript memory leak
Re: Issue 441687 in chromium: Poor quality H.264 video Chromebook ->
Chromebook for both parties.
Re: Issue 445914 in chromium: PredictorTests.TestMonthWords unit test fails
in 2015
Re: Issue 437050 in chromium: 10% regression in blink_perf.parser at
305714:305747
Re: Issue 446177 in chromium: New NSS seems to introduce races between key
generation and key lookup
Re: Issue 436690 in chromium: 2%-48.8% regression in
thread_times.key_mobile_sites at 305252:305276
Issue 446294 in chromium: CSS: Motion Path interaction with compositor
Re: Issue 436631 in chromium: 7.4% regression in
scheduler.tough_scheduling_cases max_frame_delay_99 at 305082:305097
Issue 446295 in chromium: Nudge the starting good or bad revision if
there's a failure getting reference results.
Re: Issue 446177 in chromium: New NSS seems to introduce races between key
generation and key lookup
Re: Issue 99369 in chromium: Chrome/Chromium is missing side/vertical tabs
Re: Issue 437273 in chromium: Reloading policy in public sessions drops all
the policies for extensions
Re: Issue 434030 in chromium: 38.8% regression in
session_restore.cold.typical_25 at 304336:304356
Re: Issue 315308 in chromium: PolicyTest.SessionLengthLimit,
WaitForInitialUserActivitySatisfied, WaitForInitialUserActivityUsatisfied
flaky on cros
Re: Issue 446113 in chromium: Observing larger Findin Searchbox
Issue 446297 in chromium: Headers and footers too big
Re: Issue 441054 in chromium: echoCancellation: false constraint does
nothing in Chrome in Nexus 6
Re: Issue 443099 in chromium: Regression: Action button remains highlighted
in autofill details form.
Re: Issue 445788 in chromium: Google Chrome for MAC OS X sigsegv crash :
Clicking on the small icon into the location bar (before the URL) on an
about:blank page loaded with by special JavaScript/HTML code
Re: Issue 442514 in chromium: replace COMPILE_ASSERT with static_assert
Re: Issue 445162 in chromium: Regression: The images appear chopped after
zoom out in 'Full Screen Weather' app.
Re: Issue 442952 in chromium: UNKNOWN in blink::DOMPluginArray::refresh
Re: Issue 437046 in chromium: 7.2%-7.6% regression in spaceport at
305636:305657
Re: Issue 446202 in chromium: Histogram reporting methods in
data_reduction_proxy_usage_stats should not pass around a mutable URLRequest
Re: Issue 444507 in chromium: Regression: Mouse cursor focus issue observed
for "Set pages" in chrome://settings.
Re: Issue 446202 in chromium: Histogram reporting methods in
data_reduction_proxy_usage_stats should not pass around a mutable URLRequest
Re: Issue 444507 in chromium: Regression: Mouse cursor focus issue observed
for "Set pages" in chrome://settings.
Re: Issue 445318 in chromium: Question on using add_detected_host_labels.py
to add a new label
Re: Issue 442952 in chromium: UNKNOWN in blink::DOMPluginArray::refresh
Re: Issue 436706 in chromium: 13.3% regression in blink_perf.layout at
305546:305577
Re: Issue 417463 in chromium: Replace OVERRIDE and FINAL with their C++11
counterparts
Re: Issue 443773 in chromium: Upstream more Document-mode and
ChromeTab-related things
Issue 446298 in chromium: Mac: Extension popup fails to dismiss
Re: Issue 440101 in chromium: user_story_runner.Run should not access the
given PageTest methods directly
Re: Issue 446177 in chromium: New NSS seems to introduce races between key
generation and key lookup
Re: Issue 442460 in chromium: Add Demos to NaCl SDK Documentation
Re: Issue 444542 in chromium: Regression: "Create application shortcut"
dialog box doesn't get dismiss on pressing "Esc" key in Mac OS.
Re: Issue 414297 in chromium: Chrome slows/hangs when attempting to edit
fields with autocomplete suggestions on crbug.com
Re: Issue 445029 in chromium: App shortcut is not revealed in Finder after
it's creation on Mac OS.
Re: Issue 436541 in chromium: Update release.conf.d files to reduce
unnecessary HWIDs that cause bloat in recovery.conf
Re: Issue 441054 in chromium: echoCancellation: false constraint does
nothing in Chrome in Nexus 6
Re: Issue 446243 in chromium: Crash on update on two Freon chromeboxes
Re: Issue 419087 in chromium: Associate RenderWidget with RenderFrame
instead of RenderView
Re: Issue 442514 in chromium: replace COMPILE_ASSERT with static_assert
Re: Issue 417463 in chromium: Replace OVERRIDE and FINAL with their C++11
counterparts
Re: Issue 440706 in chromium: 10% regression in blink_perf.parser at
307553:307568
Re: Issue 352710 in chromium: NewAvatarMenuButtonTest.SignOut flaky
Re: Issue 446298 in chromium: Mac: Extension popup fails to dismiss
--
--
Automated mail from issue updates at http://crbug.com/
Subscription options: http://groups.google.com/a/chromium.org/group/chromium-bugs

To unsubscribe from this group and stop receiving emails from it, send an email to chromium-bugs+***@chromium.org.
c***@googlecode.com
2015-01-06 00:45:39 UTC
Permalink
Your project notifications generated too many emails to send
individually. Here are the subject lines of the emails you would have
received:

Re: Issue 430802 in chromium: When language is set to Arabic, Google+
Photos app doesn't show anything
Re: Issue 308404 in chromium: Remove CRLF from Chromium Repo
Re: Issue 439818 in chromium: frequent dropping of wifi
Re: Issue 445904 in chromium: Javascript setTimeout not working
Re: Issue 401605 in chromium: crostools/chrome_version.py shows an
incorrect version of chrome
Re: Issue 440466 in chromium: Slimming Paint: Don't invalidate animated
gifs that are offscreen
Re: Issue 446050 in chromium: Implement Descendant Combinator ">>"
Re: Issue 444721 in chromium: Teach deploy_production script to update
golo_proxy server
Re: Issue 444085 in chromium: Extension is disabled by content verification
for all users (with CV enabled)
Re: Issue 430802 in chromium: When language is set to Arabic, Google+
Photos app doesn't show anything
Re: Issue 404168 in chromium: Don't reject CLs when the slave build timed
out
Re: Issue 445846 in chromium: Regression : Unnecessary wide blank space
seen in tool tip of "Enter fullscreen" in www.facebook.com .
Re: Issue 443867 in chromium: extension-content-verification flag seems to
be stuck in "enforce"
Re: Issue 446327 in chromium: Host exiting with undocumented exit code 6 on
Mac
Re: Issue 446322 in chromium: autofill is confused by forms with
spouse/partner name fields
Re: Issue 396723 in chromium: only one person at a time can run
cidb_integration_test.py
Re: Issue 446092 in chromium: Chrome OS: fails to open a PDF file via Files
app
Re: Issue 440466 in chromium: Slimming Paint: Don't invalidate animated
gifs that are offscreen
Re: Issue 396723 in chromium: only one person at a time can run
cidb_integration_test.py
Re: Issue 418776 in chromium: Infra failure should fail the canary build,
but should not throttle/close the tree
Re: Issue 446151 in chromium: Embedded flash videos show are completely
dark on freon devices
Re: Issue 318961 in chromium: Reenable PPAPI test
Re: Issue 446051 in chromium: Rename "Selecting Through Shadows Selector"
from "/deep" to ">>>"
Issue 446331 in chromium: deploy_production should use DB to discover hosts
to update.
Re: Issue 445904 in chromium: Javascript setTimeout not working
Re: Issue 445533 in chromium: Chameleon: audio_AudioBasicHDMI: Recorded
file does not match playback file
Re: Issue 444721 in chromium: Teach deploy_production script to update
golo_proxy server
Re: Issue 446331 in chromium: deploy_production should use DB to discover
hosts to update.
Re: Issue 445338 in chromium: Some formula’s do not get updated
automatically when their cell references are changed.
Re: Issue 446331 in chromium: deploy_production should use DB to discover
hosts to update.
Re: Issue 442514 in chromium: replace COMPILE_ASSERT with static_assert
Re: Issue 420796 in chromium: remove windows line endings from existing
files in the repository
Re: Issue 308404 in chromium: Remove CRLF from Chromium Repo
Re: Issue 248742 in chromium: Overhang scroll background needs to be
updated for 10.9
Re: Issue 422549 in chromium: Rethink label dependent actions
Re: Issue 419963 in chromium: Chrome Remote Desktop client plugin crashes
under Windows 10 Preview
Re: Issue 443923 in chromium: Chameleon: DUT reboots when replugging an
external display during suspend
Re: Issue 423571 in chromium: Automate reallocation of DUTs as needed.
Re: Issue 437905 in chromium: [Regression] Page is not
invalidated/repainted correctly when switching views in a single page web
app
Re: Issue 385395 in chromium: Files with windows-line endings getting
committed
Re: Issue 420796 in chromium: remove windows line endings from existing
files in the repository
Re: Issue 444267 in chromium: deploy_production.py should hide command
output on success.
Issue 446332 in chromium: Missing metrics on some smoothness benchmarks on
performance dashboard.
Re: Issue 422627 in chromium: Automatic retries for good CLs
Re: Issue 443923 in chromium: Chameleon: DUT reboots when replugging an
external display during suspend
Re: Issue 374911 in chromium: chromeos-setdevpasswd creates dev mode
password file with 0644 perms by default
Re: Issue 443923 in chromium: Chameleon: DUT reboots when replugging an
external display during suspend
Re: Issue 444085 in chromium: Extension is disabled by content verification
for all users (with CV enabled)
Re: Issue 248742 in chromium: Overhang scroll background needs to be
updated for 10.9
Re: Issue 342307 in chromium: Facebook jumps back to the top of the page
Re: Issue 390683 in chromium: History is broken because it relies on page id
Re: Issue 420900 in chromium: Use loopback devices to find partition
offsets and manipulate partitions instead of other methods
Issue 446333 in chromium: Add an RPC to get a list of servers from server
DB based on given role and status
Re: Issue 446333 in chromium: Add an RPC to get a list of servers from
server DB based on given role and status
Re: Issue 446331 in chromium: deploy_production should use DB to discover
hosts to update.
Re: Issue 443923 in chromium: Chameleon: DUT reboots when replugging an
external display during suspend
Re: Issue 443923 in chromium: Chameleon: DUT reboots when replugging an
external display during suspend
Re: Issue 446036 in chromium: nonce- and hash- CSP directives for extensions
Re: Issue 408210 in chromium: GPU log errors
Re: Issue 433976 in chromium: "The achive is already mounted" (typo)
Issue 446335 in chromium: ViewEventTestBase double quit is problematic,
uses deprecated APIs
Re: Issue 442098 in chromium: NPAPI : Flash Player stops responding
Issue 446336 in chromium: mipsel-o32-generic full can't find chrome
prebuilts
Issue 446337 in chromium: Chrome attempts to access Chromium keychain
entries.
Re: Issue 168080 in chromium: App shortcuts on Mac
Re: Issue 445986 in chromium: Can't connect to Wi-Fi
Re: Issue 446336 in chromium: mipsel-o32-generic full can't find chrome
prebuilts
Re: Issue 278408 in chromium: Broken window cycling with Chrome Apps using
Cmd+Tab and Cmd+`
Issue 446338 in chromium: i'm angry, ruined everything, for 8months json
has mislead me, on my android galaxy s4
Re: Issue 444928 in chromium: alt-tab to chrome keeps app in the foreground
Re: Issue 178358 in chromium: A pop up message "Google Chrome wants to use
your confidential information stored in your keychain. Do you want to allow
access to this item?" appears persistently
Re: Issue 380026 in chromium: Scrolling and tab switching are laggy on 2013
Mac Pro
Re: Issue 441465 in chromium: Devices reboot in extended mode, after set in
mirror mode
Re: Issue 404784 in chromium: llvm: failed to compile with gcc 4.9.
Re: Issue 445039 in chromium: Regression: Apps shortcut icon appears blur
in Launchpad of Mac OS.
Re: Issue 446036 in chromium: nonce- and hash- CSP directives for extensions
Re: Issue 404313 in chromium: Reduce SLAVE_STATUS_TIMEOUT_SECONDS
Re: Issue 441872 in chromium: Double click to print single event details
Re: Issue 445670 in chromium: High-bandwidth downloads cause silent
ethernet connection failure
Re: Issue 419963 in chromium: Chrome Remote Desktop client plugin crashes
under Windows 10 Preview
Re: Issue 445162 in chromium: Regression: The images appear chopped after
zoom out in 'Full Screen Weather' app.
Re: Issue 443923 in chromium: Chameleon: DUT reboots when replugging an
external display during suspend
Re: Issue 446257 in chromium: Kiosk apps are not persisting data when run
on enterprise enrolled devices
Re: Issue 261450 in chromium: Selecting 'Show All Windows' on an app shim's
dock icon context menu show no windows
Issue 446339 in chromium: crash - cssSize2pt failed for unit "al"
Re: Issue 438450 in chromium: Chameleon: Failed to resume from sleep after
30 seconds
Re: Issue 380026 in chromium: Scrolling and tab switching are laggy on 2013
Mac Pro
Re: Issue 424433 in chromium: Mac: Performance is bad after GPU switch when
using remote CoreAnimation
Issue 446340 in chromium: Enable hosted apps to be upgraded to bookmark
apps.
Re: Issue 408210 in chromium: GPU log errors
Re: Issue 441459 in chromium: Chameleon: EndToEndTest failed to sleep after
15 seconds
Re: Issue 404313 in chromium: Reduce SLAVE_STATUS_TIMEOUT_SECONDS
Re: Issue 443923 in chromium: Chameleon: DUT reboots when replugging an
external display during suspend
Re: Issue 443923 in chromium: Chameleon: DUT reboots when replugging an
external display during suspend
Issue 446342 in chromium: Implement browser test for It2me Connection
Re: Issue 446339 in chromium: crash - cssSize2pt failed for unit "al"
Re: Issue 446336 in chromium: mipsel-o32-generic full can't find chrome
prebuilts
Re: Issue 442514 in chromium: replace COMPILE_ASSERT with static_assert
Re: Issue 380026 in chromium: Scrolling and tab switching are laggy on 2013
Mac Pro
Re: Issue 446036 in chromium: nonce- and hash- CSP directives for extensions
--
--
Automated mail from issue updates at http://crbug.com/
Subscription options: http://groups.google.com/a/chromium.org/group/chromium-bugs

To unsubscribe from this group and stop receiving emails from it, send an email to chromium-bugs+***@chromium.org.
c***@googlecode.com
2015-01-06 19:02:45 UTC
Permalink
Your project notifications generated too many emails to send
individually. Here are the subject lines of the emails you would have
received:

Re: Issue 428181 in chromium: Feedback extension is loaded in OOBE
Re: Issue 446515 in chromium: ui_base_unittests.isolate doesn't contain all
of the deps required for Android
Re: Issue 415855 in chromium: show when a failure started
Re: Issue 446077 in chromium: Add missing words in the English dictionary
Re: Issue 446177 in chromium: New NSS seems to introduce races between key
generation and key lookup
Issue 446537 in chromium: Files.app does not allow deleting dotfiles
Re: Issue 334392 in chromium: very large downloads fail with "Failed -
Network Error" message
Re: Issue 446014 in chromium: Add words Asperger, asperger, asperger's, and
Asperger's to spellcheck dictionary
Re: Issue 446014 in chromium: Add words Asperger, asperger, asperger's, and
Asperger's to spellcheck dictionary
Re: Issue 413916 in chromium: Hangouts take 400% CPU with WebRTC enabled.
Re: Issue 446301 in chromium:
measurements.oilpan_gc_times_unittest.OilpanGCTimesTest.* are failing
Issue 446538 in chromium: File download .dotfiles sanitization fails when
the file starts with a space
Re: Issue 446312 in chromium: Waking up device from keypress results in
black screen
Re: Issue 445906 in chromium: Please add Nepali spell checker dictionary
Re: Issue 318961 in chromium: Reenable PPAPI test
Re: Issue 446088 in chromium: Want linux chromium chromeos to depend on
newer kernel header files.
Issue 446540 in chromium: use-of-uninitiailzed-value error and crashes in
RasterizeWithGpuRasterizationCreatesResources on linux/cros msan bots
Re: Issue 408481 in chromium: System dialogs (e.g. 'Save As...') are not
modal on Ubuntu
Re: Issue 446537 in chromium: Files.app does not allow deleting dotfiles
Re: Issue 424010 in chromium: MSE multibitrate: lag at frame switch
Issue 446542 in chromium: WebKit Mac10.9 webkit_tests step is failing
occasionally
Re: Issue 446542 in chromium: WebKit Mac10.9 webkit_tests step is failing
occasionally
Re: Issue 393352 in chromium: DeviceLocalAccountExternalPolicyLoader is
never ready for consumer kiosk
Re: Issue 446540 in chromium: use-of-uninitiailzed-value error and crashes
in RasterizeWithGpuRasterizationCreatesResources on linux/cros msan bots
Re: Issue 442453 in chromium: Browser crashes @
ExtensionEnableFlow::CheckPermissionAndMaybePromptUser
Re: Issue 250253 in chromium: Media player needs .WMV and better MP4 video
playback support.
Re: Issue 446360 in chromium: Audio is low at 50% when play local video /
audio file
Re: Issue 426781 in chromium: Enrollment doesn't work out-of-the-box on VMs
Re: Issue 446386 in chromium: Remove code duplication between HeapPage and
LargeObject
Re: Issue 446542 in chromium: WebKit Mac10.9 webkit_tests step is failing
occasionally
Re: Issue 446522 in chromium: Chrome OS calculator behaves unexpectedly;
doesn't move focus
Re: Issue 445618 in chromium: Mojo Windows: test_structs.mojom C++ bindings
don't compile
Re: Issue 418776 in chromium: Infra failure should fail the canary build,
but should not throttle/close the tree
Re: Issue 441926 in chromium: 2d.path.rect.zero.2.html looks like a Skia
crash
Re: Issue 440113 in chromium: Update webaudio layout tests on Mac
Re: Issue 410949 in chromium:
http/tests/security/local-image-from-remote-whitelisted.html is failing
Re: Issue 442377 in chromium:
http/tests/security/local-image-from-remote-whitelisted.html is Flaky
Re: Issue 446360 in chromium: Audio is low at 50% when play local video /
audio file
Issue 446545 in chromium: Browser crashes when closing the incognito
windows with Chinese/Japanese IME
Re: Issue 440549 in chromium: Google Chrome Auto-Update Not working
consistently / Google Update GPO policy not honored.
Re: Issue 440445 in chromium: Different webaudio layout test results on Mac
Pro and Macbook Pro
Re: Issue 428670 in chromium: PPAPINaClPNaClTest.TCPSocketPrivate is being
flaky on Mac Asan bot
Re: Issue 428802 in chromium: Zoom constantly resetting to 100% even with
125% set as default
Re: Issue 446215 in chromium: Chrome hangs after resuming from sleep
Re: Issue 441926 in chromium: 2d.path.rect.zero.2.html looks like a Skia
crash
Re: Issue 438072 in chromium: HP Chromebox incompatible with Asus Monitor
vh192
Re: Issue 398112 in chromium: Webapps don't change the height of the
ContentViewRenderView when the keyboard pops up
Re: Issue 152584 in chromium: Client Certificates not trust
Re: Issue 152584 in chromium: Client Certificates not trust
Re: Issue 442795 in chromium: Media queries: fix our implementation,
resolve the ambiguity in spec
Re: Issue 443610 in chromium: bugdroid is getting excessively verbose again
Re: Issue 436783 in chromium: [Nexus5-Lollipop-LPX13D] Google Natvie
Browser(5.0-1519572) "related searches" not access
Re: Issue 441184 in chromium: AntiVirus detected Malware while syncing
using gclient
Re: Issue 413916 in chromium: Hangouts take 400% CPU with WebRTC enabled.
Re: Issue 402694 in chromium: setTimeout(,0) rounds to 1
Re: Issue 428199 in chromium: [bvt-prebuild] RPM issues for power_RPMTest
Re: Issue 431688 in chromium: Layout Test webaudio/oscillator-sine.html is
failing
Re: Issue 445037 in chromium: chrome://settings should allow two profiles
to have the same profile name.
Re: Issue 425851 in chromium: Chrome Does Not Recognize JRE 8.25 Is
Installed
Re: Issue 414103 in chromium: Swipe to back doesn't work second time
Issue 446547 in chromium: Dragging Favicon triggers predictive text
Issue 446548 in chromium: Remove TransparentActivateWindowButton from Ash
overview mode
Issue 446549 in chromium: Script printing parseable info about blessed CrOS
builds. For use in test lab automation.
Re: Issue 387175 in chromium: Chrome Omnibox Not Producing Search Results
Re: Issue 428199 in chromium: [bvt-prebuild] RPM issues for power_RPMTest
Re: Issue 282693 in chromium: Keyboard shortcuts are not easily discoverable
Re: Issue 445327 in chromium: Address fields misclassified on POST donation
page
Re: Issue 384152 in chromium: Check sessionType and persistentState in
MediaKeys::createSession()
Re: Issue 393668 in chromium: Swipe to close in overview
Re: Issue 444931 in chromium: Isolation between multiple cros_sdk instances
breaks fwgdb and flash_ec
Re: Issue 438072 in chromium: HP Chromebox incompatible with Asus Monitor
vh192
Re: Issue 444139 in chromium: Need canary builder for Jecht
Issue 446550 in chromium: Preload scanner should preload video posters
Re: Issue 434878 in chromium: Polymerize main toolbar
Re: Issue 422522 in chromium: Chrome: Crash Report - [Renderer hang]
content::RenderThreadImpl::GetAudioHardwareConfig
Re: Issue 441687 in chromium: Poor quality H.264 video Chromebook ->
Chromebook for both parties.
Re: Issue 446550 in chromium: Preload scanner should preload video posters
Re: Issue 434878 in chromium: Polymerize main toolbar
Re: Issue 425744 in chromium: Oscillator-sine test on windows has incorrect
expected result
Re: Issue 442230 in chromium: [Chrome book Specific] : Ctrl+Shift+L
keyboard shortcut for left alignment forcefully sign outs the user from
chrome book.
Re: Issue 446548 in chromium: Remove TransparentActivateWindowButton from
Ash overview mode
Re: Issue 437731 in chromium: Files.app OpenZipFiles/FileManagerBrowserTest
is broken.
Re: Issue 431470 in chromium: Unexpected behavior on quick automations
Re: Issue 366032 in chromium: Extract gear-menu related UI logic from
FileManager.
Re: Issue 443128 in chromium: Using Javascript to dynamically create and
remove videos results in videos that won't load
Re: Issue 446540 in chromium: use-of-uninitiailzed-value error and crashes
in RasterizeWithGpuRasterizationCreatesResources on linux/cros msan bots
Re: Issue 444474 in chromium: Gallery.app: Ribbon doesn't disappear in edit
mode.
Re: Issue 282693 in chromium: Keyboard shortcuts are not easily discoverable
Re: Issue 442795 in chromium: Media queries: fix our implementation,
resolve the ambiguity in spec
Re: Issue 398943 in chromium: Ship 'any-pointer' and 'any-hover' Media
Queries
Re: Issue 417463 in chromium: Replace OVERRIDE and FINAL with their C++11
counterparts
Re: Issue 442614 in chromium: Files.app: ImageLoderClient should not create
caches for data: URL.
Re: Issue 424010 in chromium: MSE multibitrate: lag at frame switch
Issue 446552 in chromium: Define order and formatting for seccomp config
file
Re: Issue 420625 in chromium: getUserMedia input stream is processed, which
degrades the sound quality
Re: Issue 420106 in chromium: Implement suspend()/resume() for WebAudio
Re: Issue 444479 in chromium: All localhost sites redirect to HTTPS after
accessing a single localhost site via HTTPS
Re: Issue 446441 in chromium: Build fails when use_openssl=1 and
use_system_openssl=0
Issue 446554 in chromium: Pre-CQ launcher should launch all precq configs
at once
Re: Issue 413942 in chromium: Nothing happens after clicking on screenshare
in hangouts
--
--
Automated mail from issue updates at http://crbug.com/
Subscription options: http://groups.google.com/a/chromium.org/group/chromium-bugs

To unsubscribe from this group and stop receiving emails from it, send an email to chromium-bugs+***@chromium.org.
c***@googlecode.com
2015-01-06 23:35:15 UTC
Permalink
Your project notifications generated too many emails to send
individually. Here are the subject lines of the emails you would have
received:

Re: Issue 434738 in chromium: x86-zgb-paladin extremely flaky hwtest
[bvt-inline]
Re: Issue 441108 in chromium: findNextMatchingCachedItem crashes when
appending nodes
Re: Issue 434410 in chromium: Chrome causes audio stuttering / slowing of
vlc playback
5 issues changed in chromium
Re: Issue 446608 in chromium: Backspace does not delete text in sheets in a
normal manner
Issue 446638 in chromium: Proguard parsing doesn't appropriately handle
newlines
Re: Issue 319115 in chromium: Chrome window displayed in pink
Re: Issue 392354 in chromium: Interstitials are weird and do weird things
Re: Issue 446599 in chromium: interstitials cannot import text_defaults.css
Issue 446639 in chromium: Mac H/W decoding crash/hang Chrome
Re: Issue 439642 in chromium: Browser leak when creating new tabs in M40
Re: Issue 396626 in chromium: Userlist at the 'Manage other users' menu is
hardly visible when active.
Re: Issue 445951 in chromium: cannot access to configuration page of
chromebook
Re: Issue 446604 in chromium: nyan_freon paladin always fails
Re: Issue 440460 in chromium: cros_trunk showing builds from blink and
chromium sources mixed
Re: Issue 446194 in chromium: Chameleon: Peach_pit failed to see the
display after switching lid from close to open on mirrored mode
Re: Issue 438863 in chromium: Glimmer: Chromebooks not charging
Re: Issue 444163 in chromium: Slimming Paint crashes
rasterize_and_record_micro.top_25_smooth
Re: Issue 446194 in chromium: Chameleon: Peach_pit failed to see the
display after switching lid from close to open on mirrored mode
Re: Issue 445670 in chromium: High-bandwidth downloads cause silent
ethernet connection failure
Issue 446642 in chromium: update fontconfig to a new stable release when
it's available
Re: Issue 446633 in chromium: Checkstyle in presubmit cannot be used from a
subfolder of src
Re: Issue 440460 in chromium: cros_trunk showing builds from blink and
chromium sources mixed
Re: Issue 436388 in chromium: Calibri(body) displayed as incorrect font
type in toolbar bar menu.
Issue 446643 in chromium: Eliminate ui/ios
Re: Issue 446618 in chromium: urara paladin always fails
Re: Issue 436810 in chromium: Blank print preview dialog after "using print
with system dialog".
Re: Issue 446516 in chromium: Print preview page doesn't load
Re: Issue 307312 in chromium: update harfbuzz once again after hackfest in
October 2013
Re: Issue 236435 in chromium: Streamline the upgrade process for harfbuzz-ng
Re: Issue 443543 in chromium: We block GPU Main thread waiting on PageFlip
events to be handled.
Issue 446645 in chromium: Much checkerboarding on retina Macs with
impl-thread event handling
Re: Issue 445947 in chromium: DVT2 Candy's need increased touchpad
sensitivity
Issue 446646 in chromium: Need to review desired behavior for empty
oauth_refresh_token
Re: Issue 444696 in chromium: Retry download should use original referrer,
etc
Re: Issue 434108 in chromium: Freon: Link: External monitor doesn't come up
if connected during suspend state.
Re: Issue 391552 in chromium: NETWORK_FAILED when downloading AdBlock
Re: Issue 391588 in chromium: I cannot install apps or extensions
Re: Issue 230921 in chromium: Accents (á, ê, õ, etc.) don't work with
physical keyboard
Issue 446648 in chromium: Pass a null SkCanvas to GraphicsContext when
slimming paint is enabled
Re: Issue 412508 in chromium: Convert daisy to freon
Re: Issue 445670 in chromium: High-bandwidth downloads cause silent
ethernet connection failure
Re: Issue 442514 in chromium: replace COMPILE_ASSERT with static_assert
Re: Issue 446010 in chromium: Chrome remote desktop plugin blocked
Re: Issue 315111 in chromium: Bad performance in SimpleSpinner software
canvas example
Re: Issue 446165 in chromium: flaky DeadObjectException in
contentshell_instrumentation_tests
Re: Issue 445120 in chromium: Chrome Remote Desktop is not listed in Chrome
Web Store if user selects the "Available for Android" filter
Issue 446650 in chromium: Buildbot RepoPoller does not set the project value
Re: Issue 446288 in chromium: Chromoting: cleanup desktop shape handling
Issue 446651 in chromium: ERR_CONTENT_DECODING_FAILED
Re: Issue 446371 in chromium: screen does not fade when internet connection
is lost
Issue 446653 in chromium: switch to minigbm
Re: Issue 443978 in chromium: regression: click to play not disabled for
full page
Re: Issue 435540 in chromium: Regression: Page scrolling is not smooth
on 'http://www.ugamsolutions.com'.
Re: Issue 446645 in chromium: Much checkerboarding on retina Macs with
impl-thread event handling
Re: Issue 161127 in chromium: JavaScript source is occasionally corrupt
Re: Issue 446118 in chromium: Data discrepancies in
http://omahaproxy.appspot.com/
Re: Issue 445024 in chromium: [Butterfly]Chrome-Book is not restarting
automatically after removing USB..
Re: Issue 446631 in chromium: Mac H/W decoding failed because of <meta> tag
parsing issue
Re: Issue 446646 in chromium: Need to review desired behavior for empty
oauth_refresh_token
Re: Issue 413767 in chromium: make GA calls unique per tab
Re: Issue 436388 in chromium: Calibri(body) displayed as incorrect font
type in toolbar bar menu.
Re: Issue 446650 in chromium: Buildbot RepoPoller does not set the project
value
Re: Issue 443500 in chromium: Android chrome desktop says host if offline
Re: Issue 446555 in chromium: Speculative PreCQ picks up the same patch
repeatedly
Re: Issue 434410 in chromium: Chrome causes audio stuttering / slowing of
vlc playback
Re: Issue 169262 in chromium: UX improvements for multiple monitors
Re: Issue 390638 in chromium: Chrome tabs cannot display across two local
monitors and Chrome Remote Desktop only displays on one local monitor
Re: Issue 446088 in chromium: Want linux chromium chromeos to depend on
newer kernel header files.
Re: Issue 446555 in chromium: Speculative PreCQ picks up the same patch
repeatedly
Re: Issue 407684 in chromium: Review mojom files for nullability:
view/window manager
Re: Issue 294049 in chromium: Missing Kurdish keyboard layout : need to add
ckb to the A-L list
Re: Issue 413767 in chromium: make GA calls unique per tab
Issue 446658 in chromium: Video completely dark when play video in Xfinity
Comcast
Re: Issue 379046 in chromium: Link or URL bar (lower left corner) will not
go away on full screen videos
Re: Issue 446357 in chromium: Key remapping for Chrome remote desktop is
not right
Re: Issue 437905 in chromium: [Regression] Page is not
invalidated/repainted correctly when switching views in a single page web
app
Re: Issue 446555 in chromium: Speculative PreCQ picks up the same patch
repeatedly
Issue 446660 in chromium: GCM can delay an upstream message for significant
time on seemingly good connection w/o retry.
Re: Issue 446660 in chromium: GCM can delay an upstream message for
significant time on seemingly good connection w/o retry.
Issue 446661 in chromium: fast/dom/Geolocation/success-clear-watch.html
times out occasionally on ASAN testers
Re: Issue 253754 in chromium: Rotate Chromoting X session log files when
they get too big
Re: Issue 445011 in chromium: CRD fills /tmp folder to 100% capacity
locking up machine
Re: Issue 446661 in chromium: fast/dom/Geolocation/success-clear-watch.html
times out occasionally on ASAN testers
Re: Issue 443654 in chromium: TouchView: rotation lock status area item is
in the wrong position
Re: Issue 446327 in chromium: Host exiting with undocumented exit code 6 on
Mac
Re: Issue 445406 in chromium: angle tests don't build with clang/win
Re: Issue 446374 in chromium: Apparently need better __if_exists stuff
Re: Issue 445408 in chromium: PDF Annotations are stacked in backwards order
Re: Issue 358139 in chromium: Chrome Remote Desktop display problems with
multiple monitors
Re: Issue 434138 in chromium: Freon: launch agetty on consoles
(logging_CrashServices.agetty - TestFail: Failed to kill process
/sbin/agetty)
Re: Issue 446661 in chromium: fast/dom/Geolocation/success-clear-watch.html
times out occasionally on ASAN testers
Re: Issue 445408 in chromium: PDF Annotations are stacked in backwards order
Issue 446665 in chromium: MobLab: gs_offloader doesn't respect defacl.
Re: Issue 446625 in chromium: gclient downloads a borked version of git on
windows.
Re: Issue 446639 in chromium: Mac H/W decoding crash/hang Chrome
Re: Issue 446665 in chromium: MobLab: gs_offloader doesn't respect defacl.
Issue 446668 in chromium: Setup Builders and PFQ for M41 Branch
Re: Issue 387734 in chromium: Clean up unused/unneeded histograms in
Chromium client code.
Issue 446669 in chromium: Mac: Accessibility sub-tree very slow to appear
in some cases
--
--
Automated mail from issue updates at http://crbug.com/
Subscription options: http://groups.google.com/a/chromium.org/group/chromium-bugs

To unsubscribe from this group and stop receiving emails from it, send an email to chromium-bugs+***@chromium.org.
c***@googlecode.com
2015-01-07 02:05:31 UTC
Permalink
Your project notifications generated too many emails to send
individually. Here are the subject lines of the emails you would have
received:

Re: Issue 446703 in chromium: Add hciconfig to stumpy and panther AP images
Re: Issue 429080 in chromium: Wavy text with distance field fonts
Re: Issue 446537 in chromium: Files.app does not allow deleting dotfiles
Re: Issue 446702 in chromium: Flash Player Microphone names are empty
Re: Issue 446703 in chromium: Add hciconfig to stumpy and panther AP images
Re: Issue 446702 in chromium: Flash Player Microphone names are empty
Re: Issue 445189 in chromium: Certificate selection popup
Re: Issue 446042 in chromium: Timeline tab doesnot record memory
Issue 446704 in chromium: Mixed Hindi and Arabic numerals in an
inline-block element in Arial/13px on Windows/Chrome renders in a broken
line
Re: Issue 445412 in chromium: Identity scope approval dialog's layout is
broken
Re: Issue 439898 in chromium: Gallery window is automatically getting
closed on pressing on "undo" button.
Re: Issue 440500 in chromium: Get Chrome compiling on VS2015
Issue 446705 in chromium: BypassLocalRule should bypass all IP addresses in
127.0.0.0/8 subnet
Re: Issue 414973 in chromium: Buildbot blamelist is incorrect
Re: Issue 440460 in chromium: cros_trunk "All Changes" sometimes
wrong/incomplete
Re: Issue 446704 in chromium: Mixed Hindi and Arabic numerals in an
inline-block element in Arial/13px on Windows/Chrome renders in a broken
line
Re: Issue 396760 in chromium: Implement ChromeOS ScreenOrientationProvider
for locking, unlocking, and reading screen orientation
Re: Issue 338872 in chromium: mouseout event not triggered when mouse
pointer leaves window not via top edge (Windows only)
Issue 446706 in chromium: 20.1% regression in blink_perf.dom at
310091:310092
Re: Issue 446706 in chromium: 20.1% regression in blink_perf.dom at
310091:310092
Re: Issue 426601 in chromium: M39: power_Resume test started failing on ARM
devices (Pit, Pi, Snow, Spring and Skate)
Re: Issue 416684 in chromium: Prerender in Chrome for Android is not always
triggered.
Re: Issue 439642 in chromium: Browser leak when creating new tabs in M40
Re: Issue 438933 in chromium: Ganesh shows huge white rect when loading
Transaction page on mint.com
Re: Issue 422332 in chromium: clang-format net/
Re: Issue 438927 in chromium: Ganesh draws border + box shadow as dotted or
dashed border
Re: Issue 415626 in chromium: create DCP integration tests for OOXML-based
text boxes
Re: Issue 436549 in chromium: [Stout/Parrot-ivb/Wolf] External monitor lost
display after hotplug vga-vga or hdmi-hdmi or hdmi-dvi
Re: Issue 436549 in chromium: [Stout/Parrot-ivb/Wolf] External monitor lost
display after hotplug vga-vga or hdmi-hdmi or hdmi-dvi
Re: Issue 439642 in chromium: Browser leak when creating new tabs in M40
Re: Issue 429592 in chromium: EDIDs not supported by peppy
Re: Issue 440679 in chromium: Google Play Music In Chrome Crashing
Re: Issue 444988 in chromium: Chameleon: client failed to sleep after 20
seconds
Re: Issue 446427 in chromium: Fullscreen video playback cannot exit on
ChromeShell and ContentShell for Android
Re: Issue 439898 in chromium: Gallery window is automatically getting
closed on pressing on "undo" button.
Re: Issue 446703 in chromium: Add hciconfig to stumpy and panther AP images
Re: Issue 426618 in chromium: chrome://help crashes Chrome in Incognito
Re: Issue 439642 in chromium: Browser leak when creating new tabs in M40
Re: Issue 446020 in chromium: Chameleon: peach_pi failed to start the
xmlrpc server after reboot
Re: Issue 426530 in chromium: Enable GPU accelerated rasterization on
desktop platforms
Issue 446707 in chromium: Unrecoverable Information in textNode.js
_handleTextNodeMoved may lead to insertion deletion errors
Re: Issue 438937 in chromium: Ganesh clips text when hovering the chat
roster in Gmail
Re: Issue 446699 in chromium: GCM rejects large message with inconsistent
message.
Re: Issue 441899 in chromium: PDFium static initializers must go
Re: Issue 374751 in chromium: EME should handle extended codecs like
non-EME canPlayType() does
Re: Issue 446312 in chromium: Waking up device from keypress results in
black screen
Re: Issue 443601 in chromium: Resuming from sleep on Mac Pro leads to hung
Chrome
Re: Issue 439642 in chromium: Browser leak when creating new tabs in M40
Issue 446708 in chromium: Freon chromebox sometimes don't wake up on
suspend.
Re: Issue 440679 in chromium: Google Play Music In Chrome Crashing
Re: Issue 306144 in chromium:
DownloadExtensionTest.DownloadExtensionTest_OnDeterminingFilename_ReservedFilename
appears flaky
Re: Issue 446683 in chromium: settings links misaligned with radio text
Re: Issue 446683 in chromium: settings links misaligned with radio text
Re: Issue 439642 in chromium: Browser leak when creating new tabs in M40
Re: Issue 446708 in chromium: Freon chromebox sometimes don't wake up on
suspend.
Issue 446711 in chromium: String added to android_chrome_string.grd
currently blocking translations in trunk.
Re: Issue 381635 in chromium: [HighDPI] Button on the permission butter bar
are getting chopped off from bottom.
Re: Issue 446549 in chromium: Script printing parseable info about blessed
CrOS builds. For use in test lab automation.
Re: Issue 445610 in chromium: chrome://net-internals consistently crashes
for Chrome on Android
Re: Issue 438933 in chromium: Ganesh shows huge white rect when loading
Transaction page on mint.com
Re: Issue 443750 in chromium: Saying ok google while offline just flashes
the screen on and off
Re: Issue 443601 in chromium: Resuming from sleep on Mac Pro leads to hung
Chrome
Re: Issue 439642 in chromium: Browser leak when creating new tabs in M40
Re: Issue 430359 in chromium: Ganesh shows grey transparency covered tiles
in GMail
Re: Issue 445307 in chromium: Copied text from pdf is not copied fully.
Re: Issue 438927 in chromium: Ganesh draws border + box shadow as dotted or
dashed border
Re: Issue 374751 in chromium: EME should handle extended codecs like
non-EME canPlayType() does
Re: Issue 440305 in chromium: Enable memory.top_7_stress
Re: Issue 438927 in chromium: Ganesh draws border + box shadow as dotted or
dashed border
Re: Issue 445908 in chromium: uninitialized reads in SkUnPreMultiply and
preMultipliedBGRAtoRGBA
Re: Issue 443601 in chromium: Resuming from sleep on Mac Pro leads to hung
Chrome
Re: Issue 443567 in chromium: Regression: 'Ctrl+Shift+I' keyboard shortcut
does not work properly for gmail new message.
Re: Issue 136008 in chromium: Render PDFs incrementally
Re: Issue 383824 in chromium: Turning on or off "Use Bubbles for Permission
Requests" flag adds an entry to Media exceptions
Re: Issue 427578 in chromium: Each bot should have a doc associated with it
Re: Issue 441687 in chromium: Poor quality H.264 video Chromebook ->
Chromebook for both parties.
Re: Issue 446343 in chromium: chrome_proxy_benchmark.smoke.smoke test
passes even though DRP is disabled
Re: Issue 446343 in chromium: chrome_proxy_benchmark.smoke.smoke test
passes even though DRP is disabled
Re: Issue 436549 in chromium: [Stout/Parrot-ivb/Wolf] External monitor lost
display after hotplug vga-vga or hdmi-hdmi or hdmi-dvi
Re: Issue 438934 in chromium: Ganesh corrupts accounts dialog while
animating on mint.com
Re: Issue 425201 in chromium: Disable AutoRepeat as long as keys are
pressed on ChromeOS
Re: Issue 438936 in chromium: Ganesh corrupts drop down menus on
facebook.com
Re: Issue 443601 in chromium: Resuming from sleep on Mac Pro leads to hung
Chrome
Re: Issue 446114 in chromium: Chrome OS bots failng to run nonexistent
session_restore.cold.typical_25
Re: Issue 440500 in chromium: Get Chrome compiling on VS2015
Re: Issue 440503 in chromium: Need to add mouse/touchpad detection logic in
ui::DeviceDataManager
Re: Issue 438937 in chromium: Ganesh clips text when hovering the chat
roster in Gmail
Re: Issue 439642 in chromium: Browser leak when creating new tabs in M40
Re: Issue 441687 in chromium: Poor quality H.264 video Chromebook ->
Chromebook for both parties.
Re: Issue 401761 in chromium: NaCl sandbox in mojo_shell
Re: Issue 434995 in chromium: CrOS: Enable Chrome SDK build for MIPS
Issue 446714 in chromium: History.InMemoryURLIndexingTime performance
regression
Re: Issue 438940 in chromium: Ganesh corrupts twitter Trends side bar
Re: Issue 446511 in chromium: options_ui.chrome_style documentation and
<select>
Re: Issue 438944 in chromium: Ganesh corrupts twitter user detail dialog
Re: Issue 436549 in chromium: [Stout/Parrot-ivb/Wolf] External monitor lost
display after hotplug vga-vga or hdmi-hdmi or hdmi-dvi
Re: issue 10435 in chromium: Layout test
editing/selection/designmode-no-caret.html failing
Re: Issue 440305 in chromium: Enable memory.top_7_stress
Issue 446715 in chromium: no random access for linearized PDF
2 issues changed in chromium
--
--
Automated mail from issue updates at http://crbug.com/
Subscription options: http://groups.google.com/a/chromium.org/group/chromium-bugs

To unsubscribe from this group and stop receiving emails from it, send an email to chromium-bugs+***@chromium.org.
c***@googlecode.com
2015-01-07 10:47:57 UTC
Permalink
Your project notifications generated too many emails to send
individually. Here are the subject lines of the emails you would have
received:

Re: Issue 445787 in chromium: Native port drops when run from wm, not when
run from terminal
Re: Issue 443363 in chromium: Proxy settings are disabled although policy
is unset/Allow user to configure(Falco)
Re: Issue 444188 in chromium: Re-create kiosk cryptohome to start fresh
when app failed to start
Re: Issue 436260 in chromium: ARC: L-rebase on -t=nx
Re: Issue 444775 in chromium: Regression: Partial email-id shown in save
password bubble for email-id selected from text autofill
Re: Issue 439963 in chromium: Citrix HTML 5 receiver is not working in
ChromeOS, Chrome version 41
Re: Issue 445740 in chromium: Graphics Feature show differents status in
the same hardware
Re: Issue 441060 in chromium: Date/time picker broken (it only shows date,
not time, and is extremely slow) in Lollipop Chrome
Re: Issue 241691 in chromium: PolicyTest.TranslateEnabled is flaky,
especially on Win 7
Re: Issue 437142 in chromium: Gallery.app Exif data is lost after image edit
Re: Issue 435518 in chromium: Regression: Notification bubble for added
extensions is misplaced and seen on Wrench.
Re: Issue 446449 in chromium: Wrong extension popup window position
Re: Issue 445189 in chromium: Certificate selection popup
Re: Issue 441054 in chromium: echoCancellation: false constraint does
nothing in Chrome in Nexus 6
Re: Issue 445656 in chromium: kiosk mode displays unhelpful "search tip"
overlay
Re: Issue 361603 in chromium: Hide chrome://settings and
chrome://extensions from the chrome.tabs API
Re: Issue 445256 in chromium: Disable session restore bubble using chrome
flag or command line option
Re: Issue 437142 in chromium: Gallery.app Exif data is lost after image edit
Re: Issue 445645 in chromium: Telemetry tests are failing on Chromeboxes
Re: Issue 444954 in chromium: Timing issues in web app mode misreporting
window.innerHeight during app start
Re: Issue 444097 in chromium: Compile Failure in 8011 Mac Beta, Precise 32
& 64 Beta and CrOS Beta
Re: Issue 440866 in chromium: factory: freon: remove dependency on xinput
Re: Issue 446416 in chromium: FFMPEG compilation fails with "wrong type
argument to unary minus"
Re: Issue 350354 in chromium: Remove --disable-cast flag
Re: Issue 445918 in chromium: Embedded options page hides after moving the
mouse in and outside the settings page while dragging
Re: Issue 436388 in chromium: Calibri(body) displayed as incorrect font
type in toolbar bar menu.
Re: Issue 436388 in chromium: Calibri(body) displayed as incorrect font
type in toolbar bar menu.
Re: Issue 441468 in chromium: Chameleon: HPNoisy caused wrong resolutions:
CrOS 1920x1080; Chameleon 640x480
Re: Issue 305351 in chromium: Pop-up blocker blocking new tabs created by
command+click
Re: Issue 315088 in chromium: Upstream video casting feature
Re: Issue 350354 in chromium: Remove --disable-cast flag
Re: Issue 445645 in chromium: Telemetry tests are failing on Chromeboxes
Re: Issue 435187 in chromium: Residue of scrollbar on resize and residue on
overscroll
Re: Issue 427926 in chromium: HTML legend tag should be exposed as
IA2_ROLE_LABEL role
Re: Issue 445668 in chromium: Chrome keeps crashing within minutes of
opening. Only program that I am having problems with. Started after update.
Re: Issue 446168 in chromium: Handled error message on changing font face/
font size after invoking inline editor.
Re: Issue 446694 in chromium: hover over css file name does not show css
file path
Re: Issue 439518 in chromium: Google Maps not interactive when viewed from
the contact’s address in Google Contacts
Re: Issue 435187 in chromium: Residue of scrollbar on resize and residue on
overscroll
Re: Issue 445918 in chromium: Embedded options page hides after moving the
mouse in and outside the settings page while dragging
Re: Issue 445604 in chromium: "waiting for <domain>" forever even after
page completely loaded. No pending requests in Network tab
Re: Issue 445918 in chromium: Embedded options page hides after moving the
mouse in and outside the settings page while dragging
Re: Issue 446777 in chromium: Different language for each chrome window
Re: Issue 445590 in chromium: Chrome keeps opening maximized
Re: Issue 446163 in chromium: "Chrome didn't shut down correctly" upon
attempt to open a tab from command line
Issue 446790 in chromium: Remove --disable-xss-auditor flag
Re: Issue 446555 in chromium: Speculative PreCQ picks up the same patch
repeatedly
Re: Issue 294049 in chromium: Missing Kurdish keyboard layout : need to add
ckb to the A-L list
Re: Issue 446790 in chromium: Remove --disable-xss-auditor flag
Re: Issue 446790 in chromium: Remove --disable-xss-auditor flag
Re: Issue 446523 in chromium: [LBS] Questions about Google Update for MSI
add-on
Re: Issue 445817 in chromium: Can't drag and drop elements in optionsV2 page
Re: Issue 446410 in chromium: JSONP response preview in the Network tab
Re: Issue 375505 in chromium: Proof for Reddit
Re: Issue 440308 in chromium: All the key in Dance-Pad is Not working
Re: Issue 428891 in chromium: Camera teardown is slow and unpredictable
Re: Issue 434773 in chromium: Do not refuse to load extensions that have an
invalid CSP
Re: Issue 440158 in chromium: Bisect bot reports that it couldn't reproduce
a regression which it did reproduce
Re: Issue 428891 in chromium: Camera teardown is slow and unpredictable
Re: Issue 437257 in chromium: Add unit test for bug 424149
Re: Issue 442740 in chromium: UCAM-DLE300TWH camera fails when changing
settings, e.g. 50 to 60hz (antiflicker)
Re: Issue 441703 in chromium: GPU broker process prints "Error reading
message from the client: Bad file descriptor" in a tight loop from a clean
install
Re: Issue 445113 in chromium: Creating Chrome AppData Folder for New
Windows User is Slow
Re: Issue 445189 in chromium: Get a cert selection dialog every time we
visit a page that uses TLS client auth
Re: Issue 344118 in chromium: "fetch chromium" should handle "Connection
reset by peer" error from SVN at the end
Re: Issue 446607 in chromium: Remove user gesture restriction from
permission bubbles by default
Re: Issue 446590 in chromium: DevTools: Memory information is missing from
timeline since M40
Re: Issue 437809 in chromium: anchor with prevented default drag doesnt
bubble the event to parrent
Issue 446792 in chromium: Regression: English translation for state is
improper in www.megamartstores.com
Re: Issue 438538 in chromium: Scrolling page hangs Chrome , very awful
performance
Re: Issue 438538 in chromium: Scrolling page hangs Chrome , very awful
performance
Re: Issue 444742 in chromium: Origin Inconsistencies in Permissions across
Chrome
Re: Issue 446723 in chromium: Web API Permission Inconsistencies
Re: Issue 420625 in chromium: getUserMedia input stream is processed, which
degrades the sound quality
Issue 446793 in chromium: Dot after list numbers disappears when user right
aligns numbered text in document created in Gdrive
Issue 446794 in chromium: performance.getEntriesByName does not have all
the timing details for an Image.
Re: Issue 443951 in chromium: Correct Zoom level not update
Re: Issue 444743 in chromium: Granting a content setting in Chrome grants
to all ports
Re: Issue 305351 in chromium: Pop-up blocker blocking new tabs created by
command+click
Re: Issue 445645 in chromium: Telemetry tests are failing on Chromeboxes
Issue 446795 in chromium: Expose Chrome policies through Android's App
Restriction Schema
Issue 446796 in chromium: Flaky DevToolsClientBackendTest in
telemetry_unittests
Re: Issue 415156 in chromium: Skipping audio playback with "Ok Google"
hotwording enabled
Re: Issue 446796 in chromium: Flaky DevToolsClientBackendTest in
telemetry_unittests
Re: Issue 441686 in chromium: Problem with max-tile-widgt/height
Re: Issue 443951 in chromium: Correct Zoom level not update
Re: Issue 446421 in chromium: Chart is lost if merge cell has referenc data
Re: Issue 395569 in chromium: A ghost image is re drawn when the image is
moved in pptx files.
Re: Issue 395569 in chromium: A ghost image is re drawn when the image is
moved in pptx files.
Re: Issue 438514 in chromium: Failed font rendering
Re: Issue 444814 in chromium: Observing "restrict sign-in to the following
users:" check box is blinking while checking and un-checking..
Re: Issue 439642 in chromium: Browser leak when creating new tabs in M40
Re: Issue 444814 in chromium: Observing "restrict sign-in to the following
users:" check box is blinking while checking and un-checking..
Re: Issue 441621 in chromium: Capture Canvas Frame:Enable = Assertion
failed: Expected a wrapped call on a Resource Object.
Re: Issue 418510 in chromium: memcpy-param-overlap in BrotliDecompress
Re: Issue 432074 in chromium: [ASAN -Sheet-Weeklyrun] Few files from weekly
run are moved from Status_0(Success) to Status_1
Re: Issue 415156 in chromium: Skipping audio playback with "Ok Google"
hotwording enabled
Re: Issue 440723 in chromium: Observing black patch for sometime after
minimizing on-screen keyboard.
Issue 446800 in chromium: golang toolchain download flakily fails for
WebRTC bots on Windows
Re: Issue 437843 in chromium: drag and drop not showing correct image when
using float:right css property in inner div
--
--
Automated mail from issue updates at http://crbug.com/
Subscription options: http://groups.google.com/a/chromium.org/group/chromium-bugs

To unsubscribe from this group and stop receiving emails from it, send an email to chromium-bugs+***@chromium.org.
c***@googlecode.com
2015-01-07 23:57:52 UTC
Permalink
Your project notifications generated too many emails to send
individually. Here are the subject lines of the emails you would have
received:

Re: Issue 446263 in chromium: Unprefixed EME should prompt in
requestMediaKeySystemAccess() rather than when generating the license
request
Re: Issue 442207 in chromium: Regression: Hostname pattern and zoom
percentage value is not listed for chrome-sign-in page.
Re: Issue 441519 in chromium: Tabs take 1-2 seconds to show the first
paint, and eventually become all white.
Re: Issue 391005 in chromium: Poor scrolling response on various sites
Re: Issue 374490 in chromium: On Android: ui_base_unittests accesses
Chrome's pakfiles (layering violation)
Re: Issue 446912 in chromium: MAXILKSIZE-related link error using Visual
Studio 2013
Issue 447006 in chromium: Figure out what should happen when bootstrapping
with an existing chromeos user
Re: Issue 441821 in chromium: Enable webview-based sign-in to chrome
Issue 447007 in chromium: File has 0 page width, doesn't load content
Re: Issue 434138 in chromium: Freon: launch agetty on consoles
(logging_CrashServices.agetty - TestFail: Failed to kill process
/sbin/agetty)
Issue 447008 in chromium: GCM is stopped and restarted when the extension
is updated
Re: Issue 447009 in chromium: 324.2% regression in media.mse_cases at
309992:310004
Issue 447009 in chromium: 324.2% regression in media.mse_cases at
309992:310004
Re: Issue 224786 in chromium: Implement unprefixed EME APIs that match the
latest draft (object-oriented version)
Re: Issue 388244 in chromium: RunMicrotasks is called reentrantly from
Blink.
Re: Issue 445359 in chromium: DevTools: Add Security Tab
Re: Issue 420774 in chromium: Mark insecure resources in network panel (dev
tools)
Re: Issue 445359 in chromium: DevTools: Add Security Tab
Re: Issue 446990 in chromium: Unable to open Settings window vis Status
Area on HP Chromebox
Re: Issue 447009 in chromium: 324.2% regression in media.mse_cases at
309992:310004
Re: Issue 407923 in chromium: Allow caching of partial responses without
strong validators
Re: Issue 442318 in chromium: XHR: fail to return full data when doing a
regular XHR (for full content) after a Range request
Re: Issue 446989 in chromium: No volume after suspend and resume devices
Re: Issue 439642 in chromium: Browser leak when creating new tabs in M40
Re: Issue 437905 in chromium: [Regression] Page is not
invalidated/repainted correctly when switching views in a single page web
app
Re: Issue 435390 in chromium: Regression on link click
Re: Issue 445989 in chromium: I found a URL on the web that reibally
crashes chrome on Android
Re: Issue 377839 in chromium: mini_installer and tests don't run in
component mode
Re: Issue 438627 in chromium: Printing not working in Chrome 39
Issue 447014 in chromium: Move extension unpacking code from chrome/ to
extensions/
Re: Issue 439647 in chromium: Some Korean fonts in Chrome UI are not easily
recognized
Re: Issue 446978 in chromium: App launcher opens a blank page in RTL
languages
Issue 447016 in chromium: Remove sign-in and field trial related code after
GCM is launched to all users.
Issue 447015 in chromium: Parse the mp4 colr metadata for MSE video.
Re: Issue 395245 in chromium: scroll in forbes.com while loading is really
bad
Re: Issue 439896 in chromium: While Selecting the "Resize" option after
maximizing "User Manager Window" nothing happens
Re: Issue 444285 in chromium: Wrong translation for password save
Re: Issue 363497 in chromium: platform_CryptohomeMigrateKey is not running
Issue 447017 in chromium: Password autofill works poorly for citicards.com
Re: Issue 269157 in chromium: Failure to perform content check results in a
download marked as SAFE
Re: Issue 446715 in chromium: no random access for linearized PDF
Re: Issue 446292 in chromium: Drive errors need better handling
Re: Issue 446290 in chromium: 404 HTTP errors should not be "quickoffice
crash" errors
Re: Issue 441863 in chromium: OOPIF: Incorrect FrameLoadType after Remote
to Local swap
Re: Issue 446616 in chromium: Add touch feedback to Files.app breadcrumbs
Re: Issue 443777 in chromium: Slow UI paint for twitter URL causing jank
Re: Issue 353238 in chromium: Pages unresponsive keeps coming up for pages
Issue 447019 in chromium: audio is constantly choppy on lumpy
Re: Issue 441863 in chromium: OOPIF: Incorrect FrameLoadType after Remote
to Local swap
Re: Issue 395245 in chromium: scroll in forbes.com while loading is really
bad
Re: Issue 441863 in chromium: OOPIF: Incorrect FrameLoadType after Remote
to Local swap
Re: Issue 365662 in chromium: Please allow windows to span multiple
displays.
Issue 447020 in chromium: Add support for FIDO U2F / FIDO UAF to the
ChromeOS Secure Shell app
Issue 447023 in chromium: Spurious Plug in not supported using Citrix
Issue 447024 in chromium: Crashes when deleting entire
Re: Issue 447024 in chromium: Crashes when deleting entire
Re: Issue 428131 in chromium: Upstream Chrome to Mobile feature
Re: Issue 374490 in chromium: On Android: ui_base_unittests accesses
Chrome's pakfiles (layering violation)
Re: Issue 446956 in chromium: The update-your-sync-passphrase action
doesn't focus the input field
Re: Issue 437745 in chromium: Regression: I-beam cursor is missing in
passphrase text-box for "chrome://settings/syncSetup" overlay.
Re: Issue 384041 in chromium: Remove sign-in enforcement for using GCM
Re: Issue 446639 in chromium: Mac H/W decoding crash/hang Chrome
Re: Issue 447023 in chromium: Spurious Plug in not supported using Citrix
Re: Issue 329103 in chromium: When MutationObservers are GCed should not
have user visible consequences
Re: Issue 417909 in chromium: Allow Web Animations with Animation timing
functions to run on compositor.
Issue 447025 in chromium: Polymer element Paper-Icon-Button does not ripple
properly.
Re: Issue 421618 in chromium: for(x in someArray) is sometimes broken
Re: Issue 442738 in chromium: service_worker.service_worker_micro_benchmark
reporting success when it can't find user stories
Re: Issue 421950 in chromium: Task Manager often displays incorrect
information for Native Client processes, and cannot end them
Re: Issue 442738 in chromium: service_worker.service_worker_micro_benchmark
reporting success when it can't find user stories
Re: Issue 346399 in chromium: Enable unreachable code warning
Re: Issue 438188 in chromium: 22.4% regression in blink_perf.animation at
305546:305577
Re: Issue 429399 in chromium: Spinner spins eternally when no ongoing
network requests.
Re: Issue 446101 in chromium: Investigate views::Label slowness
Re: Issue 445080 in chromium: CSS rotate(90deg) doesn't show/render
Re: Issue 437884 in chromium: Need to vulcanize the new code review tool
Re: Issue 446978 in chromium: App launcher opens a blank page in RTL
languages
Re: Issue 446407 in chromium: Views: Resizing layer does not reposition
child layers in RTL mode
Re: Issue 413942 in chromium: Nothing happens after clicking on screenshare
in hangouts
Re: Issue 430109 in chromium: Initial scrolling in recode.net article is
janky on Android
Re: Issue 446635 in chromium: 15.1% regression in blink_perf.layout at
310080:310081
Re: Issue 446614 in chromium: 4.4% regression in sunspider at 309981:310020
Re: Issue 446978 in chromium: App launcher opens a blank page in RTL
languages
Re: Issue 575 in chromium: Smooth scrolling
Re: Issue 446836 in chromium: Regression: 'Devtools' section turns blank
after maximizing the browser window from restore mode.
Re: Issue 417782 in chromium: make root RenderLayer handle frame scrolls
Re: Issue 438168 in chromium: Print Using System Dialogue option not
available when "save as PDF" chosen...
Re: Issue 442738 in chromium: service_worker.service_worker_micro_benchmark
reporting success when it can't find user stories
Re: Issue 438168 in chromium: Print Using System Dialogue option not
available when "save as PDF" chosen...
Re: Issue 436634 in chromium: Task ProcTask::OnLookupComplete is janky on
Windows
Issue 447028 in chromium: WiFi tests should ensure client never disconnects
during test
Re: Issue 398671 in chromium: Move core extensions install and update code
to //extensions
Re: Issue 447014 in chromium: Move extension unpacking code from chrome/ to
extensions/
Re: Issue 445760 in chromium: Public-Key-Pins max-age leads to inaccessible
website when system clock goes wrong
Re: Issue 416994 in chromium: `repo init --depth 1` does not handle sha1
pinned repos
Re: Issue 419414 in chromium: Add streaming I/O to platform2
Re: Issue 446953 in chromium: Placeholder text does not disappear when you
type in the NTP search box
Re: Issue 430109 in chromium: Initial scrolling in recode.net article is
janky on Android
Re: Issue 444511 in chromium: HPKP enforces includeSubDomains even when the
directive is not asserted
Re: Issue 446989 in chromium: No volume after suspend and resume devices
--
--
Automated mail from issue updates at http://crbug.com/
Subscription options: http://groups.google.com/a/chromium.org/group/chromium-bugs

To unsubscribe from this group and stop receiving emails from it, send an email to chromium-bugs+***@chromium.org.
c***@googlecode.com
2015-01-08 17:46:31 UTC
Permalink
Your project notifications generated too many emails to send
individually. Here are the subject lines of the emails you would have
received:

Re: Issue 445926 in chromium: Expose magnetometer events
Re: Issue 447227 in chromium: Auto-update rollback causes loss of stateful
partition.
Re: Issue 447071 in chromium: Can't cast websites that can be casted on a PC
Re: Issue 444572 in chromium: Blink Scheduler fails some unit tests on
Android
Re: Issue 446671 in chromium: requestAnimationFrame not fulfilled when
animated gif on top of large canvas
Re: Issue 446729 in chromium: Printing or Save as PDF generates a blank
page for website that generate print jobs
Re: Issue 446384 in chromium: Chrome for iOS freezes and crashes when
visiting coles.com.au
Re: Issue 444141 in chromium: Blurry Fonts / Blured Fonts / Fonts looking
weird since Chrome Update 37
Issue 447231 in chromium: Cannot detach tab on Destop Linux
Re: Issue 289715 in chromium: Chrome_Mac: Crash Report - Magic Signature:
net::URLRequestHttpJob::SaveCookiesAndNotif...
Re: Issue 442518 in chromium: Need wrapper around cgpt to transparently
handle off-device placement of the GPT
Issue 447232 in chromium: ExtensionInstallForcelist prevents install the
extension from webstore
Issue 447233 in chromium: Add Android systrace tracing agent to
tracing_controller (uber-tracing)
Re: Issue 446694 in chromium: hover over css file name does not show css
file path
Re: Issue 446378 in chromium: pagination off after delete and undo
Re: Issue 446937 in chromium: Move CrosSettings (cros_settings.cc) to
src/chromeos/settings
Re: Issue 442843 in chromium: Hiding of "bookmark this page" menu
item/shortcut is over-eager
Issue 447235 in chromium: Need a way to do native scrolling gesture in
Android
Re: Issue 440305 in chromium: Enable memory.top_7_stress
Re: Issue 439064 in chromium: Password bubble not shown on a particular
website
Re: Issue 441597 in chromium: "Bookmark this page" menu item triggers
extension action when user binds action to ctrl-D
Re: Issue 443815 in chromium: How to crash a peppy
Re: Issue 447227 in chromium: Auto-update rollback causes loss of stateful
partition.
Re: Issue 447230 in chromium: SVGImage::nativeImageForCurrentFrame() should
not copy its bitmap
Re: Issue 446729 in chromium: Printing or Save as PDF generates a blank
page for website that generate print jobs
Re: Issue 278148 in chromium: Chrome must be updated to match Skia's
SkDevice refactoring
Re: Issue 446358 in chromium: Restore Ctrl-D keybinding to the new Bookmark
Manager extension when removed from another extension
Re: Issue 447235 in chromium: Need a way to do native scrolling gesture in
Android
Re: Issue 289715 in chromium: Chrome_Mac: Crash Report - Magic Signature:
net::URLRequestHttpJob::SaveCookiesAndNotif...
Re: Issue 421434 in chromium: Add benchmark to show top-10 slowest tasks
Issue 447238 in chromium: Brillo SDK: implement CLI for program run
Re: Issue 447239 in chromium: 8.9% regression in
rasterize_and_record_micro.key_silk_cases at 310138:310160
Issue 447239 in chromium: 8.9% regression in
rasterize_and_record_micro.key_silk_cases at 310138:310160
Re: Issue 289715 in chromium: Chrome_Mac: Crash Report - Magic Signature:
net::URLRequestHttpJob::SaveCookiesAndNotif...
Re: Issue 447227 in chromium: Auto-update rollback causes loss of stateful
partition.
Re: Issue 447241 in chromium: 2.6% regression in
page_cycler.tough_layout_cases at 310390:310414
Re: Issue 447238 in chromium: Brillo SDK: implement CLI for program run
Issue 447241 in chromium: 2.6% regression in page_cycler.tough_layout_cases
at 310390:310414
Issue 447240 in chromium: Resizing a large WebGL canvas on Android crashes
Chrome
Issue 447242 in chromium: Type mismatches for optional arguments are
defaulting to undefined.
Re: Issue 410152 in chromium: WebRTC VP8 Hardware Acceleration on IA
ChromeOS
Re: Issue 445848 in chromium: Regression: Image on WebGL experiments
flickers on clicking 'copy image' context menu.
Re: Issue 447097 in chromium: Regression: After Signing in to chrome
unable to zoom in/out on Change photo overlay using 'Ctrl+wheel'.
Re: Issue 446588 in chromium: 3.3%-9% regression in page_cycler
vm_private_dirty_final_browser at 309971:310020
Re: Issue 440305 in chromium: Enable memory.top_7_stress
Issue 447243 in chromium: Brillo SDK: implement USB device targeting
Re: Issue 447044 in chromium: Save buildbot logs of public chromium
waterfalls to Google Storage
Re: Issue 447191 in chromium: Security indicators should be accessible.
Re: Issue 446582 in chromium: 1.7%-1.8% regression in
page_cycler.intl_hi_ru/vm_private_dirty_final_browser at 310080:310080
Re: Issue 447191 in chromium: Security indicators should be accessible.
Re: Issue 432611 in chromium: When stored off device, cgpt should produce
an external image
Re: Issue 414043 in chromium: https://developer.chrome.com/extensions/tabs
has disappeared.
Issue 447244 in chromium: No way to view/edit pairing registry entries
Re: Issue 444188 in chromium: Re-create kiosk cryptohome to start fresh
when app failed to start
Re: Issue 446996 in chromium: Exception in android_forwarder in
webrtc.webrtc_cases on Nexus 7
Re: Issue 446775 in chromium: Bug - Full HD and 125% zoom
Re: Issue 447064 in chromium: App content gets clipped by the window when
Page zoom is set to >100%
Re: Issue 289715 in chromium: Chrome_Mac: Crash Report - Magic Signature:
net::URLRequestHttpJob::SaveCookiesAndNotif...
Issue 447246 in chromium: UAC and pin confirmation dialogs are not on
foreground when updating pin #
Re: Issue 435320 in chromium: MetricsServiceTests failing under Dr. Memory
Re: Issue 442327 in chromium: Allow native JNI exports to work without
breaking manual registration
Re: Issue 443684 in chromium: Windows that have been moved from another
signed-in user profile's workspace become transparent in the corners,
briefly, when switching tabs
Re: Issue 447191 in chromium: Security indicators should be accessible.
Re: Issue 437905 in chromium: [Regression] Page is not
invalidated/repainted correctly when switching views in a single page web
app
Re: Issue 436453 in chromium: Push API should add/remove GCMAppHandler as
number of push registrations changes
Re: Issue 447191 in chromium: Security indicators should be accessible.
Issue 447247 in chromium: Brillo SDK: implement CLI for log access
Re: Issue 440532 in chromium: [Resources] Modify tab discarding logic to
accelerate discarding of tabs with increasing memory pressure
Re: Issue 256914 in chromium: blind users can no longer completely disable
monitor on chrome os devices during use
Re: Issue 256914 in chromium: blind users can no longer completely disable
monitor on chrome os devices during use
Re: Issue 445673 in chromium: 1.8%-2.7% regression in
dromaeo.jslibtraversejquery at 302801:302852
Re: Issue 446216 in chromium: On Android, links inside headings should be
announced as headings by TalkBack
Re: Issue 446339 in chromium: crash - cssSize2pt failed for unit "al"
Re: Issue 447139 in chromium: Crash occurs when user merges two paragraphs
having font size 12pt set in master layout
Re: Issue 419551 in chromium: Update GetIfChanged to require the bucket
parameter.
Re: Issue 444906 in chromium: Black and white levels depend on canvas size
when drawImage is applied to video tag
Re: Issue 52489 in chromium: Hotel internet clobbers all my tabs
Re: Issue 442327 in chromium: Allow native JNI exports to work without
breaking manual registration
Re: Issue 446339 in chromium: crash - cssSize2pt failed for unit "al"
Re: Issue 447191 in chromium: Security indicators should be accessible.
Re: Issue 446583 in chromium: 13.1%-19.2% regression in blink_perf css and
parser runs/s at 310080:310080
Re: Issue 447140 in chromium: WebGL: drawArraysInstancedANGLE not working
properly when "first" > 0
Re: Issue 437226 in chromium: Password bubble should not allow deleting
PSL-matched credentials
Re: Issue 447140 in chromium: WebGL: drawArraysInstancedANGLE not working
properly when "first" > 0
Re: Issue 447124 in chromium: Regression : "Saved password" does not get
removed from password bubble.
Re: Issue 331440 in chromium: Touch handles move faster than window resize
animation
Re: Issue 437226 in chromium: Password bubble should not allow deleting
PSL-matched credentials
Re: Issue 446948 in chromium: Shockwave Flash is crashed when playing a
flash video
Re: Issue 52489 in chromium: Hotel internet clobbers all my tabs
Re: Issue 423982 in chromium: Losing pinned tabs to guest wifi splash page
Re: Issue 347568 in chromium: Add back double-tap UMA for click-delay
analysis
Issue 447249 in chromium: defaultMinWidth is 0 in
WebViewImpl::updatePageDefinedViewportConstraints for "mobile" web pages
Re: Issue 422808 in chromium: FR: don't use favicons from interstitial
pages for bookmarks
Re: Issue 445189 in chromium: Get a cert selection dialog every time we
visit a page that uses TLS client auth
Issue 447250 in chromium: Brillo SDK: implement CLI for WiFi configuration
Re: Issue 434115 in chromium: [Peppy-Freon/Link-Freon] Switch display mode
of external monitor caused image lost/corruption & crashes
Re: Issue 345101 in chromium: Create a TPM services library
Re: Issue 447249 in chromium: defaultMinWidth is 0 in
WebViewImpl::updatePageDefinedViewportConstraints for "mobile" web pages
Re: Issue 443684 in chromium: Windows that have been moved from another
signed-in user profile's workspace become transparent in the corners,
briefly, when switching tabs
Re: Issue 442518 in chromium: Need wrapper around cgpt to transparently
handle off-device placement of the GPT
--
--
Automated mail from issue updates at http://crbug.com/
Subscription options: http://groups.google.com/a/chromium.org/group/chromium-bugs

To unsubscribe from this group and stop receiving emails from it, send an email to chromium-bugs+***@chromium.org.
c***@googlecode.com
2015-01-09 02:05:30 UTC
Permalink
Your project notifications generated too many emails to send
individually. Here are the subject lines of the emails you would have
received:

Re: Issue 447086 in chromium: MacViews: Support for creating a
views::Widget whose parent window is not a views::Widget
Re: Issue 424225 in chromium: Chrome for Android fails Acid2
Re: Issue 436379 in chromium: tabs switched away from wrongly
trigger "pages unresponsive" dialog
Re: Issue 444889 in chromium: Chrome_ChromeOS: Assert in
ui::::GbmBufferGenerator::GbmBufferGenerator()
Re: Issue 447425 in chromium: Layout Test fast/dynamic/011.html is flaky
Issue 447430 in chromium: Chromoting client crashes when trying to connect
to host
Re: Issue 447240 in chromium: Resizing a large WebGL canvas on Android
crashes Chrome
Re: Issue 447089 in chromium: ARC: confusing warning message 'Play Services
is likely not enabled.'
Issue 447431 in chromium: WebRTC does not respect packet boundaries with
DTLS.
Re: Issue 446331 in chromium: deploy_production should use DB to discover
hosts to update.
Re: Issue 446323 in chromium: Plugin Power Saver: Defer loading of plugins
in background tabs
Re: Issue 447403 in chromium: Incomplete video packet received
Re: Issue 447358 in chromium: deploy_production.py should have --instance
argument.
Re: Issue 446743 in chromium: Set a Group Policy to Enable "Keep local data
only until I quit my browser"
Re: Issue 446908 in chromium: WebRTC roll broke two tests on multiple bots
Re: Issue 442752 in chromium: Reenable service_worker_micro_benchmark
reference build
Issue 447432 in chromium: Improve python test coverage in the performance
dashboard
Re: Issue 447422 in chromium: Data race on an SkTypeface under
RasterTaskImpl::RunOnWorkerThread
Re: Issue 419691 in chromium: ERR_CERT_COMMON_NAME_INVALID
Re: Issue 424225 in chromium: Chrome for Android fails Acid2
Re: Issue 434108 in chromium: Freon: Link: External monitor doesn't come up
if connected during suspend state.
Re: Issue 446983 in chromium: CRASH:
content::PeerConnectionDependencyFactory::InitializeSignalingThread()
Re: Issue 172134 in chromium: 'Calculator' not translated
Re: Issue 445673 in chromium: 1.8%-2.7% regression in
dromaeo.jslibtraversejquery at 302801:302852
Re: Issue 441624 in chromium: create dashboard for tracking sdk & binpkg
tarball sizes
Re: Issue 447052 in chromium: Speculative Pre-CQ picks up merged changes
Re: Issue 447313 in chromium: CQ: some failures not reported to gerrit
Re: Issue 446555 in chromium: Speculative PreCQ picks up the same patch
repeatedly
Re: Issue 432621 in chromium: Enhancements to the MBIM compliance suite
Re: Issue 447353 in chromium: first sync on trybot fails in FindCacheDir
with OSError
Re: Issue 431777 in chromium: Touch FW test suite should work on Android &
ChromeOS
Re: Issue 446545 in chromium: Browser crashes when closing the incognito
windows with Chinese/Japanese IME
Re: Issue 401761 in chromium: NaCl sandbox in mojo_shell
Re: Issue 440535 in chromium: Chromium crashes on the web store
Re: Issue 424225 in chromium: Chrome for Android fails Acid2
Re: Issue 434406 in chromium: ARC: L-Rebase: Support
AsynchronousCloseMonitor
Re: Issue 447430 in chromium: Chromoting client crashes when trying to
connect to host
Re: Issue 426406 in chromium: Add telemetry test for repeated taps on
polymer calculator
Re: Issue 447313 in chromium: CQ: some failures not reported to gerrit
Re: Issue 365977 in chromium: MacViews: Port the Views' app launcher to Mac
Re: Issue 447422 in chromium: Data race on an SkTypeface under
RasterTaskImpl::RunOnWorkerThread
Re: Issue 447052 in chromium: Speculative Pre-CQ picks up merged changes
Re: Issue 447098 in chromium: Crash is seen on dragging bookmarked page
from other bookmarks folder.
Issue 447433 in chromium: Crash in shapeFillColorButton.js
Re: Issue 258746 in chromium: App Launcher icons are lost after reinstall
Re: Issue 447098 in chromium: Crash is seen on dragging bookmarked page
from other bookmarks folder.
Re: Issue 445771 in chromium: Unexpected "referer"
in "Access-Control-Request-Headers" header in CORS preflight while using
XHR and fetch in worker.
Re: Issue 446908 in chromium: WebRTC roll broke two tests on multiple bots
Re: Issue 446908 in chromium: WebRTC roll broke two tests on multiple bots
Re: Issue 434918 in chromium: Make Findit auto-detect first-known build
failure of a test or step
Re: Issue 441743 in chromium: Layout Test plugins/js-from-destroy.html is
failing
Re: Issue 393251 in chromium: granular memory consumption not showing with
--enable-precise-memory-info flag.
Re: Issue 446692 in chromium: Increased memory usage with ASan builds after
upgrading to Trusty
Re: Issue 444427 in chromium: "Ok Google" hotword training refuses to
progress past first hotword
Re: Issue 442535 in chromium: 22.4%-23.2% regression in blink_perf.parser
at 301710:301767
Re: Issue 447401 in chromium: 8 peach_pit are missing common test labels
Re: Issue 447347 in chromium: Spec compliance: CryptoKey interface should
be exposed
Re: Issue 433572 in chromium: gnumbd should send alerts both on exceptions
and failures
Re: Issue 439110 in chromium: Bookmarks are saved in wrong folder
Re: Issue 447430 in chromium: Chromoting client crashes when trying to
connect to host
Re: Issue 447422 in chromium: Data race on an SkTypeface under
RasterTaskImpl::RunOnWorkerThread
Issue 447435 in chromium: View frame info shows "Your connection to ... is
not encrypted.", but then "The connection is encrypted and authenticated
using..."
Re: Issue 443393 in chromium: Generate_logs causes mosys crash with a very
large sized dump files.
Re: Issue 443393 in chromium: Generate_logs causes mosys crash with a very
large sized dump files.
Issue 447436 in chromium: Crash - another end user causing pronto sheet
nacl crash
Re: Issue 447398 in chromium: Crash - pluginLoader calls clearLoadTimeout
but the function is clearLoadTimeout_
Re: Issue 446692 in chromium: Increased memory usage with ASan builds after
upgrading to Trusty
Re: Issue 427793 in chromium: There should be a canonical way of factory
wipe/reset on Chrome OS
Re: Issue 447347 in chromium: Spec compliance: CryptoKey interface should
be exposed
Issue 447438 in chromium: UI breadkage occurs in when displaying
libwebviewchromium in lollipop
Re: Issue 441650 in chromium: Some D-Bus clients and services doing
expensive stuff on UI thread
Re: Issue 417463 in chromium: Replace OVERRIDE and FINAL with their C++11
counterparts
Re: Issue 447332 in chromium: Autofill erroneously triggers on Google Docs
comments.
Re: Issue 402215 in chromium: Chrome with a lot of tabs(70+) puts Mac
WindowServer at 40+% cpu, slowing entire OS UI
Re: Issue 444427 in chromium: "Ok Google" hotword training refuses to
progress past first hotword
Re: Issue 428886 in chromium: Improve handling when there is no mouse cursor
Re: Issue 446587 in chromium: 10.6%-11.2% regression in blink_perf.parser
at 310068:310074
Re: Issue 440500 in chromium: Get Chrome compiling on VS2015
Re: Issue 446692 in chromium: Increased memory usage with ASan builds after
upgrading to Trusty
Re: Issue 428886 in chromium: Improve handling when there is no mouse cursor
Re: Issue 447323 in chromium: Remove N+1 support from signers/pushimage
Re: Issue 444427 in chromium: "Ok Google" hotword training refuses to
progress past first hotword
Re: Issue 440500 in chromium: Get Chrome compiling on VS2015
Re: Issue 397069 in chromium: Colored Emoji not drawn if Bold Style is
specified
Re: Issue 336358 in chromium: something incorrect with letter-spacing
Re: Issue 447430 in chromium: Chromoting client crashes when trying to
connect to host
Re: Issue 447372 in chromium: Test hardware_storagequal_quick fails with
Unsatisfiable DEPENDENCIES
Re: Issue 444427 in chromium: "Ok Google" hotword training refuses to
progress past first hotword
Re: Issue 446692 in chromium: Increased memory usage with ASan builds after
upgrading to Trusty
Issue 447442 in chromium: DeviceOrientationEvent reading should have some
mode that does not rely on the magnetometer
Re: Issue 404544 in chromium: [webp] Decoder reports isSizeAvaliable before
all header fields have been read
Re: Issue 447442 in chromium: DeviceOrientationEvent should have a mode
that does not rely on the magnetometer (Cardboard)
Re: Issue 447372 in chromium: Test hardware_storagequal_quick fails with
Unsatisfiable DEPENDENCIES
Re: Issue 443213 in chromium: Add chrome.usb.setConfiguration.
Re: Issue 417463 in chromium: Replace OVERRIDE and FINAL with their C++11
counterparts
Re: Issue 447240 in chromium: Resizing a large WebGL canvas on Android
crashes Chrome
Re: Issue 411715 in chromium: Request for new events:
chrome.usb.onDeviceAdded and chrome.usb.onDeviceRemoved
Issue 447443 in chromium: stumpy-moblab canary fails due to no
attribute 'install_boto_file'
Re: Issue 444427 in chromium: "Ok Google" hotword training refuses to
progress past first hotword
Re: Issue 435540 in chromium: Regression: Page scrolling is not smooth
on 'http://www.ugamsolutions.com'.
--
--
Automated mail from issue updates at http://crbug.com/
Subscription options: http://groups.google.com/a/chromium.org/group/chromium-bugs

To unsubscribe from this group and stop receiving emails from it, send an email to chromium-bugs+***@chromium.org.
c***@googlecode.com
2015-01-09 18:52:24 UTC
Permalink
Your project notifications generated too many emails to send
individually. Here are the subject lines of the emails you would have
received:

Issue 447656 in chromium: 14.6% regression in blink_perf.parser at
310481:310504
Re: Issue 447656 in chromium: 14.6% regression in blink_perf.parser at
310481:310504
Issue 447657 in chromium: security shell app doesnt remember my "open as
window" settings
Re: Issue 447613 in chromium: WebRtc issue breaking Android downstream bots
Re: Issue 432922 in chromium: crash because dwmapi.dll is not available
windows xp
Re: Issue 442920 in chromium: ARC: no support for
--additional-android-permissions in ARC Welder
Re: Issue 431583 in chromium: Bookmark Manager: 'Add folder...' is broken
Re: Issue 443416 in chromium: ARC: Compositor breaks dimming of App when
focus timeout occurs
Re: Issue 447656 in chromium: 14.6% regression in blink_perf.parser at
310481:310504
Re: Issue 446626 in chromium: Install the new Hoofer[DVT] into Crux
Re: Issue 438863 in chromium: Glimmer: Chromebooks not charging
Re: Issue 442344 in chromium: Improve Chrome NTP load time
Re: Issue 438863 in chromium: Glimmer: Chromebooks not charging
Re: Issue 447399 in chromium: Mobbuild: power_manager unittest failures
Re: Issue 444876 in chromium: SyncChrome stage failed due to "Over Quota"
on the git server
Re: Issue 447372 in chromium: Test hardware_storagequal_quick fails with
Unsatisfiable DEPENDENCIES
Re: Issue 447658 in chromium: 14.6% regression in blink_perf.parser at
310481:310504
Issue 447658 in chromium: 14.6% regression in blink_perf.parser at
310481:310504
Re: Issue 447630 in chromium: "Canary master" build 526: stumpy_moblab and
link_freon failed in BuildReexecution
Re: Issue 436734 in chromium: External Bluetooth microphone is not working
Issue 447660 in chromium: Youtube page crashing on M41
Re: Issue 441977 in chromium: ARC: Lack of JavaScript Style Guide
Re: Issue 373923 in chromium: Google Chrome Helper Process Taking up >100%
CPU on Macs
Re: Issue 442868 in chromium: ARC: Regression is observing while testing
FPS/σ on ARC apps
Re: Issue 446695 in chromium: DownloadTest.DownloadTest_CrazyFilenames
flaky timeouts on Windows
Re: Issue 141178 in chromium: High CPU usage of Browser process in Chrome
Task manager
Re: Issue 401426 in chromium: Reduce memory usage for delivering Push
events in Service Workers
Re: Issue 443454 in chromium: ARC: Buildbot had inconsistent git checkout
Re: Issue 444435 in chromium: CrOSH fails to detect battery when using
battery_test
Re: Issue 429799 in chromium: Padding added to page when using
accessibility keyboard w/ ChromeVox
Re: Issue 447630 in chromium: "Canary master" build 526: stumpy_moblab and
link_freon failed in BuildReexecution
Re: Issue 397542 in chromium: VK artefacts on entering Guest session
Re: Issue 429799 in chromium: Padding added to page when using
accessibility keyboard w/ ChromeVox
Re: Issue 447653 in chromium: Unable to open youtube page on guest user
Re: Issue 447399 in chromium: Mobbuild: power_manager unittest failures
Re: Issue 436379 in chromium: tabs switched away from wrongly
trigger "pages unresponsive" dialog
Re: Issue 447630 in chromium: "Canary master" build 526: stumpy_moblab and
link_freon failed in BuildReexecution
Re: Issue 404865 in chromium: Excessive CPU usage from
RenderMessageFilter::OnGetCookies
Re: Issue 401795 in chromium: Switch from android MediaPlayer to MediaCodec
for <video> implementation
Re: Issue 445848 in chromium: Regression: Image on WebGL experiments
flickers on clicking 'copy image' context menu.
Re: Issue 421964 in chromium: Warn user of excessive resource use by
extensions
Re: Issue 443962 in chromium: video.duration doesn't equal Infinity when
video.src is assigned to MediaStream
Re: Issue 436388 in chromium: Calibri(body) displayed as incorrect font
type in toolbar bar menu.
Re: Issue 447660 in chromium: Youtube page crashing on M41
Re: Issue 436388 in chromium: Calibri(body) displayed as incorrect font
type in toolbar bar menu.
Issue 447662 in chromium: Move TileGridInfo from skia to cc
Re: Issue 447662 in chromium: Move TileGridInfo from skia to cc
Re: Issue 447653 in chromium: Unable to open youtube page on guest user
Re: Issue 444196 in chromium: ARC: ./launch_chrome perftest
--remote=<Chromebook> should fail if zram is in use
Re: Issue 447660 in chromium: Youtube page crashing on M41
Re: Issue 402293 in chromium: "Google Chrome" process hangs (100% CPU) on
Mac OS X 10.9.4 when opening economist.com
Re: Issue 447653 in chromium: Unable to open youtube page
Re: Issue 447653 in chromium: Unable to open youtube page
Re: Issue 441716 in chromium: Regression: Glimpse of NTP content is seen on
clicking 'No thanks' in chrome sign in page.
Re: Issue 323521 in chromium: Divs with a border create 4 paint commands
Re: Issue 447050 in chromium: Set up falco-full-compile-paladin /
nyan-full-compile-paladin
Re: Issue 447450 in chromium: [WiFi_Matfunc] network_WiFi_BgscanBackoff
fails on nyan devices
Re: Issue 447654 in chromium: ARC: Fps and standard deviation are regressed
on M 41
Re: Issue 447653 in chromium: Unable to open youtube page
Issue 447665 in chromium: Chromebook says "Unable to log in, type in
password"
Re: Issue 447198 in chromium: Preference order of cipher suites favors RC4
Re: Issue 375342 in chromium: Drop RC4 Support
Re: Issue 447015 in chromium: Parse the mp4 colr metadata for MSE video.
Re: Issue 447665 in chromium: Chromebook says "Unable to log in, type in
password"
Re: Issue 253754 in chromium: Rotate Chromoting X session log files when
they get too big
Re: Issue 447665 in chromium: Chromebook says "Unable to log in, type in
password"
Re: Issue 323521 in chromium: Divs with a border create 4 paint commands
Issue 447666 in chromium: Remove android_webview glue layer resources
package name hack when we don't build in Android anymore
Re: Issue 260933 in chromium: ImageBitmap should copy 2D canvases lazily
Re: Issue 447230 in chromium: SVGImage::nativeImageForCurrentFrame() should
not copy its bitmap
Re: Issue 447399 in chromium: Mobbuild: power_manager unittest failures
Re: Issue 260933 in chromium: ImageBitmap should copy 2D canvases lazily
Re: Issue 447645 in chromium: ARC: Add apk_to_crx sdktest for
--use-all-play-services
Re: Issue 428328 in chromium: News site takes ~14% of CPU consistently even
in background
Re: Issue 427490 in chromium: Google Inbox takes up 10% CPU just sitting
idle
Re: Issue 444223 in chromium: ARC: 'Adb Shell for Chrome' cannot find ARC
on Chrome OS
Re: Issue 356904 in chromium: getAuthToken returns undefined instead of
launching an interactive sign in window
Re: Issue 444196 in chromium: ARC: ./launch_chrome perftest
--remote=<Chromebook> should fail if zram is in use
Re: Issue 447399 in chromium: Mobbuild: power_manager unittest failures
Re: Issue 447645 in chromium: ARC: Add apk_to_crx sdktest for
--use-all-play-services
Re: Issue 141178 in chromium: High CPU usage of Browser process in Chrome
Task manager
Re: Issue 447296 in chromium: Investigate overhead of multiple raster tasks
on ugamsolutions.com
Re: Issue 445016 in chromium: Support multiple video encoder and decoder
Re: Issue 443978 in chromium: regression: click to play not disabled for
full page
Re: Issue 440443 in chromium: Add experiment for ClientHello padding
Re: Issue 447353 in chromium: first sync on trybot fails in FindCacheDir
with OSError
Re: Issue 434450 in chromium: Move page scale constraints out of Source/web
Issue 447667 in chromium: Move setPageScaleLimits methods from EventSender
to InternalSettings
Re: Issue 426847 in chromium: Incorrect image displayed at the search
results in the Chrome Web Store
Re: Issue 446346 in chromium: Extensions overriding bookmark shortcut fail
to display page action after changing shortcut key
Re: Issue 447653 in chromium: Unable to open youtube page
Re: Issue 446908 in chromium: WebRTC roll broke two tests on multiple bots
Re: Issue 446692 in chromium: Increased memory usage with ASan builds after
upgrading to Trusty
Re: Issue 444435 in chromium: CrOSH fails to detect battery when using
battery_test
Re: Issue 427728 in chromium: Freon: external display stopped working
Re: Issue 446393 in chromium: Media query parser allows
(orientation : 'portrait'), (orientation : #portrait), etc.
Re: Issue 447399 in chromium: Mobbuild: power_manager unittest failures
Re: Issue 389585 in chromium: Integer underflow in
WebCore::Shape::createRasterShape
Re: Issue 443736 in chromium: lsb-release: Split CHROMEOS_RELEASE_BOARD
into board and keyset
Re: Issue 446908 in chromium: WebRTC roll broke two tests on multiple bots
--
--
Automated mail from issue updates at http://crbug.com/
Subscription options: http://groups.google.com/a/chromium.org/group/chromium-bugs

To unsubscribe from this group and stop receiving emails from it, send an email to chromium-bugs+***@chromium.org.
c***@googlecode.com
2015-01-12 21:17:01 UTC
Permalink
Your project notifications generated too many emails to send
individually. Here are the subject lines of the emails you would have
received:

Re: Issue 447542 in chromium: Regression: Zoom level doesn't reset to
default for 'Set up Chrome' page after deleting the entry from content
settings.
Re: Issue 448079 in chromium: Chrome failed in the PFQ: git error when
building pnacl_support_extension
Re: Issue 441883 in chromium: Android cronet builders periodically
failing "provision_devices" b/c devices offline.
Re: Issue 448125 in chromium: Clicking icon of already-running app in
launcher does not refocus it
Issue 448126 in chromium: Can't log into Smart Lock enabled accounts
Re: Issue 447164 in chromium: 2.3%-3% regression in
page_cycler.intl_ar_fa_he at 310384:310414
Issue 448127 in chromium: No video playback when play video in Flash website
Issue 448128 in chromium: Chrome Remote Desktop opens a new window every
time it's clicked in the launcher
Re: Issue 448079 in chromium: Chrome failed in the PFQ: git error when
building pnacl_support_extension
Re: Issue 445206 in chromium: Move performance tests from bvt-perbuild to
performance test suite
Re: Issue 447570 in chromium: Crash in
cricket::P2PTransportChannel::SortConnections()
Re: Issue 417532 in chromium: Replace base::ProcessHandle with a scoped type
Re: Issue 448092 in chromium: Android Nexus4 Perf failure in
media.android.tough_video_cases
Re: Issue 445106 in chromium: The browser becomes unable to print if you
press the "back" button (or other means of cancelling the print) until you
reset the device or close chrome and wait a while.
Issue 448130 in chromium: input with negative z-index within stacking
context behaves strange
Re: Issue 447068 in chromium: DCHECK: webstore_installer.cc(459)] Check
failed: !pending_modules_.empty().
Re: Issue 448079 in chromium: Chrome failed in the PFQ: git error when
building pnacl_support_extension
Re: Issue 447016 in chromium: Remove sign-in and field trial related code
after GCM is launched to all users.
Re: Issue 447955 in chromium: Can't test EventHandler::handleGestureEvent
due to tap targeting issue
Re: Issue 448092 in chromium: Android perf bots failure in
media.android.tough_video_cases (timeout)
Re: Issue 447164 in chromium: 2.3%-3% regression in
page_cycler.intl_ar_fa_he at 310384:310414
Re: Issue 436810 in chromium: Blank print preview dialog after "using print
with system dialog".
Re: Issue 279485 in chromium: onErrorOccurred fired when downloading a file
Issue 448131 in chromium: Security Key proxying no longer works to Linux
hosts
Re: Issue 446959 in chromium: Chrome tab crashes when navigating back after
clicking link to named anchor in window where about:blank document has been
rewritten using document.open
Re: Issue 446021 in chromium: Media queries not evaluated as window is
resized in emulation mode.
Re: Issue 447065 in chromium: determine exact rules for server cards
shadowing dupe local cards
Re: Issue 47134 in chromium: Command-W Sometimes (random occurrence) closes
entire window instead of a single tab
Re: Issue 448079 in chromium: Chrome failed in the PFQ: git error when
building pnacl_support_extension
Re: Issue 439322 in chromium: CrashDumpManager needs to be initialized
earlier
Re: Issue 47134 in chromium: Command-W Sometimes (random occurrence) closes
entire window instead of a single tab
Re: Issue 411079 in chromium: Fonts look bad in shaped windows if
desktop-zoom is in effect
Re: Issue 448079 in chromium: Chrome failed in the PFQ: git error when
building pnacl_support_extension
Re: Issue 47134 in chromium: Command-W Sometimes (random occurrence) closes
entire window instead of a single tab
Re: Issue 447942 in chromium: Regression: Background turns black in Print
preview after selecting 'Background graphics' option.
Re: Issue 448079 in chromium: Chrome failed in the PFQ: git error when
building pnacl_support_extension
Re: Issue 433583 in chromium: Memory error in BrowsingDataAppCacheHelper?
Issue 448133 in chromium: design details of CVC challenge prompt
Re: Issue 447081 in chromium: Can't select parent tree item by pressing
<UP> in cr.ui.Tree
Re: Issue 447092 in chromium: Up Navigation key is not working in Bookmark
Manager
Re: Issue 47134 in chromium: Command-W Sometimes (random occurrence) closes
entire window instead of a single tab
Re: Issue 47134 in chromium: Command-W Sometimes (random occurrence) closes
entire window instead of a single tab
Re: Issue 424225 in chromium: Chrome for Android fails Acid2
Re: Issue 370433 in chromium: Move bookmarks component code in the
bookmarks namespace
Re: Issue 406578 in chromium: webrtc: closing peerconnection does not
release TURN allocations
Re: Issue 448124 in chromium: pre-cq rejected a change due to dependency
failure, after it was already passed
Re: Issue 447081 in chromium: Can't select parent tree item by pressing
<UP> in cr.ui.Tree
Re: Issue 406578 in chromium: webrtc: closing peerconnection does not
release TURN allocations
Re: Issue 446808 in chromium: Regression: Unable to differentiate the
selected / unselected area on 'devtools-timeline' section
Re: Issue 439930 in chromium: Regression: Weird behaviour of suggestion
drop-down list is seen after vertically hovering the mouse pointer on the
overlay of 'Startup pages'.
Re: Issue 437476 in chromium: DevTools: support ES6 syntax in pretty print
Re: Issue 433664 in chromium: Tegra K1: pixel format is not managed
properly by Chromium OS/ply-image, impacts crouton
Re: Issue 448109 in chromium: Mobbuild: test_au_zip.py failures
Re: Issue 447081 in chromium: Can't select parent tree item by pressing
<UP> in cr.ui.Tree
Re: Issue 443695 in chromium: Remove audio capture allowed from system
level device policy
Re: Issue 447984 in chromium: Position of checkbox near replace button is
not proper in devtools
Re: Issue 447944 in chromium: Context menu is not seen on right click in
emulated sign-in page
Re: Issue 448007 in chromium: Regression: Lower portion of border is
misaligned in 'Bookmark Manager'.
Re: Issue 448127 in chromium: No video playback when play video in Flash
website
Re: Issue 412468 in chromium: Suspicious Off-domain inclusion detection in
Chrome.
Re: Issue 448022 in chromium: Blank Preview is displayed for specific
Google slides/Presentation
Re: Issue 360388 in chromium: Ignores all keyboard input
Re: Issue 447075 in chromium: Single channel audio played through
pulseaudio is really loud
Re: Issue 439440 in chromium: Two-finger swipe - weird behavior
Re: Issue 430243 in chromium: Link highlights not showing up on most links
Re: Issue 360388 in chromium: Ignores all keyboard input
Re: Issue 2204 in chromium: Chrome needs offline browsing capability
Re: Issue 47134 in chromium: Command-W Sometimes (random occurrence) closes
entire window instead of a single tab
Re: Issue 446021 in chromium: Media queries not evaluated as window is
resized in emulation mode.
Re: Issue 230921 in chromium: Accents (á, ê, õ, etc.) don't work with
physical keyboard
Re: Issue 447941 in chromium: Regression: Blank Print preview is shown for
Chrome-signin page.
Re: Issue 448127 in chromium: No video playback when play video in Flash
website
Issue 448137 in chromium: [Regression] Fix to shorten CWS "extension name"
for "ro" to not exceed 45 characters
Re: Issue 447818 in chromium: Incorrect Heading/Header displayed on
SAML/SSO auth page
Re: Issue 448109 in chromium: Mobbuild: test_au_zip.py failures
Re: Issue 434482 in chromium: ARC: Do not shadow GL_FIXED buffers when
using EGLGLES2 implementation.
Re: Issue 446586 in chromium: Failure on Nexus 7 dromaeo.domcorequery
(Error reading telemetry results from /tmp/...)
Issue 448138 in chromium: pagination off on landscape multi-column 2003 file
Re: Issue 445457 in chromium: ARC: The map in HomeAway is upside down
Re: Issue 420834 in chromium: Change desktop sign-in confirmation string
for platform consistency
Issue 448139 in chromium: Google Cloud Print without Chrome
Issue 448140 in chromium: Create ProxyBeginFrameSource
Re: Issue 441439 in chromium: Font hinting should be ignored when DSF is
changed to 1.25
Re: Issue 444921 in chromium: Rationalize visual (glyph) overflow for text
Re: Issue 399095 in chromium: Implement HKDF for WebCrypto
Re: Issue 447279 in chromium: Run browser_tests on chrome.chromeos bots for
official dev, beta, stable release candidates
Re: Issue 445610 in chromium: chrome://net-internals hits assertions on
Chrome for Android
Re: Issue 447955 in chromium: Can't test EventHandler::handleGestureEvent
due to tap targeting issue
Re: Issue 448138 in chromium: pagination off on landscape multi-column 2003
file
Re: Issue 427627 in chromium: On some Windows machines DSCP stops outgoing
packet flow
Re: Issue 448079 in chromium: Chrome failed in the PFQ: git error when
building pnacl_support_extension
Re: Issue 447738 in chromium: Support transition between platform scrolling
and JS pinching
Re: Issue 423056 in chromium: Wrong font-rendering (anti aliasing) with
Chrome 38
Re: Issue 447738 in chromium: Support transition between platform scrolling
and JS pinching
Re: Issue 448079 in chromium: Chrome failed in the PFQ: git error when
building pnacl_support_extension
Re: Issue 434903 in chromium: shill: set_wake_on_wifi should not ship with
production images
Re: Issue 435002 in chromium: ARC: Rename PepperFile(Handler) to
HTML5File(Handler)
Re: Issue 434903 in chromium: shill: set_wake_on_wifi should not ship with
production images
Re: Issue 434903 in chromium: shill: set_wake_on_wifi should not ship with
production images
Re: Issue 447579 in chromium: 1.1% regression in
rasterize_and_record_micro.key_mobile_sites_smooth at 310604:310609
--
--
Automated mail from issue updates at http://crbug.com/
Subscription options: http://groups.google.com/a/chromium.org/group/chromium-bugs

To unsubscribe from this group and stop receiving emails from it, send an email to chromium-bugs+***@chromium.org.
c***@googlecode.com
2015-01-12 22:59:30 UTC
Permalink
Your project notifications generated too many emails to send
individually. Here are the subject lines of the emails you would have
received:

Re: Issue 447484 in chromium: Password generation triggers on wrong form
for outbrain.com
Issue 448161 in chromium: InvalidStateError in fileWriter.js
Re: Issue 446327 in chromium: Host exiting with undocumented exit code 6 on
Mac
Issue 448162 in chromium: Unable to connect to Google-A on resume
Re: Issue 448156 in chromium: git cl format makes an incorrect fix.
Re: Issue 447537 in chromium: Regression: Default cursor is missing
in 'Email' textbox in 'Sign in' page.
Re: Issue 446327 in chromium: Host exiting with undocumented exit code 6 on
Mac
Re: Issue 448162 in chromium: Unable to connect to Google-A on resume
Re: Issue 440311 in chromium: This website is not available - ERR_FAILED
Re: Issue 443758 in chromium: Auto reconnect fails when device is not paired
Re: Issue 437290 in chromium: Mojo: standalone network service on Android
Re: Issue 437116 in chromium: need a UI for entering CVC to unmask wallet
instrument (android)
Re: Issue 447672 in chromium: iOS: EML Msg download fails
Re: Issue 445206 in chromium: Move performance tests from bvt-perbuild to
performance test suite
Re: Issue 380005 in chromium: Status bar does not always hide in full
screen mode video playback
Re: Issue 447683 in chromium: A plug-in(Shockwave Flash)isn't responding
show up after resume from suspend
Re: Issue 446010 in chromium: Chrome remote desktop plugin blocked
Re: Issue 443758 in chromium: Auto reconnect fails when device is not paired
Re: Issue 447415 in chromium: ui::::LoadKeymap
Re: Issue 447832 in chromium: Attribute selector code loops through all
attributes even after finding the right one
Re: Issue 431272 in chromium: Regression : Blink of v2 app seen after
opening it in full screen mode in Macbook Retina.
Re: Issue 368711 in chromium: Unable to scroll after refresh on page with
dynamically generated content
Re: Issue 428886 in chromium: Improve handling when there is no mouse cursor
Re: Issue 447537 in chromium: Regression: Default cursor is missing
in 'Email' textbox in 'Sign in' page.
Re: Issue 439762 in chromium: With large number of windows/tabs open, can't
load some websites, receiving ERR_CONNECTION_CLOSED, ERR_TIMED_OUT,
ERR_CONNECTION_RESET, or Gateway Timeout
Re: Issue 277893 in chromium: System modal dialog unhide shelf launcher.
Re: Issue 447720 in chromium: System Modal Dialog Prevents Going to
Maximized Mode
Re: Issue 441372 in chromium: Tab silently crashes without ANR dialog
Re: Issue 422516 in chromium: Task BackgroundIO::OnIOSignalled is janky on
Windows
Re: Issue 436314 in chromium: graphics_WebGLAquarium/1000 ~20% regression
on Exynos 5 Dual (Daisy, Spring, Skate) devices
Re: Issue 47134 in chromium: Command-W Sometimes (random occurrence) closes
entire window instead of a single tab
Re: Issue 448133 in chromium: design details of CVC challenge prompt
Re: Issue 417532 in chromium: Replace base::ProcessHandle with a scoped type
Re: Issue 343578 in chromium: Line offsets incorrect for insertion point at
end of line
Re: Issue 383553 in chromium: On Mac OS X 10.9, chrome://memory is
partially broken, and UMA memory reporting is fully broken
Re: Issue 447463 in chromium: Chrome-network: Long delay before RST
message on stale sockets results in slow page loads.
Issue 448164 in chromium: Improve TransformFeedback related commands
handling
Re: Issue 165079 in chromium: Many contractions using traditional ("curly")
apostrophes are not recognized by the English spellcheck
Re: Issue 448164 in chromium: Improve TransformFeedback related commands
handling
Re: Issue 393155 in chromium: Cleanup: Returning by const value does not
often make sense
Re: Issue 422589 in chromium: Pressing insert in Chromoting session on a
Mac client hangs the entire Chrome
Issue 448165 in chromium: Remove chrome.pushMessaging code from Chrome
Issue 448166 in chromium: Support larger FFT sizes in AnalyserNode and
check behavior for small FFT sizes.
Issue 448167 in chromium: Chrome m41 tracing page
(chrome://inspect?tracing) does not work
Re: Issue 375297 in chromium: the total blobs' size cannot exceed about
500MiB
Issue 448168 in chromium: [Android WebView] Run renderer compositor on gpu
thread
Re: Issue 448167 in chromium: Chrome m41 tracing page
(chrome://inspect?tracing) does not work
Re: Issue 446327 in chromium: Host exiting with undocumented exit code 6 on
Mac
Re: Issue 407778 in chromium: On-screen keyboard doesn't work with Chrome
Remote Desktop extension
Issue 448169 in chromium: lineargradient not rendered when in code covered
by display:none & referenced by SVG Use
Re: Issue 448169 in chromium: lineargradient not rendered when in code
covered by display:none & referenced by SVG Use
Re: Issue 442829 in chromium: [Resources] Add UMA stats to see how the
memory pressure handling helps
Re: Issue 405053 in chromium: Cloud storage content download
Re: Issue 447280 in chromium: [Resources] Create finch experiment to
activate advanced memory mgmt functionality
Re: Issue 374247 in chromium: Aura notifications (e.g. gmail alerts) slow
down the whole browser
Re: Issue 441581 in chromium: device/bluetooth: Implement Bluetooth Audio
Sink APIs for ChromeOS.
Re: Issue 447461 in chromium: Race between creating mutex in
EnsureNSSInit() and using it in SSLConfig()
Re: Issue 429016 in chromium: chromeos/dbus: Add D-Bus bindings for Media,
Media Transport and Media Endpoint Interfaces.
Re: Issue 446012 in chromium: login_OobeLocalization flake on stumpy
Issue 448170 in chromium: ARC: Pandora keeps thinking it has crashed, but
it still works
Re: Issue 447836 in chromium: Blob stored in IndexedDB causes null result
from FileReader
Re: Issue 448165 in chromium: Remove chrome.pushMessaging code from Chrome
Re: Issue 447461 in chromium: Race between creating mutex in
EnsureNSSInit() and using it in SSLConfig()
Issue 448171 in chromium: plugins blocked or marked needs_authorization are
not possible to launch with --enable-plugin-power-saver
Issue 448172 in chromium: chrome.proxy.settings.get 'details' parameter in
callback is undefined
Re: Issue 416494 in chromium: Timezone should auto-update if in new location
Re: Issue 446457 in chromium: chrome.webRequest.onHeadersReceived is not
fired for chrome-extension:// URLS
Re: Issue 448171 in chromium: plugins blocked or marked needs_authorization
are not possible to launch with --enable-plugin-power-saver
Re: Issue 448172 in chromium: chrome.proxy.settings.get 'details' parameter
in callback is undefined
Re: Issue 437663 in chromium: chrome crashes when i try to upload images to
my site
Re: Issue 439882 in chromium: MacViews: Audit TOOLKIT_VIEWS #defines in
chrome
Re: Issue 448171 in chromium: plugins blocked or marked needs_authorization
are not possible to launch with --enable-plugin-power-saver
Re: Issue 431263 in chromium: document_idle content script runs twice if
the content script performs a blocking operation
Re: Issue 420774 in chromium: Mark insecure resources in network panel (dev
tools)
Re: Issue 209794 in chromium: Networks need to be configured by
administrators of an enterprise
Re: Issue 139105 in chromium: incorrect mime-type for csv-files
Re: Issue 420774 in chromium: Mark insecure resources in network panel (dev
tools)
Re: Issue 408773 in chromium: Large latency for WebSockets when running on
battery power
Re: Issue 429097 in chromium: "Cache-Control: no-store, must-revalidate"
header is not honored for images loaded CSS
Re: Issue 425339 in chromium: Update ChromeOS captive portal notification
Re: Issue 400429 in chromium: FR: 100% SNI client side support on ChromeOS
Issue 448175 in chromium: noise when building debug (windows)
Re: Issue 442392 in chromium: Overlapped IO on windows artificially
limiting the outbound data on UDP (and possibly TCP too)
Re: Issue 431263 in chromium: document_idle content script runs twice if
the content script performs a blocking operation
Re: Issue 423524 in chromium: Merge Domain Reliability configs
Issue 448177 in chromium: Public Session cannot auto-launch in ChromeOS VM
Re: Issue 441438 in chromium: Offline error message gives out of date
information
Re: Issue 412078 in chromium: make sure plugins_*.json is up to date before
hitting stable
Re: Issue 399850 in chromium: chrome.sockets.udp's Multicast isn't working
in ChromeOS
Re: Issue 448175 in chromium: noise when building debug (windows)
Re: Issue 446751 in chromium: FATAL:picture_layer_tiling_set.cc(127)] Check
failed: 1u == num_high_res (1 vs. 0)
Re: Issue 447064 in chromium: App content gets clipped by the window when
Page zoom is set to >100%
Re: Issue 153568 in chromium: Bad UX in apps if user has non-default zoom
level in Chrome
Re: Issue 444652 in chromium: shill: shill does not report readiness after
scan in dark resume
Re: Issue 411500 in chromium: DNS_PROBE_FINISHED_NO_INTERNET
Re: Issue 447955 in chromium: Can't test EventHandler::handleGestureEvent
due to tap targeting issue
Issue 448178 in chromium: move packages/dev-only-extras.tbz2 outside
packages/
Re: Issue 412078 in chromium: make sure plugins_*.json is up to date before
hitting stable
Re: Issue 443736 in chromium: lsb-release: Split CHROMEOS_RELEASE_BOARD
into board and keyset
Re: Issue 433664 in chromium: Tegra K1: pixel format is not managed
properly by Chromium OS/ply-image, impacts crouton
--
--
Automated mail from issue updates at http://crbug.com/
Subscription options: http://groups.google.com/a/chromium.org/group/chromium-bugs

To unsubscribe from this group and stop receiving emails from it, send an email to chromium-bugs+***@chromium.org.
c***@googlecode.com
2015-01-13 00:27:00 UTC
Permalink
Your project notifications generated too many emails to send
individually. Here are the subject lines of the emails you would have
received:

Re: Issue 441573 in chromium: App list: Should have a grey square behind
app tiles that are hovered
Re: Issue 383314 in chromium: Chrome GPU process keeps crashing.
Re: Issue 445910 in chromium: uninitialized read in WallpaperManager
Re: Issue 424270 in chromium: Page unresponsive warning for background tabs
that still work fine
Re: Issue 447291 in chromium: ugamsolutions.com + force gpu raster - slow
after scaling
Re: Issue 447296 in chromium: Investigate overhead of multiple raster tasks
on ugamsolutions.com
Re: Issue 435540 in chromium: Regression: Page scrolling is not smooth
on 'http://www.ugamsolutions.com'.
Re: Issue 447293 in chromium: Resizing chrome causes us to get stuck in low
quality mode
Re: Issue 445497 in chromium: Autofill doesn't work with multi-word last
names
Re: Issue 447823 in chromium: Audio is low at 50% when play local video /
audio file
Issue 448200 in chromium: Textareas autoscroll to bottom in SVG
Re: Issue 448200 in chromium: Textareas autoscroll to bottom in SVG
Re: Issue 444608 in chromium: Non-Hera experimental bots are failing
UIAutomator Autofill tests
Issue 448201 in chromium: IPC owners missing for some _messages* files.
Re: Issue 424225 in chromium: Chrome for Android fails Acid2
Re: Issue 444894 in chromium: text rendering is slow due to "ui-sans" font
family in harfbuzz
Re: Issue 310374 in chromium: Mavericks: Use occlusion APIs for power
savings
Re: Issue 422522 in chromium: Chrome: Crash Report - [Renderer hang]
content::RenderThreadImpl::GetAudioHardwareConfig
Re: Issue 445206 in chromium: Move performance tests from bvt-perbuild to
performance test suite
Re: Issue 428182 in chromium: Recipe config redesign
Re: Issue 368108 in chromium: implement CSS "text-justify" in Chinese
Re: Issue 432129 in chromium: RendererScheduler causes some blink layout
tests to become flaky
Re: Issue 445610 in chromium: chrome://net-internals hits assertions on
Chrome for Android
Re: Issue 433292 in chromium: Regression: Trace is seen
in 'http://www.lenskart.com'
Re: Issue 423056 in chromium: Wrong font-rendering (anti aliasing) with
Chrome 38
Re: Issue 424225 in chromium: Chrome for Android fails Acid2
Re: Issue 448157 in chromium: Make chrome.webcamPrivate available on stable.
Re: Issue 448175 in chromium: noise when building debug (windows)
Issue 448202 in chromium: CQ not automatically retrying my change, despite
saying it will.
Re: Issue 438350 in chromium: Crash server very slow to process minidumps.
Re: Issue 439440 in chromium: Two-finger swipe - weird behavior
Re: Issue 448157 in chromium: Make chrome.webcamPrivate available on stable.
Re: Issue 447108 in chromium: source code or pc page is blinking , when
load qq.com, with android chrome beta 40
Re: Issue 376036 in chromium: Remote connection showing enabled when
service is not running
Re: Issue 448157 in chromium: Make chrome.webcamPrivate available on stable.
Re: Issue 447823 in chromium: Audio is low at 50% when play local video /
audio file
Re: Issue 363695 in chromium: Previous host referenced when trying to
delete paired client
Re: Issue 431488 in chromium: Chromoting Auth browser-test fails on Windows.
Issue 448203 in chromium: Use-after-free in blink::Frame::detach
Re: Issue 446342 in chromium: Implement browser test for It2me Connection
Re: Issue 340898 in chromium: Create browser-tests for Chromoting IT2Me
scenarios.
Re: Issue 434482 in chromium: ARC: Do not shadow GL_FIXED buffers when
using EGLGLES2 implementation.
Re: Issue 447331 in chromium: memory leak found while fuzzing
Re: Issue 438831 in chromium: shill: should not scan on resume if connected
and wowlan is enabled
Issue 448204 in chromium: Enable rendering stats for android apps.
Re: Issue 376011 in chromium: USB DAC not working even though I can see in
ticked in audio output
Issue 448206 in chromium: HandleClearDepthf calls glClearDepth(clampd
double) on GLES
Re: Issue 448204 in chromium: Enable rendering stats for android apps.
Re: Issue 427792 in chromium: AppWindow.setShape() with zero area doesn't
work.
Re: Issue 439440 in chromium: Two-finger swipe - weird behavior
Re: Issue 376011 in chromium: USB DAC not working even though I can see in
ticked in audio output
Re: Issue 448206 in chromium: HandleClearDepthf calls glClearDepth(clampd
double) on GLES
Re: Issue 447836 in chromium: Blob stored in IndexedDB causes null result
from FileReader
Re: Issue 441959 in chromium: [Telemetry] Add ability to specify WebView
command-line flags when testing Android app
Re: Issue 376011 in chromium: USB DAC not working even though I can see in
ticked in audio output
Issue 448209 in chromium: WaveShaperNode.oversample is defined to throw
errors but doesn't.
Re: Issue 432070 in chromium: DrMemory reports a use-after-free in
SitePerProcessBrowserTest.NavigateRemoteFrame
Re: Issue 448203 in chromium: Use-after-free in blink::Frame::detach
Re: Issue 440506 in chromium: OOBE enabling development features error
after removing rootfs verification
Re: Issue 432070 in chromium: DrMemory reports a use-after-free in
SitePerProcessBrowserTest.NavigateRemoteFrame
Re: Issue 448005 in chromium: ThreadSanitizer reports a use-after-free in
blink::RemoteFrame::detach()
Re: Issue 374624 in chromium: Running chrome causes 100% cpu usage of
lsass.exe
Re: Issue 448137 in chromium: [Regression] Fix to shorten CWS "extension
name" for "ro" to not exceed 45 characters
Re: Issue 232140 in chromium: Provide richer error reporting for
authentication failures
Re: Issue 447836 in chromium: Blob stored in IndexedDB causes null result
from FileReader
Re: Issue 385361 in chromium: Mesa 10.3 regression in
telemetry_GpuTests.webgl_conformance
Re: Issue 447293 in chromium: Resizing chrome causes us to get stuck in low
quality mode
Re: Issue 448206 in chromium: HandleClearDepthf calls glClearDepth(clampd
double) on GLES
Re: Issue 432070 in chromium: DrMemory reports a use-after-free in
SitePerProcessBrowserTest.NavigateRemoteFrame
Re: Issue 441504 in chromium: device_status_check should show number of
devices in step name (or nearby)
Re: Issue 447296 in chromium: Investigate overhead of multiple raster tasks
on ugamsolutions.com
Re: Issue 442399 in chromium: GPU Bots to Recipes
Re: Issue 442392 in chromium: Overlapped IO on windows artificially
limiting the outbound data on UDP (and possibly TCP too)
Re: Issue 448079 in chromium: Chrome failed in the PFQ: git error when
building pnacl_support_extension
Re: Issue 447571 in chromium: Regression: Chrome://apps page open up as
many times as we add same/different website shortcut.
Re: Issue 446827 in chromium: Observing blur image while clicking
on "mosaic view" button.
Re: Issue 447571 in chromium: Regression: Chrome://apps page open up as
many times as we add same/different website shortcut.
Re: Issue 432070 in chromium: DrMemory reports a use-after-free in
SitePerProcessBrowserTest.NavigateRemoteFrame
Re: Issue 439865 in chromium: Hit-testing IFrames does not honour CSS
visibility
Re: Issue 222234 in chromium: Better handle non-running states in the
web-app
Re: Issue 442392 in chromium: Overlapped IO on windows artificially
limiting the outbound data on UDP (and possibly TCP too)
Re: Issue 249142 in chromium: Numeric keypad lock state is not synced
Re: Issue 434840 in chromium: Hearts turned into rectangles on Intel GPUs
Re: Issue 448126 in chromium: Can't log into Smart Lock enabled accounts
Re: Issue 430968 in chromium: When switching to Chrome Canary via Cmd+Tab
on Mac, focus switches to omnibar frequently
Re: Issue 280379 in chromium: Deadlock in ppapi::ProxyLock when attaching
gdb to Chromoting PPAPI plugin
Re: Issue 447326 in chromium: Cannot interact with items on second monitor
with mouse.
Re: Issue 431272 in chromium: Regression : Blink of v2 app seen after
opening it in full screen mode in Macbook Retina.
Re: Issue 448091 in chromium: Enterprise enrollment failing on devices with
older FSIs
Re: Issue 444571 in chromium: chromium browser crashes
Re: Issue 446360 in chromium: Freon: audio is low at 50% when play local
video / audio file
Re: Issue 406029 in chromium: Omnibox still replacing C# with C/# in some
cases
Re: Issue 447571 in chromium: Chrome://apps page open up as many times as
we add same/different website shortcut.
Issue 448214 in chromium: CryptoToken extension should only accept requests
from https origins
Re: Issue 433567 in chromium: Get regular DUT supply reporting running on
autotest servers
Re: Issue 401253 in chromium: ADNS not enabled on some ChromeOS systems
Re: Issue 436810 in chromium: Blank print preview dialog after "using print
with system dialog".
Re: Issue 447867 in chromium: Cannot print from chrome. Only a blank white
page appears. Can print from firefox, so not printer
Re: Issue 441448 in chromium: When folder is selected, "Save as" and "Open"
dialogs should show "Open"
Issue 448217 in chromium: ARC: ARC Welder doesn't load when try to load the
same apk
--
--
Automated mail from issue updates at http://crbug.com/
Subscription options: http://groups.google.com/a/chromium.org/group/chromium-bugs

To unsubscribe from this group and stop receiving emails from it, send an email to chromium-bugs+***@chromium.org.
c***@googlecode.com
2015-01-13 18:43:39 UTC
Permalink
Your project notifications generated too many emails to send
individually. Here are the subject lines of the emails you would have
received:

Issue 448434 in chromium: launchWebAuthFlow() / getAuthToken() dialog
appears in a location unrelated to that of the calling window
Re: Issue 351179 in chromium: App windows with maximum size constraints set
cannot be minimized
Re: Issue 422522 in chromium: Chrome: Crash Report - [Renderer hang]
content::RenderThreadImpl::GetAudioHardwareConfig
Re: Issue 448433 in chromium: Apps calling launchWebAuthFlow() can generate
dialogs that have no obvious association back to the calling app
Re: Issue 444537 in chromium: Regression: 'Profile avtar icon' is not seen
in 'Windows 8 mode (Ash mode)' on creating or importing 'Supervised user'
Re: Issue 448414 in chromium: Canary timeouts in report stage
Re: Issue 383093 in chromium: Vietnamese IME broken while typing in Omnibox
Re: Issue 417463 in chromium: Replace OVERRIDE and FINAL with their C++11
counterparts
Issue 448435 in chromium: Assertion in MojoApplicationHost::Init when
navigating from WebContentsObserver::RenderProcessGone.
Re: Issue 438320 in chromium: The generic placeholder avatar is stretched
in chrome://settings
Re: Issue 441430 in chromium: Hotrod: Re-enter a session got black screen
in dual monitors
Re: Issue 447588 in chromium: 36.6% regression in spaceport at 310236:310246
Re: Issue 399166 in chromium: XHR self remove from MemoryCache on completion
Re: Issue 448414 in chromium: Canary timeouts in report stage
Re: Issue 443069 in chromium: [polymer-qowt]: Slide/Format menu options are
not displayed in locale set.
Re: Issue 448249 in chromium: Not able to screenshare using hangouts
Issue 448437 in chromium: Increased crash rate with SNOW
Re: Issue 435296 in chromium: ServiceWorker controlled page crashes when
refreshing Inspector
Re: Issue 446267 in chromium: Google Maps blank on linux
Re: Issue 446820 in chromium: Regression: Drop-down list of 'New Style
Rule' closes automatically after releasing left click from '+' button.
Re: Issue 448414 in chromium: Canary timeouts in report stage
Re: Issue 447588 in chromium: 36.6% regression in spaceport at 310236:310246
Issue 448438 in chromium: shill: DBusAdaptor: Actually support KeyValueStore
Re: Issue 424795 in chromium: Setting audioContext.destination.channelCount
to more than 8 breaks Web Audio API
Re: Issue 448181 in chromium: WaveShaper.curve should throw error if the
curve has length < 2
Re: Issue 356292 in chromium: Loading google.com search results on a device
at least one 30ms HTMLDocumentParser::insert call
Re: Issue 421300 in chromium: Make HTMLParser BlinkScheduler friendly
Re: Issue 448240 in chromium: Kernel crash on boot with Storm kernel on
boards reworked for NAND
Issue 448439 in chromium: HPKP should require quoted strings for pins per
the spec
Re: Issue 444511 in chromium: HPKP enforces includeSubDomains even when the
directive is not asserted
Re: Issue 442925 in chromium: ChannelMergerNode in a cycle produces silence
Re: Issue 448162 in chromium: Unable to connect to Google-A on resume
Re: Issue 448218 in chromium: Do we still need split-dll on windows?
Re: Issue 448181 in chromium: WaveShaper.curve should throw error if the
curve has length < 2
Re: Issue 433093 in chromium: Hotrod: inconsistent behavior between audio
input(WebCam) &output( HDMI)
Re: Issue 448117 in chromium: AudioNode.start grain with delayed buffer
setting doesn't play anything.
Re: Issue 411206 in chromium: google.com "search tools" not working in
chrome
Re: Issue 448209 in chromium: WaveShaperNode.oversample is defined to throw
errors but doesn't.
Re: Issue 378566 in chromium: Block sub-resource loads from the web to
private networks and localhost
Re: Issue 448166 in chromium: Support larger FFT sizes in AnalyserNode and
check behavior for small FFT sizes.
Re: Issue 448311 in chromium: remove restriction to max connection per host
while downloading
Re: Issue 399095 in chromium: Implement HKDF for WebCrypto
Issue 448440 in chromium:
virtual/deferred/inspector/tracing/timeline-script-tag-1.html failed on
mac/linux
Re: Issue 448435 in chromium: Assertion in MojoApplicationHost::Init when
navigating from WebContentsObserver::RenderProcessGone.
Re: Issue 444883 in chromium: Create //component/printing
Re: Issue 266149 in chromium: Submit changes in interrupt.h to the upstream
Re: Issue 423818 in chromium: Chrome remote desktop shows a black screen
Re: Issue 448380 in chromium: Can't upload changes in
tools/json_schema_compiler because of dart_generator_test.py failing
Issue 448441 in chromium: dut_status fails for hosts in a shard
Re: Issue 440723 in chromium: Observing black patch for sometime after
minimizing on-screen keyboard.
Re: Issue 446668 in chromium: Setup Builders and PFQ for M41 Branch
Issue 448442 in chromium:
virtual/slimmingpaint/fast/borders/border-image-side-reduction.html fails
on XP
Re: Issue 403619 in chromium: User Manager UI is inconvenient for switching
between profiles quickly.
Re: Issue 317161 in chromium: Pure vertical scrolling triggers "back"
gesture
Re: Issue 423818 in chromium: Chrome remote desktop shows a black screen
Re: Issue 448441 in chromium: dut_status fails for hosts in a shard
Re: Issue 448441 in chromium: dut_status fails for hosts in a shard
Re: Issue 436314 in chromium: graphics_WebGLAquarium/1000 ~20% regression
on Exynos 5 Dual (Daisy, Spring, Skate) devices
Re: Issue 448218 in chromium: Do we still need split-dll on windows?
Re: Issue 437122 in chromium: Public Session wallpaper does not apply
Re: Issue 448274 in chromium: Layout Test
http/tests/misc/prefetch-purpose.html is failing
Re: Issue 448290 in chromium: The web page crashes after pressing 'ctrl+z'
two times in the styles section of devtools.
Re: Issue 444574 in chromium: Blink Scheduler fails some ChromeOS Unit tests
Re: Issue 276684 in chromium: Section headers overlap adjacent navigation
box
Re: Issue 448442 in chromium:
virtual/slimmingpaint/fast/borders/border-image-side-reduction.html fails
on XP
Re: Issue 448440 in chromium:
virtual/deferred/inspector/tracing/timeline-script-tag-1.html failed on
mac/linux
Re: Issue 440723 in chromium: Observing black patch for sometime after
minimizing on-screen keyboard.
Re: Issue 446184 in chromium: Ensure ozone cursor handling is unaffected by
UI jank
Re: Issue 441542 in chromium: Floated container gets clipped during
painting when toggling between overflow-y scroll states
Re: Issue 279485 in chromium: onErrorOccurred fired when downloading a file
Re: Issue 378412 in chromium: Chrome for Android immersive full screen mode
Re: Issue 317161 in chromium: Pure vertical scrolling triggers "back"
gesture
Re: Issue 356759 in chromium: [virtual keyboard] Layout changing keys do
not light up when pressed
Re: Issue 445024 in chromium: [Butterfly]Chrome-Book is not restarting
automatically after removing USB..
Re: Issue 412866 in chromium: Public-Key-Pins max-age expiration seems to
require browser restart
Re: Issue 436314 in chromium: graphics_WebGLAquarium/1000 ~20% regression
on Exynos 5 Dual (Daisy, Spring, Skate) devices
Re: Issue 444161 in chromium: Wi-Fi fails to resume after sleep
Re: Issue 413822 in chromium: Keyboard animation opacity cannot be zero
Re: Issue 317161 in chromium: Pure vertical scrolling triggers "back"
gesture
Re: Issue 435557 in chromium: Remove cc::Rasterizer::RunReplyOnOriginThread
Re: Issue 446184 in chromium: Ensure ozone cursor handling is unaffected by
UI jank
Issue 448444 in chromium: HistoryDB not backed up in TimeMachine
Re: Issue 447809 in chromium: Remove
OmniboxFieldTrial::DisplayHintTextWhenPossible
Issue 448445 in chromium: Unconfigured networks do not provide NetworkState
assigned GUID in ONC
Re: Issue 433567 in chromium: Get regular DUT supply reporting running on
autotest servers
Re: Issue 441223 in chromium: Dev Tool crashes on each site with a Ohn Snap
Window
Re: Issue 445885 in chromium: Regression: Page does not reset to default
once the page is completely zoom out for FishBowl 2D canvas experiment.
Re: Issue 433567 in chromium: Get regular DUT supply reporting running on
autotest servers
Issue 448446 in chromium: Investigate why RunComponentExtensionTest
generates install events even for the same component extension run
repeatedly
Issue 448447 in chromium: Implement
PictureImageLayer::PaintContentsToDisplayList
Re: Issue 441542 in chromium: Floated container gets clipped during
painting when toggling between overflow-y scroll states
Re: Issue 446184 in chromium: Ensure ozone cursor handling is unaffected by
UI jank
Re: Issue 318937 in chromium: Aura on Linux ignores window manager
raise-on-click settings
Re: Issue 169203 in chromium: Reuse FFmpegAudioDecoder in External Clear
Key CDM.
Re: Issue 440990 in chromium: Security: module locking can be disable after
boot in verified mode
Re: Issue 415999 in chromium: trunks: Create a TPM utility class that
presents an API to perform common TPM operations
Re: Issue 415998 in chromium: trunks: Create a command line tool for TPM2.0
(similar to tpmc)
Re: Issue 180756 in chromium: Unable to Launch or Use VMware View from
Chromebook
Re: Issue 444100 in chromium: Chaps: Integrate trunks and TPM2.0 support
Re: Issue 440635 in chromium: Remove the "Set wallpaper" option from the
context menu in Guest mode.
--
--
Automated mail from issue updates at http://crbug.com/
Subscription options: http://groups.google.com/a/chromium.org/group/chromium-bugs

To unsubscribe from this group and stop receiving emails from it, send an email to chromium-bugs+***@chromium.org.
c***@googlecode.com
2015-01-13 23:08:37 UTC
Permalink
Your project notifications generated too many emails to send
individually. Here are the subject lines of the emails you would have
received:

Re: Issue 448525 in chromium: Bluetooth headset did not output audio after
suspend
Re: Issue 440256 in chromium: chrome.notifications.onClosed is invoked
chrome.notifications.update
Re: Issue 444790 in chromium: Allow the creation of frontend jobs on the
master
Re: Issue 440256 in chromium: chrome.notifications.onClosed is invoked
chrome.notifications.update
Re: Issue 447990 in chromium: Regression: Bookmarked App icon looks weird
in 'Add Shortcut to this Website...' dialog box.
Issue 448528 in chromium: clang-format bad formatting of generic native
method
Issue 448529 in chromium: Implement Document.elementsFromPoint
Issue 448530 in chromium: Google Drive Sync notification: Doesn't disappear
when complete
Re: Issue 399319 in chromium: Transition between chapters in docs is really
slow (probably due to JS GC)
Re: Issue 417740 in chromium: Search Engine pointing to a chrome-extension
will crash Chrome
Re: Issue 448528 in chromium: clang-format bad formatting of generic native
method
Re: Issue 446342 in chromium: Implement browser test for It2me Connection
Re: Issue 448528 in chromium: clang-format bad formatting of generic native
method
Re: Issue 411766 in chromium: File.app: context menu totally broken
Re: Issue 424592 in chromium: File API reports erroneous information after
sequentially choosing files from <input> element.
Re: Issue 448525 in chromium: Bluetooth headset did not output audio after
suspend
Re: Issue 442602 in chromium: Chrome OS: altKey event flag is false during
alt+click
Re: Issue 403620 in chromium: Android Chromoting: Only initialize PRNG when
it's actually needed for ThirdParty auth.
Re: Issue 425201 in chromium: Disable AutoRepeat as long as keys are
pressed on ChromeOS
Re: Issue 334087 in chromium: Chromoting: Support It2Me host on Chrome OS
Re: Issue 303818 in chromium: WeakPtrFactory should always be the last
member of the class that owns it
Issue 448532 in chromium: it is very hard to select the checkbox in
mail.yahoo.com
Re: Issue 448528 in chromium: clang-format bad formatting of generic native
method
Re: Issue 448528 in chromium: clang-format bad formatting of generic native
method
Re: Issue 448244 in chromium: sys-devel/binutils: peigen.c:1958:9: error:
expected declaration or statement at end of input
Re: Issue 448506 in chromium: "Pin to Shelf/Unpin from Shelf" are not used
in Apps launcher
Re: Issue 396860 in chromium: Cannot connect to remote desktop host after
enabling in the webapp without reloading
Re: Issue 406004 in chromium: Behavior of single-axis touch radius support
is inconsistent between android and aura
Re: Issue 448048 in chromium: Ligatures remain enabled even when
letter-spacing != 0
Issue 448534 in chromium: Cannot enable localhost with v2 app
Re: Issue 414825 in chromium: Owner unable to modify user whitelist
Re: Issue 448506 in chromium: "Pin to Shelf/Unpin from Shelf" are not used
in Apps launcher
Issue 448535 in chromium: document fails to open: invalid ZIP structure
Re: Issue 448535 in chromium: document fails to open: invalid ZIP structure
Re: Issue 448156 in chromium: git cl format makes an incorrect fix.
Re: Issue 340768 in chromium: Android: too many tabs loaded in background
are killed before seen
Issue 448536 in chromium: Google Drive sync: Not resuming sync after
suspend/resume
Re: Issue 448534 in chromium: Cannot enable localhost with v2 app
Re: Issue 448536 in chromium: Google Drive sync: Not resuming sync after
suspend/resume or disconnecting/connecting internet
Issue 448537 in chromium: Displays black screen if device idle for some
time.
Re: Issue 342908 in chromium: Implement DeviceOrientationEvent Javascript
API
Re: Issue 446548 in chromium: Remove TransparentActivateWindowButton from
Ash overview mode
Re: Issue 448381 in chromium: Change overview mode to so that docked panel
windows are not grouped together
Re: Issue 340768 in chromium: Android: too many tabs loaded in background
are killed before seen
Re: Issue 447484 in chromium: Password generation triggers on wrong form
for outbrain.com
Re: Issue 448534 in chromium: Cannot enable localhost with v2 app
Re: Issue 448534 in chromium: Cannot enable localhost with v2 app
Re: Issue 448473 in chromium: Regression: OOP PDF rendering broken in some
documents - text is invisible
Issue 448538 in chromium: ARC: Make ARC compatible with Android's debugging
tools like DDMS
Issue 448539 in chromium: Autofill should not fill hidden fields
Re: Issue 401761 in chromium: NaCl sandbox in mojo_shell
Re: Issue 448465 in chromium: Hover stopped working in sky in the wm_flow
demo
Re: Issue 448534 in chromium: Cannot enable localhost with v2 app
Re: Issue 431255 in chromium: "git cl try" should kick off all the bots
that the CQ needs in order to submit
Re: Issue 448473 in chromium: Regression: OOP PDF rendering broken in some
documents - text is invisible
Issue 448540 in chromium: Mac Builder (dbg) on webkit waterfall fails to
compile
Re: Issue 332197 in chromium: 1px borders don't render with some scale
factors
Re: Issue 448157 in chromium: Make chrome.webcamPrivate available on stable.
Re: Issue 439402 in chromium: GN: ChromeOS, Win and Mac trybots are not
part of the CQ
Issue 448542 in chromium: Cant interact with the UI
Re: Issue 431255 in chromium: "git cl try" should kick off all the bots
that the CQ needs in order to submit
Re: Issue 447250 in chromium: Brillo SDK: implement CLI for WiFi
configuration
Issue 448543 in chromium: Shill error setting
StaticIPConfig: 'StaticIPConfig is not a string map"
Re: Issue 448352 in chromium: Regression:Chrome browser crashes on
clicking 'settings' option from launcher in Win 8 mode.
Re: Issue 445327 in chromium: Address fields misclassified on POST donation
page
Issue 448544 in chromium: ChromeVox no longer reads math on Wikipedia.
Re: Issue 395245 in chromium: scroll in forbes.com while loading is really
bad
Re: Issue 447590 in chromium: --disk-cache-size=0 --media-cache-size=0
options are not respected
Re: Issue 448543 in chromium: Shill error setting
StaticIPConfig: 'StaticIPConfig is not a string map"
Issue 448545 in chromium: Bluetooth HID Over GATT mice do not reconnect
after pressing "X" to disconnect
Re: Issue 417463 in chromium: Replace OVERRIDE and FINAL with their C++11
counterparts
Re: Issue 448543 in chromium: Shill error setting
StaticIPConfig: 'StaticIPConfig is not a string map"
Issue 448546 in chromium: Autofill detects section split incorrectly on
POST donation page.
Re: Issue 312380 in chromium: Replace the setuid sandbox with unprivileged
namespaces.
Re: Issue 448537 in chromium: Displays black screen if device idle for some
time.
Re: Issue 448506 in chromium: "Pin to Shelf/Unpin from Shelf" are not used
in Apps launcher
Re: Issue 448545 in chromium: Bluetooth HID Over GATT mice do not reconnect
after pressing "X" to disconnect
Issue 448549 in chromium: GPU process is not respawned
Re: Issue 448545 in chromium: Bluetooth HID Over GATT mice do not reconnect
after pressing "X" to disconnect
Re: Issue 443672 in chromium: Canceling enable-dev screen does not dismiss
it
Re: Issue 176273 in chromium: Captive portal redirect doesn't work in Chrome
Re: Issue 429709 in chromium: page_cycler.typical_25 is failing on most of
ChromeOS devices
Re: Issue 257240 in chromium: Downloading an RPM, chrome detects it as a
real player
Re: Issue 447798 in chromium: video_VDAPerf is failing on Freon devices
Re: Issue 436512 in chromium: "Shockwave Flash Crashed" when using Chrome
Browser via Citrix ICA connection
Re: Issue 422268 in chromium: Some fonts are blurry at 125% scaling in 38
Re: Issue 440891 in chromium: Error when enabling dev features
Re: Issue 100412 in chromium: Make the tab strip keyboard-accessible
Re: Issue 112281 in chromium: The keyboard shortcuts to switch profile are
inefficient
Re: Issue 254940 in chromium: scheme of url
Issue 448551 in chromium: Lucid sleep: Checkbox is not activating
wake-on-wifi
Re: Issue 260416 in chromium: error 324 when trying to access website
Re: Issue 403165 in chromium: Expose ability to turn on “Development Tools”
feature set in OOBE (dev mode)
Re: Issue 262624 in chromium: cacert certificate import doesn't work
Re: Issue 447683 in chromium: A plug-in(Shockwave Flash)isn't responding
show up after resume from suspend
Re: Issue 438804 in chromium: Accessibility: Using chromevox, unable to
read out options for paper size when printing an image.
Re: Issue 310374 in chromium: Mavericks: Use occlusion APIs for power
savings
Re: Issue 448506 in chromium: "Pin to Shelf/Unpin from Shelf" are not used
in Apps launcher
Re: Issue 448238 in chromium: Implement I444 frame scaling in the VP9
decoder
Re: Issue 448131 in chromium: Security Key proxying no longer works to
Linux hosts
--
--
Automated mail from issue updates at http://crbug.com/
Subscription options: http://groups.google.com/a/chromium.org/group/chromium-bugs

To unsubscribe from this group and stop receiving emails from it, send an email to chromium-bugs+***@chromium.org.
c***@googlecode.com
2015-01-14 00:18:13 UTC
Permalink
Your project notifications generated too many emails to send
individually. Here are the subject lines of the emails you would have
received:

Re: Issue 412384 in chromium: Watch and log browser exit status
Re: Issue 446939 in chromium: ui::TouchEventConverterEvdev::ProcessAbs
Re: Issue 448493 in chromium: "Switch person" user interface is difficult
and unpleasant to use
Re: Issue 447919 in chromium: omnibox almost never returns a manually
entered url when typing into it
Re: Issue 431507 in chromium: Bad PDF rendering (characters overlap)
Re: Issue 448510 in chromium: Particular HSP only Bluetooth device does not
output audio
Re: Issue 448092 in chromium: Android perf bots failure in
media.android.tough_video_cases (timeout)
Re: Issue 440844 in chromium: Smart quotes in depot_tools documentation
Issue 448570 in chromium: PRESUBMIT.py incorrectly thinks an LGTM is
missing for a target of a new DEPS dependency
Re: Issue 441500 in chromium: Popup UI of extensions causes systematic
memory leaks (can be massive for complex popup UI)
Re: Issue 112281 in chromium: The keyboard shortcuts to switch profile are
inefficient
Issue 448571 in chromium: need a UI for entering CVC to unmask wallet
instrument (desktop)
Re: Issue 448493 in chromium: "Switch person" user interface is difficult
and unpleasant to use
Re: Issue 448571 in chromium: need a UI for entering CVC to unmask wallet
instrument (desktop)
Re: Issue 447369 in chromium: Now Cards show cricket scores incorrectly.
Re: Issue 339912 in chromium: UNKNOWN in
ppapi::PpapiGlobals::GetMainThreadMessageLoop
Re: Issue 436512 in chromium: "Shockwave Flash Crashed" when using Chrome
Browser via Citrix ICA connection
Re: Issue 446223 in chromium: ASSERTION FAILED: isRenderable() in
blink::RoundedRect::radiusCenterRect
Issue 448572 in chromium: need a UI for entering CVC to unmask wallet
instrument (mac)
Issue 448573 in chromium: deploy a new clang-format binary
Re: Issue 446856 in chromium: Problem formatting Java anonymous classes
with git cl format
Re: Issue 443783 in chromium: ec-utils failing to build on
mipsel-o32-generic
Re: Issue 446631 in chromium: Mac H/W decoding failed because of <meta> tag
parsing issue
Issue 448574 in chromium: android.content.ReceiverCallNotAllowedException
in android.app.ReceiverRestrictedContext
Re: Issue 112281 in chromium: The keyboard shortcuts to switch profile are
inefficient
Re: Issue 411550 in chromium: Desktop freezes when connecting to Windows
laptop with closed lid
Re: Issue 444811 in chromium: Click folder is no function when remote
desktop is Lid cosing.
Issue 448577 in chromium: Chrome Remote Desktop 40.0.2214.82 Release,
WebApp only
Re: Issue 390289 in chromium: Some audio works, some doesn't
Re: Issue 223430 in chromium: UpdateTopSitesOnDBThread() running during
early startup
Re: Issue 223431 in chromium: WebDataService::ScheduleCommit() running
during early startup
Re: Issue 234383 in chromium: Startup: Top sites read during early startup
Re: Issue 234387 in chromium: Startup: History read during early startup
Re: Issue 392310 in chromium: Investigate reasons for Certificate Common
Name Invalid error, and gauge their relative severity.
Re: Issue 135009 in chromium: ksadmin launched twice during Chrome startup
Re: Issue 417740 in chromium: Search Engine pointing to a chrome-extension
will crash Chrome
Re: Issue 445856 in chromium: Regression: Vertical scroll bar is distorted
in the 'Style' section of 'Dev Tools'.
Re: Issue 234391 in chromium: Startup: Bunch of plists read during early
startup
Re: Issue 164341 in chromium: CreateRenderViewHostNow() taking 400ms during
startup
Re: Issue 448420 in chromium: All Table Styles erroneously set to
TableNormal in doc format.
Re: Issue 140785 in chromium: Verify that RLZ doesn't block startup
Re: Issue 179779 in chromium: Add
NOTIFICATION_PERFORM_NONCRITICAL_INITIALIZATION
Re: Issue 246555 in chromium: Record control versions of
Startup.SlowStartup UMAs for all startups
Re: Issue 426520 in chromium: Cleanup after adjusting the definition of
load competion
Re: Issue 164343 in chromium: Startups tests should measure Extension state
load
Re: Issue 445658 in chromium: update harfbuzz to 0.9.37
Re: Issue 440175 in chromium: Autotest should auto-lock and release DUTs in
bad TPM state
Issue 448580 in chromium: The media player plumbing for preload=metadata is
incorrect, resulting in preload=auto always being used for preload > none.
Re: Issue 447671 in chromium: Simply having internal Flash plug-in enabled
makes loading mercurynews.com janky and prevents scrolling until page fully
loaded
Re: Issue 447590 in chromium: --disk-cache-size=0 --media-cache-size=0
options are not respected
Re: Issue 447671 in chromium: Simply having internal Flash plug-in enabled
makes loading mercurynews.com janky and prevents scrolling until page fully
loaded
Re: Issue 426178 in chromium: [Mirror] Upgrade screen not sized for 6+
Re: Issue 433811 in chromium: Automatic reboot notifications fire at the
wrong time
Issue 448584 in chromium: Gather statistics for fonts that need
substitution in PDFs.
Re: Issue 417740 in chromium: Search Engine pointing to a chrome-extension
will crash Chrome
Re: Issue 440560 in chromium: Fix braille in text fields in ChromeVox Next
Issue 448585 in chromium: add version bitness in chrome://version
Issue 448586 in chromium: Increase GCM send message queue size
Issue 448587 in chromium: Autosave CC details locally after CVC check or
confirm with user on form submit
Re: Issue 431507 in chromium: Bad PDF rendering (characters overlap)
Re: Issue 448352 in chromium: Regression:Chrome browser crashes on
clicking 'settings' option from launcher in Win 8 mode.
Re: Issue 424456 in chromium: ftp:// format is not showing the data in the
folders I Open
Re: Issue 434903 in chromium: shill: set_wake_on_wifi should not ship with
production images
Issue 448588 in chromium: ARC: Unable to add attachment in FB messenger
Re: Issue 440560 in chromium: Fix braille in text fields in ChromeVox Next
Re: Issue 433811 in chromium: Automatic reboot notifications fire at the
wrong time
Re: Issue 436490 in chromium: Extra space on complex text
Re: Issue 445816 in chromium: Entering VT2 for too long glitches battery
indicator
Issue 448589 in chromium: Make sure recipes don't import anything dangerous
Re: Issue 448589 in chromium: Make sure recipes don't import anything
dangerous
Re: Issue 447038 in chromium: Global variables in recipes should be
immutable
Re: Issue 447231 in chromium: Cannot detach tab on Destop Linux
Re: Issue 447215 in chromium: Dragging a tab out of the tab strip to a new
window returns tab to original window.
Re: Issue 414527 in chromium: Implement new fullscreen behavior (v4)
Re: Issue 417463 in chromium: Replace OVERRIDE and FINAL with their C++11
counterparts
Re: Issue 447279 in chromium: Run browser_tests on chrome.chromeos bots for
official dev, beta, stable release candidates
Re: Issue 447231 in chromium: Cannot detach tab on Destop Linux
Re: Issue 447215 in chromium: Dragging a tab out of the tab strip to a new
window returns tab to original window.
Re: Issue 448347 in chromium: Regression: Unable to switch to second user
with same profile name from switch person overlay
Re: Issue 445913 in chromium: Snap to left keyboard shortcut snaps to right
on Swedish keyboard layout
Re: Issue 447886 in chromium: Chrome M41 for Chrome OS blocked due to lab
closure
Re: Issue 447836 in chromium: Blob stored in IndexedDB causes null result
from FileReader
Re: Issue 446239 in chromium: Specify in AutocompleteInput whether the
input is for a zero suggest call
Issue 448590 in chromium: MSAN crash:
virtual/gpu/canvas/philip/tests/toDataURL.jpeg.alpha.html
Re: Issue 448439 in chromium: HPKP should require quoted strings for pins
per the spec
Re: Issue 448407 in chromium: chrome.serial fails to connect to a device
that works with other serial comms systems, but only after cold boot
Re: Issue 448590 in chromium: MSAN crash:
virtual/gpu/canvas/philip/tests/toDataURL.jpeg.alpha.html
Re: Issue 445878 in chromium: Regression: Dropdown list appear chopped in
www.omegawatches.com.
Issue 448591 in chromium: ARC: FB messenger crashes while trying to open
chat head in group conversation
Re: Issue 448439 in chromium: HPKP should require quoted strings for pins
per the spec
Re: Issue 439882 in chromium: MacViews: Audit TOOLKIT_VIEWS #defines in
chrome
Re: Issue 446591 in chromium: [Freon] Failed to swap buffers after
entering/exiting mirror mode twice
Re: Issue 448532 in chromium: it is very hard to select the checkbox in
mail.yahoo.com
Issue 448592 in chromium: Get extension browsertests to pass in
--site-per-process mode
Re: Issue 447683 in chromium: A plug-in(Shockwave Flash)isn't responding
show up after resume from suspend
Issue 448593 in chromium: cros chrome-sdk command does not work for
board "auron_paine" and "auron_yuna"
Re: Issue 370433 in chromium: Move bookmarks component code in the
bookmarks namespace
Re: Issue 446212 in chromium: Not able to see Uber tray completely on left
shelf launcher position.
Re: Issue 447920 in chromium: Having the self in a position other than
bottom causes it to glitch on log-in
Re: Issue 447919 in chromium: omnibox almost never returns a manually
entered url when typing into it
--
--
Automated mail from issue updates at http://crbug.com/
Subscription options: http://groups.google.com/a/chromium.org/group/chromium-bugs

To unsubscribe from this group and stop receiving emails from it, send an email to chromium-bugs+***@chromium.org.
c***@googlecode.com
2015-01-14 18:01:49 UTC
Permalink
Your project notifications generated too many emails to send
individually. Here are the subject lines of the emails you would have
received:

Re: Issue 437733 in chromium: NSS incorrectly preferring a longer, weaker
chain over a shorter, stronger chain
Issue 448797 in chromium: Error 404
Re: Issue 447734 in chromium: Add cast audio only policy enforcement
Re: Issue 128523 in chromium: "Continue where I left off" no longer working
Issue 448800 in chromium: Scroll latency regression in M37 on some Android
devices
Issue 448801 in chromium: Incorrect values
Issue 448802 in chromium: Chromecast hitting thread I/O restrictions with
ozone-platform=egltest
Re: Issue 448801 in chromium: Incorrect values
Re: Issue 312586 in chromium: Replace embedding resources by ad hoc Python
with GRD resources
Re: Issue 448800 in chromium: Scroll latency regression in M37 on some
Android devices
Re: Issue 448800 in chromium: Scroll latency regression in M37 on some
Android devices
Re: Issue 448755 in chromium: error when opening the specified .doc file
Re: Issue 448801 in chromium: Incorrect result when a double precision
value gets assigned to AudioParam
Re: Issue 421244 in chromium: backlight tool flags now require "=" for
arguments that set values where under gflags it didn't.
Re: Issue 448209 in chromium: WaveShaperNode.oversample is defined to throw
errors but doesn't.
Re: Issue 446184 in chromium: Ensure ozone cursor handling is unaffected by
UI jank
Re: Issue 447046 in chromium: Set "On startup" pages but it's not working
Re: Issue 383239 in chromium: perf bisect tools are broken
Re: Issue 448797 in chromium: Error 404
Re: Issue 448775 in chromium: HWTest connection errors on link_freon-release
Re: Issue 410789 in chromium: DevTools: choose port-forwarding browser
wisely
Re: Issue 448619 in chromium: Chrome not working on Wifi connection behind
proxy
Issue 448806 in chromium: Power_LoadTest: update video portion of the test
Re: Issue 434215 in chromium: chrome.bluetooth.startDiscovery() can fail
with the unhelpful message "Starting discovery failed"
Re: Issue 402293 in chromium: "Google Chrome" process hangs (100% CPU) on
Mac OS X 10.9.4 when opening economist.com
Re: Issue 448633 in chromium: Chrome OS: screen unlock always bring me to
the 1st user's window
Re: Issue 448755 in chromium: error when opening the specified .doc file
Re: Issue 448800 in chromium: Scroll latency regression in M37 on some
Android devices
Issue 448809 in chromium: The bottom of the website page is cut off in
Chrome
Re: Issue 448775 in chromium: HWTest connection errors on link_freon-release
Re: Issue 448801 in chromium: Incorrect result when a double precision
value gets assigned to AudioParam
Re: Issue 448775 in chromium: HWTest connection errors on link_freon-release
Re: Issue 443567 in chromium: Regression: 'Ctrl+Shift+I' keyboard shortcut
does not work properly for gmail new message.
Re: Issue 448775 in chromium: HWTest connection errors on link_freon-release
Re: Issue 448775 in chromium: HWTest connection errors on link_freon-release
Re: Issue 443611 in chromium: Chromium Watefalls Miss Commits
Re: Issue 448775 in chromium: HWTest connection errors on link_freon-release
Re: Issue 448775 in chromium: HWTest connection errors on link_freon-release
Re: Issue 448775 in chromium: HWTest connection errors on link_freon-release
Re: Issue 448791 in chromium: User profile icon no longer appears in UI
Re: Issue 448775 in chromium: HWTest connection errors on link_freon-release
Re: Issue 448775 in chromium: HWTest connection errors on link_freon-release
Re: Issue 448775 in chromium: HWTest connection errors on link_freon-release
Re: Issue 448775 in chromium: HWTest connection errors on link_freon-release
Re: Issue 448775 in chromium: HWTest connection errors on link_freon-release
Re: Issue 448633 in chromium: Chrome OS: screen unlock always bring me to
the 1st user's window
Re: Issue 440818 in chromium: Remove USE_ATHENA code when compiling chrome
Re: Issue 448775 in chromium: HWTest connection errors on link_freon-release
Re: Issue 448775 in chromium: HWTest connection errors on link_freon-release
Issue 448810 in chromium: Bookmarks being moved to folder automatically
Re: Issue 447340 in chromium: Bluetooth audio is unusable if you switch off
the audio device, and then switch it back on again
Re: Issue 386847 in chromium: Update telemetry ref bots after blink.console
change lands in chromium.
Re: Issue 389215 in chromium: Video on twitch.tv pegs the CPU
Re: Issue 437733 in chromium: NSS incorrectly preferring a longer, weaker
chain over a shorter, stronger chain
Re: Issue 383716 in chromium: Bisect bot should verify suspected culprit by
comparing ToT with and without patch
Re: Issue 352287 in chromium: AppShell: Support the webview tag API
Re: Issue 352293 in chromium: Move webview API to //extensions
Re: Issue 437733 in chromium: NSS incorrectly preferring a longer, weaker
chain over a shorter, stronger chain
Re: Issue 440250 in chromium: page_cycler.typical_25 flakily fails on
Barnes & Noble on Linux Perf (2)
Re: Issue 190499 in chromium: Shorten power timeouts when at lock screen
Re: Issue 386847 in chromium: Update telemetry ref bots after blink.console
change lands in chromium.
Re: Issue 424225 in chromium: Chrome for Android fails Acid2
Re: Issue 352293 in chromium: Move webview API to //extensions
Re: Issue 425586 in chromium: Devtools touch emulation should use
platform-tailored gesture configuration constants
Re: Issue 137652 in chromium: sbox_integration_test and
sbox_validation_test failed flakily
Re: Issue 146944 in chromium: FilePolicyTest.TestReparsePoint is flaky
Re: Issue 431692 in chromium: Report top 10 tasks blocking BeginMainFrame
Re: Issue 403648 in chromium: chrome.appViewInternal is not available
warning when launching app_shell
Re: Issue 446837 in chromium: Unable to detect the mobile network on
inserting Dongle.
Re: Issue 447267 in chromium: Cookies are not deleted when the last
incognito tab is closed
Re: Issue 423658 in chromium: Input field obscured by virtual keyboard when
typing into new hangouts app.
Re: Issue 173543 in chromium: Prioritize touch event handling on Blink
MessageLoop
Re: Issue 433811 in chromium: Automatic reboot notifications fire at the
wrong time
Re: Issue 440579 in chromium: Need a system for testing accessibility events
Re: Issue 424655 in chromium: Slimming GraphicsContext
Re: Issue 445097 in chromium: Mark
inspector-protocol/timeline/timeline-dispatchEvent.html as flaky
Re: Issue 447247 in chromium: Brillo SDK: implement CLI for log access
Re: Issue 444845 in chromium: Unresponsiveness when a lot of images are
linked
Re: Issue 410789 in chromium: DevTools: choose port-forwarding browser
wisely
Re: Issue 448156 in chromium: git cl format makes an incorrect fix.
Re: Issue 401598 in chromium: ozone: fix maximize mode event blocking
Re: Issue 447267 in chromium: Cookies are not deleted when the last
incognito tab is closed
Re: Issue 443491 in chromium: Regression: Focus jumps back to already
edited name field instead of next field in
chrome://settings/autofillEditAddress.
Re: Issue 441687 in chromium: Poor quality H.264 video Chromebook ->
Chromebook for both parties.
Re: Issue 448782 in chromium: git cl format wrong indentation
Re: Issue 448800 in chromium: Scroll latency regression in M37 on some
Android devices
Re: Issue 436868 in chromium: Regression: Unable to drag out any search
engine data in "Manage Search Engine" overlay on Mac Retina OS.
Re: Issue 448768 in chromium: Ash tray bubble not updated when VPN
connection fails
Re: Issue 448073 in chromium: Deploy buildbucket to chromium masters
Issue 448815 in chromium: buffet: Crash on duplicate command definitions
found
Re: Issue 409916 in chromium: SVG background-images blurry under certain
circumstances
Re: Issue 448165 in chromium: Remove chrome.pushMessaging code from Chrome
Re: Issue 447455 in chromium: Google Now component pushMessaging => GCM
Re: Issue 447994 in chromium: ARIA listitems not exposed correctly
Re: Issue 440549 in chromium: Google Chrome Auto-Update Not working
consistently / Google Update GPO policy not honored.
Re: Issue 91182 in chromium: ContentSettings: click-to-play
Re: Issue 445589 in chromium: Re-enable simple code path for vertical flow
when HarfBuzz is not required until HarfBuzz resolves performance issue for
East Asian scripts
Issue 448817 in chromium: Obtain confidence score based off results only
Re: Issue 448817 in chromium: Obtain confidence score based off last known
good and first known bad revision results.
Re: Issue 436553 in chromium: light theme-color + https looks bad
--
--
Automated mail from issue updates at http://crbug.com/
Subscription options: http://groups.google.com/a/chromium.org/group/chromium-bugs

To unsubscribe from this group and stop receiving emails from it, send an email to chromium-bugs+***@chromium.org.
c***@googlecode.com
2015-01-14 19:33:57 UTC
Permalink
Your project notifications generated too many emails to send
individually. Here are the subject lines of the emails you would have
received:

Issue 448834 in chromium: When recording Memory.* histograms, a lot more
work is done than is needed
Re: Issue 448800 in chromium: Scroll latency regression in M37 on some
Android devices
Re: Issue 448800 in chromium: Scroll latency regression in M37 on some
Android devices
Re: Issue 440709 in chromium: no indication of "HTTP 500 Internal Server
Error" and blank page instead
Issue 448835 in chromium: FR: Hide the profiles button for users with only
one profile
Re: Issue 442344 in chromium: Improve Chrome NTP load time
Re: Issue 446724 in chromium: Shelf icon dragging is backwards in RTL
languages
Re: Issue 448537 in chromium: Displays black screen if device idle for some
time.
Re: Issue 448440 in chromium:
virtual/deferred/inspector/tracing/timeline-script-tag-1.html failed on
mac/linux
Re: Issue 448782 in chromium: git cl format wrong indentation
Re: Issue 447922 in chromium: Shelf status area is mis-aligned in RTL
languages
Re: Issue 442344 in chromium: Improve Chrome NTP load time
Re: Issue 448156 in chromium: git cl format makes an incorrect fix.
Re: Issue 371199 in chromium: Images are not displaying when browser window
is maximized.
Re: Issue 448835 in chromium: FR: Hide the profiles button for users with
only one profile
Re: Issue 431692 in chromium: Report top 10 tasks blocking BeginMainFrame
Re: Issue 443519 in chromium: Change the way open tabs are stored
Re: Issue 442344 in chromium: Improve Chrome NTP load time
Re: Issue 443519 in chromium: Change the way open tabs are stored
Re: Issue 448004 in chromium: DevTools Styles documentation error
Issue 448836 in chromium: Remove USE_ATHENA ifdefs from
chrome/browser/chromeos
Re: Issue 440818 in chromium: Remove USE_ATHENA code when compiling chrome
Re: Issue 448836 in chromium: Remove USE_ATHENA ifdefs from
chrome/browser/chromeos
Re: Issue 426512 in chromium: OOPIF: Make SecurityContexts available for
RemoteFrames
Re: Issue 422522 in chromium: Chrome: Crash Report - [Renderer hang]
content::RenderThreadImpl::GetAudioHardwareConfig
Re: Issue 443418 in chromium: Chameleon: Implement display_NoEdid test
Re: Issue 443096 in chromium: Browser launches in the background of login
screen
Re: Issue 448004 in chromium: DevTools Styles documentation error
Re: Issue 448004 in chromium: DevTools Styles documentation error
Re: Issue 443519 in chromium: Change the way open tabs are stored
Re: Issue 123489 in chromium: Chrome forgets open tabs after an update
Re: Issue 448537 in chromium: Displays black screen if device idle for some
time.
Re: Issue 447795 in chromium: Add support for extra command line flags to
app_shell_launcher
Re: Issue 423587 in chromium: OOPIF: RenderFrameProxies not created in all
SiteInstances when adding a cross-site frame
Re: Issue 447267 in chromium: Cookies are not deleted when the last
incognito tab is closed
Re: Issue 448537 in chromium: Displays black screen if device idle for some
time.
Issue 448838 in chromium: Implement QUIC-based protocol for chromoting
Re: Issue 387490 in chromium: Pepper flash doesnt work on some sites on
Linux (32 and 64 bit, mesa 8 and latest git)
Re: Issue 443096 in chromium: Browser launches in the background of login
screen
Re: Issue 402993 in chromium: Use SCTP instead of PseudoTCP
Re: Issue 448839 in chromium: 2%-2.9% regression in page_cycler.intl_hi_ru
at 311456:311460
Issue 448839 in chromium: 2%-2.9% regression in page_cycler.intl_hi_ru at
311456:311460
Re: Issue 403619 in chromium: User Manager UI is inconvenient for switching
between profiles quickly.
Issue 448840 in chromium: android gn bot failing
Issue 448841 in chromium: Turn on memory optimizations by default
Re: Issue 434990 in chromium: Regression: Mouse click focus remains active
on the app icon when moved in chrome://apps.
Re: Issue 411667 in chromium: Can't drag tabs to new window or open links
in new window
Re: Issue 448840 in chromium: android gn bot failing
Re: Issue 448840 in chromium: android gn bot failing GOMA: Error /healthz
err=-2
Re: Issue 110449 in chromium: The request to /favicon.ico doesn't appear in
the network tab of developer tools
Re: Issue 448830 in chromium: Fails to open Zip file on M41
Re: Issue 448844 in chromium: 18.5%-24.7% regression in
startup.cold.blank_page at 311253:311261
Issue 448844 in chromium: 18.5%-24.7% regression in startup.cold.blank_page
at 311253:311261
Re: Issue 447590 in chromium: --disk-cache-size=0 --media-cache-size=0
options are not respected
Re: Issue 411667 in chromium: Can't drag tabs to new window or open links
in new window
Re: Issue 438556 in chromium: Request pending forever after 302 redirect on
a particular domain
Re: Issue 442829 in chromium: [Resources] Add UMA stats to see how the
memory pressure handling helps
Re: Issue 448768 in chromium: Ash tray bubble not updated when VPN
connection fails
Re: Issue 411667 in chromium: Can't drag tabs to new window or open links
in new window
Re: Issue 410958 in chromium: DevTools: Have Chrome flag to automatically
open developer tools in new tabs
Re: Issue 448537 in chromium: Displays black screen if device idle for some
time.
Re: Issue 448214 in chromium: CryptoToken extension should only accept
requests from https origins
Re: Issue 334358 in chromium: chrome.downloads.getFileIcon ignores
devicePixelRatio
Re: Issue 447369 in chromium: Now Cards show cricket scores incorrectly.
Re: Issue 447732 in chromium: Add a UMA for when H/W to S/W decoder
fallback occurs.
Re: Issue 421063 in chromium: Enable loading V8's initial snapshot from
external files
Re: Issue 439661 in chromium: make V8 into a DLL (browser and pdf)
Re: Issue 426196 in chromium: Supply vector graphics
Issue 448845 in chromium: Support for "obsolete" tag for histograms suffixes
Re: Issue 417463 in chromium: Replace OVERRIDE and FINAL with their C++11
counterparts
Re: Issue 448158 in chromium: cros pinchrome documentation
Re: Issue 429843 in chromium: Layout Test
media/video-controls-with-cast-rendering.html is flaky
Re: Issue 444916 in chromium: Add UMA for evaluating usefulness of
delta-encoding
Re: Issue 380729 in chromium: UMA data for media protocols not recorded on
Android
Re: Issue 448544 in chromium: ChromeVox no longer reads math on Wikipedia.
Re: Issue 448846 in chromium: 6%-22.1% regression in
image_decoding.image_decoding_measurement at 311283:311333
Issue 448846 in chromium: 6%-22.1% regression in
image_decoding.image_decoding_measurement at 311283:311333
Re: Issue 448537 in chromium: Displays black screen if device idle for some
time.
Re: Issue 246011 in chromium: Requests for media ignore proxy settings
Re: Issue 435102 in chromium: API request: Provide a possibility to change
the priority of render process on Android
Re: Issue 448847 in chromium: ARC: UI of background app doesn't change
until it gets focus
Issue 448847 in chromium: ARC: UI of background app doesn't change until it
gets focus
Re: Issue 94143 in chromium: incorrect handling of form submit or maybe
incorrect handling of http response code 204
Re: Issue 446368 in chromium: Move clang/win bots to recipes
Re: Issue 446267 in chromium: Google Maps blank on linux
Re: Issue 448784 in chromium: DevTools: inspect shows wrong element size
Re: Issue 397789 in chromium: After a period of time, all images stop
loading, report (pending) in network tab. Event hangs on --> delegate_info
= "ResourceScheduler"
Re: Issue 435093 in chromium: translation: pause download in french
Re: Issue 448537 in chromium: Displays black screen if device idle for some
time.
Re: Issue 371199 in chromium: Images are not displaying when browser window
is maximized.
Re: Issue 445697 in chromium: Regression: Virtual keyboard disappears
immediately and does not allow user to add recipients in gmail.
Re: Issue 448447 in chromium: Implement
PictureImageLayer::PaintContentsToDisplayList
Re: Issue 334358 in chromium: chrome.downloads.getFileIcon ignores
devicePixelRatio
Re: Issue 447932 in chromium: Regression : On mouse hovering weird
overlapping of app names seen in app launcher
Re: Issue 410789 in chromium: DevTools: choose port-forwarding browser
wisely
Issue 448849 in chromium: All your V1 Packaged Apps are now Extensions
Re: Issue 403823 in chromium: Extension Toolbar Redesign
Re: Issue 436810 in chromium: Blank print preview dialog after "using print
with system dialog".
Re: Issue 448184 in chromium: [Chaos] Perform backup of VM on Z620 Linux box
Issue 448850 in chromium: Pages stop rendering after scrolling down far
enough
--
--
Automated mail from issue updates at http://crbug.com/
Subscription options: http://groups.google.com/a/chromium.org/group/chromium-bugs

To unsubscribe from this group and stop receiving emails from it, send an email to chromium-bugs+***@chromium.org.
Continue reading on narkive:
Loading...