Discussion:
100 messages from Google Code
(too old to reply)
c***@googlecode.com
2013-01-02 19:20:53 UTC
Permalink
Your project notifications generated too many emails to send
individually. Here are the subject lines of the emails you would have
received:

Re: Issue 167837 in chromium: Chromium crashes on mac os snow leopard
Re: Issue 167445 in chromium: Chrome "idles" at 3-5% cpu, on the audio
thread
Re: Issue 166971 in chromium: Background app/Notification don't show up in
Task Manager as a process
Re: Issue 166930 in chromium: Extension: Instagram for Chrome crashes
Re: Issue 167007 in chromium: InstantExtended: with Instant off on a
committed SRP, deleting the text in the omnibox blanks page
Re: Issue 167554 in chromium: Caps Lock (Alt+Search) not shown in keyboard
overlay
Re: Issue 167996 in chromium: Update ninja binaries in depot_tools to ninja
1.1.0
Re: Issue 118149 in chromium: Page loads then immediately disappears --
ERROR:gles2_cmd_decoder.cc(4725) in Console
Re: Issue 163853 in chromium: SVG Filters: feDisplacementMap with
primitiveUnits="objectBoundingBox" mispositions transformed content
Re: Issue 167237 in chromium: Need way to remap CapsLock key
Issue 168009 in chromium: Slots API for multiple prerenders
Re: Issue 167996 in chromium: Update ninja binaries in depot_tools to ninja
1.1.0
Re: Issue 167837 in chromium: Chromium crashes on mac os snow leopard
Re: Issue 167663 in chromium: Cannot navigate past certificate error
Re: Issue 168007 in chromium: Chrome icon in launcher does nothing when a
window is open
Re: Issue 167326 in chromium: Record process creation times
Re: Issue 167837 in chromium: Chromium crashes on mac os snow leopard
Issue 168011 in chromium: WIndows render on top of the Ubuntu Unity
screensaver
Re: Issue 167313 in chromium: Failed to open a new tab when clicking on the
chrome icon on Taskbar
Re: Issue 168007 in chromium: Chrome icon in launcher does nothing when a
window is open
Re: Issue 160902 in chromium: Control and Shift modifiers do not work with
touches in bookmarks UI
Re: Issue 142524 in chromium: The Esc keypress that the user presses to
exit fullscreen can be used to reenter fullscreen.
Issue 168012 in chromium: Prerender Unit tests should be more aggressive
about leak detection
Re: Issue 152525 in chromium: Google Chrome freeze with no chance to scroll
down the page
Re: Issue 153428 in chromium: Unable to scroll some websites on Mac OS with
dual monitor setup
Re: Issue 166171 in chromium: [InstantExtended] [Mac OS]: Toolbar
(Omnibox, Tabstrip, etc) are missing on NewTabPage when you are in
Presentation Mode
Re: Issue 167291 in chromium: Find search box hidden behind main bar
Re: Issue 167996 in chromium: Update ninja binaries in depot_tools to ninja
1.1.0
Re: Issue 128079 in chromium: When multiple files are pinned, the uber tray
shows only 1 file syncing progress at a time
Issue 168013 in chromium: Stout: 'Diamond' key clears spreadsheet cell
Re: Issue 157961 in chromium: Display of CSS3 transformed area doesn't line
up with hit-testing area
Re: Issue 128079 in chromium: When multiple files are pinned, the uber tray
shows only 1 file syncing progress at a time
Re: Issue 168002 in chromium: Google drive sync says "syncing 1 file(s)"
when really syncing many (1 at a time)
Re: Issue 159648 in chromium: Collect histograms of IOSurface and GPU
memory usage
Issue 168014 in chromium: Windows render on top of the Ubuntu Unity
screensaver
Issue 168015 in chromium: Can't tell accounts apart with the same name
Re: Issue 167505 in chromium: A CSS3 display bug which may relevant to the
transform
Re: Issue 160902 in chromium: Control and Shift modifiers do not work with
touches in bookmarks UI
Issue 168016 in chromium: wallpaper images don't refresh after 1 click
Re: Issue 167937 in chromium: <input spellcheck="false"> still underlines
misspelled words, but does not provide suggestions
Re: Issue 154852 in chromium: Move libcros / dbus related chromeos code to
src/chromeos and deprecate cros_network_functions
Re: Issue 145129 in chromium: mp4 Video stops at the begining
Re: Issue 168016 in chromium: wallpaper images don't refresh after 1 click
Re: Issue 167996 in chromium: Update ninja binaries in depot_tools to ninja
1.1.0
Re: Issue 160902 in chromium: Control and Shift modifiers do not work with
touches in bookmarks UI
Re: Issue 154135 in chromium: [Tab Capture] Handle Flash full-screen
transitions
Re: Issue 160360 in chromium: Figure out a solution to invalid SQLite
schema.
Re: Issue 167996 in chromium: Update ninja binaries in depot_tools to ninja
1.1.0
Re: Issue 151841 in chromium: Broken database eliminates favicons from
bookmarkbar
Re: Issue 167721 in chromium: STDIO example behaved differently between
glibc and newlib
Re: Issue 168015 in chromium: Can't tell accounts apart with the same name
Re: Issue 168016 in chromium: wallpaper images don't refresh after 1 click
Re: Issue 166943 in chromium: Scrolling jumps to beginning of page.
Re: Issue 160902 in chromium: Control and Shift modifiers do not work with
touches in bookmarks UI
Re: Issue 168013 in chromium: Stout: 'Diamond' key clears spreadsheet cell
Re: Issue 163853 in chromium: SVG Filters: feDisplacementMap with
primitiveUnits="objectBoundingBox" mispositions transformed content
Re: Issue 167989 in chromium: Rendering issues of missing text and images
Re: Issue 168015 in chromium: Can't tell accounts apart with the same name
Issue 168018 in chromium: webrtc: video freezes when making call where both
sides use the same private network address
Re: Issue 158785 in chromium: setup.exe for chrome app host not found in
user directory
Re: Issue 167237 in chromium: Need way to remap CapsLock key
Issue 168019 in chromium: gcl commit fails: Server sent unexpected return
value
Re: Issue 167860 in chromium: Chrome hang in "Timed out waiting for login
prompt" 3x per day since Dec. 17
Re: Issue 168020 in chromium: Alt-Tab is difficult to use on extended
monitor setup (no indication which window was selected in some cases)
Issue 168021 in chromium: SharePoint 2010 Export to Excel
Issue 168022 in chromium: Crash: IBusAddressWatcher::Start when an input
method is enabled
Re: Issue 168013 in chromium: Stout: 'Diamond' key clears spreadsheet cell
Re: Issue 164273 in chromium: Enable tap dragging in Accessibility Settings?
Re: Issue 140977 in chromium: Change source code copyright policy again
Re: Issue 167138 in chromium: Crash running
WebRTCAudioDeviceTest.TestValidInputRates on linux_asan
Re: Issue 145129 in chromium: mp4 Video stops at the begining
Re: Issue 168013 in chromium: Stout: 'Diamond' key clears spreadsheet cell
Re: Issue 167937 in chromium: <input spellcheck="false"> still underlines
misspelled words, but does not provide suggestions
Re: Issue 163101 in chromium: Chromes becomes unresponsive after wasting
huge memory to load page
Re: Issue 168016 in chromium: wallpaper images don't refresh after 1 click
Re: Issue 167299 in chromium: WebRTCAudioDeviceTest.StartPlayout is flaky
Re: Issue 167298 in chromium: WebRTCAudioDeviceTest.PlayLocalFile is flaky
Re: Issue 162172 in chromium: Right-click twice in a row in different
places should open right-click menu in both
Re: Issue 167007 in chromium: InstantExtended: with Instant off on a
committed SRP, deleting the text in the omnibox blanks page
Re: Issue 167482 in chromium: Unable to scroll nested gmail message with
gestures
Re: Issue 167937 in chromium: <input spellcheck="false"> still underlines
misspelled words on google.com, but does not provide suggestions
Re: Issue 167991 in chromium: frequently not seeing Google home page
components in NTP with InstantExtended
Re: Issue 168016 in chromium: wallpaper images don't refresh after 1 click
Re: Issue 164645 in chromium: Can't build with NaCl enabled but no pnacl
Issue 168023 in chromium: Hiden titlebar not usable with touch.
Re: Issue 146014 in chromium: Add Android & CrOS specific curves
RenderWidgetHostView::CreateSmoothScrollGesture
Re: Issue 168013 in chromium: Stout: 'Diamond' key clears spreadsheet cell
Re: Issue 167482 in chromium: Unable to scroll nested gmail message with
gestures
Re: Issue 168022 in chromium: Crash: IBusAddressWatcher::Start when an
input method is enabled
Re: Issue 168013 in chromium: Stout: 'Diamond' key clears spreadsheet cell
Re: Issue 167201 in chromium: Scrolling desktop Gmail on Android is broken
Re: Issue 167991 in chromium: frequently not seeing Google home page
components in NTP with InstantExtended
Re: Issue 157184 in chromium: Chrome cuts off external URLs with hash symbol
Re: Issue 167485 in chromium: Misspelled words with underscores "_" do not
have spellchecker suggestions and options in Windows
Re: Issue 160268 in chromium: Scrolling benchmarks load account settings
page with --dont-override-profile
Re: Issue 168023 in chromium: Hiden titlebar not usable with touch.
Re: Issue 167783 in chromium: Crash in task manager,
TaskManagerModel::CompareValues
Re: Issue 168023 in chromium: Hiden titlebar not usable with touch.
Re: Issue 168016 in chromium: wallpaper images don't refresh after 1 click
Re: Issue 167982 in chromium: Every web page constantly refreshes google
search page
--
Automated mail from issue updates at http://crbug.com/
Subscription options: http://groups.google.com/a/chromium.org/group/chromium-bugs
c***@googlecode.com
2013-01-02 21:04:54 UTC
Permalink
Your project notifications generated too many emails to send
individually. Here are the subject lines of the emails you would have
received:

Re: Issue 167445 in chromium: Chrome "idles" at 3-5% cpu, on the audio
thread
Issue 168032 in chromium: File Manager: breadcrumbs getting unnecessarily
ellipsified
Issue 168033 in chromium: When transferring files, don't suspend.
Re: Issue 168001 in chromium: Range sliders often can't be manipulated with
touch
Issue 168034 in chromium: ERR_INVALID_AUTH_CREDENTIALS when authenticating
with IIS7.5
Re: Issue 51404 in chromium: "Error 9 (net::ERR_UNEXPECTED): Unknown
error." / Error 338 (net::ERR_INVALID_AUTH_CREDENTIALS) while behind a proxy
Re: Issue 167445 in chromium: Chrome "idles" at 3-5% cpu, on the audio
thread
Re: Issue 167445 in chromium: Chrome "idles" at 3-5% cpu, on the audio
thread
Re: Issue 152149 in chromium: Touch detection returns false positives
[chrome 24+]
Re: Issue 89687 in chromium: Allow optional bypass of the NTP UI after app
install from the web store
Re: Issue 168034 in chromium: ERR_INVALID_AUTH_CREDENTIALS when
authenticating with IIS7.5
Re: Issue 167314 in chromium: 80.7% xp-release-dual-core/startup/warm/t
change after rev 174356
Re: Issue 167445 in chromium: Chrome "idles" at 3-5% cpu, on the audio
thread
Re: Issue 168030 in chromium: Webpages do not render completely sometimes
Re: Issue 168032 in chromium: File Manager: breadcrumbs getting
unnecessarily ellipsified
Issue 168035 in chromium: File Manager: Navigating gallery for photos
Drive, many thumbnails show up blank
Re: Issue 118149 in chromium: Page loads then immediately disappears --
ERROR:gles2_cmd_decoder.cc(4725) in Console
Re: Issue 168025 in chromium: Stale blue text in omnibox
Re: Issue 166428 in chromium: Getting Started screen is shown on each
Public Account login
Issue 168036 in chromium: Add win64 build files for libvpx
Re: Issue 157608 in chromium: Provide a per-app list of open windows
Re: Issue 168033 in chromium: When uploading files, don't suspend.
Re: Issue 152207 in chromium: System suspend should be deferred while
uploading large files
Issue 168037 in chromium: HTML5
Issue 168038 in chromium: File manager: Inappropriate blue "loading" cursor
shown when an image is loading
Re: Issue 167201 in chromium: Scrolling desktop Gmail on Android is broken
Re: Issue 168034 in chromium: ERR_INVALID_AUTH_CREDENTIALS when
authenticating with IIS7.5
Re: Issue 166925 in chromium: Youtube flash player settings cannot override
the chrome settings.
Issue 168039 in chromium: Add win64 build files for ffmpeg
Re: Issue 168036 in chromium: Add win64 build files for libvpx
Re: Issue 8606 in chromium: 64 bit chrome on Windows
Re: Issue 168039 in chromium: Add win64 build files for ffmpeg
Re: Issue 168032 in chromium: File Manager: breadcrumbs getting
unnecessarily ellipsified
Issue 168040 in chromium: Chrome OS devices UI freezes
Re: Issue 157866 in chromium: run_multipage_benchmark crash (Check failed:
command_line->HasSwitch(switches::kEnableStatsTable))
Re: Issue 100808 in chromium: Gmail Video chat doesnt show any video to me,
while remote party sees my video just fine.
Issue 168041 in chromium: File Manager: video error message rendering
improperly
Issue 168042 in chromium: Login screen bottom bar is misaligned
Re: Issue 168042 in chromium: Login screen bottom bar is misaligned
Re: Issue 168040 in chromium: Chrome OS devices UI freezes
Re: Issue 168018 in chromium: webrtc: video freezes when making call where
both sides use the same private network address
Re: Issue 167948 in chromium: Cloud print stops: all printers "offline"
Issue 168044 in chromium: CrOS: Browser tests simulate
login-after-browser-crash instead of login-from-login-screen
Re: Issue 167240 in chromium: BindToLoop/BindToCurrentLoop sometimes are
misleading
Re: Issue 167459 in chromium: Reduce the number of steps for a user to add
a webapp to the home screen with Chome for Android
Re: Issue 167777 in chromium: --simulate-touch-screen-with-mouse doesn't
work anymore
Re: Issue 167777 in chromium: --simulate-touch-screen-with-mouse doesn't
work anymore
Re: Issue 167948 in chromium: Cloud print stops: all printers "offline"
Re: Issue 160985 in chromium: MutationObserver leaks memory
Re: Issue 159193 in chromium: Move URLRequestContext getters from Profile
into StoragePartition
Re: Issue 168034 in chromium: ERR_INVALID_AUTH_CREDENTIALS when
authenticating with IIS7.5
Re: Issue 167866 in chromium: Memory leak at
prerender::UnitTestPrerenderManager::CreateNextPrerenderContents from
LinkManagerWaitToLaunchNotLaunched
Re: Issue 167663 in chromium: Cannot navigate past certificate error
Re: Issue 167554 in chromium: Caps Lock (Alt+Search) not shown in keyboard
overlay
Re: Issue 164273 in chromium: Enable tap dragging in Accessibility Settings?
Re: Issue 159193 in chromium: Move URLRequestContext getters from Profile
into StoragePartition
Re: Issue 168022 in chromium: Crash: IBusAddressWatcher::Start when an
input method is enabled
Re: Issue 159193 in chromium: Move URLRequestContext getters from Profile
into StoragePartition
Re: Issue 131780 in chromium: Keypad locks up on text boxes
Re: Issue 165266 in chromium: One-click sign in bar does not surface after
signing in to Google accounts.
Re: Issue 167021 in chromium: Surfaces with perspective are fuzzy on device
scale factor > 1
Re: Issue 157763 in chromium: 30% regression in first paint when WebKit's
resource scheduler is disabled
Re: Issue 166650 in chromium: GCP Print Ticket not correctly serialized
Re: Issue 167615 in chromium: Hello World example broken in SDK
Re: Issue 161337 in chromium: Async texture upload primitive
Re: Issue 163228 in chromium: Reverse-video text is rendered poorly on
Hi-DPI devices
Re: Issue 167082 in chromium: Revert unintended changes to
third_party/tcmalloc on 1364 branch.
Re: Issue 167445 in chromium: Chrome "idles" at 3-5% cpu, on the audio
thread
Re: Issue 167366 in chromium: net-internals event log broken if async DNS
is enabled
Re: Issue 153066 in chromium: Revise bookmarking flow to include feature to
add to homescreen
Re: Issue 166172 in chromium: Large number of minidump too large crashes in
25
Re: Issue 168034 in chromium: ERR_INVALID_AUTH_CREDENTIALS when
authenticating with IIS7.5
Re: Issue 168039 in chromium: Add win64 build files for ffmpeg
Re: Issue 167485 in chromium: Misspelled words with underscores "_" do not
have spellchecker suggestions and options
Re: Issue 118149 in chromium: Page loads then immediately disappears --
ERROR:gles2_cmd_decoder.cc(4725) in Console
Re: Issue 164003 in chromium: Crashes in predictor database probably from
access during shutdown.
Re: Issue 163925 in chromium: Your profile could not be opened correctly.
on first run
Issue 168045 in chromium: Chromoting session is dropped if host computer is
heavily loaded
Re: Issue 167554 in chromium: Caps Lock (Alt+Search) not shown in keyboard
overlay
Re: Issue 155072 in chromium: Chromoting web-app should degrade gracefully
on Win8 Immersive
Re: Issue 134600 in chromium: Progress bars in (lower right) status area
should have Kennedy style
Re: Issue 158785 in chromium: setup.exe for chrome app host not found in
user directory
Re: Issue 161713 in chromium: Audio stops loading after ~60s of pause
Re: Issue 166056 in chromium: disconnect_window_win.cc needs some TLC.
Re: Issue 166571 in chromium: Cloud print connector ignores duplex option.
Re: Issue 167813 in chromium: Tile prioritization doesn't adequately
prioritize low-res tiles
Re: Issue 166543 in chromium: Java Script Full Screen API doesn't work
correctly
Re: Issue 167021 in chromium: Surfaces with perspective are fuzzy on device
scale factor > 1
Re: Issue 167021 in chromium: Surfaces with perspective are fuzzy on device
scale factor > 1
Re: Issue 118149 in chromium: Page loads then immediately disappears --
ERROR:gles2_cmd_decoder.cc(4725) in Console
Re: Issue 164003 in chromium: Crashes in predictor database probably from
access during shutdown.
Re: Issue 167021 in chromium: Surfaces with perspective are fuzzy on device
scale factor > 1
Re: Issue 165307 in chromium: DOM objects don't have stable NPObject*
references
Re: Issue 164438 in chromium: Remove "New Tab" option from v2 apps.
Re: Issue 167136 in chromium: Launcher items for pinned v2 Apps have a New
Tab option in the context menu
Re: Issue 166385 in chromium: Pressing tab in a new tab page focus is
staying back within the omni-box and not navigated across the tabs.
Re: Issue 164438 in chromium: Remove "New Tab" option from v2 apps.
Re: Issue 166683 in chromium: Downloads stuck and unclickable in Downloads
stack on OS X
Issue 168047 in chromium: Input languages should be synced
Re: Issue 114091 in chromium: Regression - Aw Snap is shown for the Mouse
Lock application.
--
Automated mail from issue updates at http://crbug.com/
Subscription options: http://groups.google.com/a/chromium.org/group/chromium-bugs
c***@googlecode.com
2013-01-03 22:16:52 UTC
Permalink
Your project notifications generated too many emails to send
individually. Here are the subject lines of the emails you would have
received:

Re: Issue 166992 in chromium: No/insufficient draw attention behavior on
Chrome OS panels
Re: Issue 168158 in chromium: GamePad API broken (can't find flag)
Re: Issue 42819 in chromium: Does not render valid XHTML-MP 1.0
Re: Issue 109913 in chromium: KDE file save dialog does not have the "save
as full webpage" option
Re: Issue 168158 in chromium: GamePad API broken (can't find flag)
Re: Issue 165493 in chromium: Virtual GL contexts result in flickering/out
of order rendering on Nexus 4
Re: Issue 165753 in chromium: You have used the extension ".json" at the
end of the name. The standard extension is ".(null)"
Re: Issue 166523 in chromium: [Mac] apprtc crashes when output sampling
rate set to 96000 Hz
Re: Issue 167367 in chromium: [zoom bubble] make UI presentable in
fullscreen mode on views
Re: Issue 165627 in chromium: Error "CRX_MAGIC_NUMBER_INVALID" appears
while installing extensions
Issue 168236 in chromium: Indicate which keys are pressed when pairing
Bluetooth keyboard
Re: Issue 60375 in chromium: docs.google.com : "Arrow buttons and drop down
menu" don't appear on the Presentation page when opened for the first time.
Re: Issue 168139 in chromium: tcmalloc hang during fontconfig / expat
initialization fails tests 3x per day
Re: Issue 55602 in chromium: mail.googe.com : Image disappears when the
image drags and drops
Re: Issue 63521 in chromium: hotels.com : The Calendar popup image doesn't
appear.
Re: Issue 167213 in chromium: PictureLayer should limit PicturePile to a
reasonable size
Re: Issue 168059 in chromium: Chrome Buildbot Monitor shows "?" icon always.
Re: Issue 14307 in chromium: [hi5.com]: minor layout issue
Re: Issue 125106 in chromium: A Linux Aura desktop browser
Issue 168238 in chromium: Rounded rectangles on high DPI displays show the
background color at the corners
Re: Issue 154995 in chromium:
DownloadExtensionTest.DownloadExtensionTest_FileIcon_Active is a bit flaky
Re: Issue 161828 in chromium: Investigate JSGameBench performance
Re: Issue 38573 in chromium: Missing Buttons/Links
Re: Issue 158518 in chromium: Use Fling Gestures in Scrolling Benchmarks
Re: Issue 66142 in chromium: Twitter: scrolling Top Tweets overlap bottom
banner on page
Issue 168239 in chromium: Shockwave Flash has crashed message from a
youtube.com
video.(content::VaapiH264Decoder::FillVAPicture(_VAPictureH264*,
content::H264Picture*)-4D88BAD)
Issue 168240 in chromium: Shockwave Flash has crashed message from a
youtube.com
video.(content::VaapiH264Decoder::FillVAPicture(_VAPictureH264*,
content::H264Picture*)-4D88BAD)
Re: Issue 168115 in chromium: Chromoting client resends transport-info
messages for the same candidates.
Re: Issue 166703 in chromium: Spaceport benchmark is flaky on windows
Re: Issue 168139 in chromium: tcmalloc hang during fontconfig / expat
initialization fails tests 3x per day
Re: Issue 168173 in chromium:
KeyframedAnimationCurveTest.OneTransformKeyframe is segfaulting
Re: Issue 168220 in chromium: during SKP serialization, encode SkBitmaps to
PNG
Re: Issue 168238 in chromium: Rounded rectangles on high DPI displays show
the background color at the corners
Issue 168241 in chromium: Canvas 'getContext' malfunction
Re: Issue 167138 in chromium: Crash running
WebRTCAudioDeviceTest.TestValidInputRates on linux_asan
Re: Issue 167979 in chromium: [telemetry] User Agent causing problems on
cros
Re: Issue 75789 in chromium: www.facebook.com login times out
Re: Issue 165382 in chromium: Random renderer hangs
Re: Issue 168238 in chromium: Rounded rectangles on high DPI displays show
the background color at the corners
Re: Issue 59651 in chromium: dropdown scrollbar doesn't work
Re: Issue 168240 in chromium: Shockwave Flash has crashed message from a
youtube.com
video.(content::VaapiH264Decoder::FillVAPicture(_VAPictureH264*,
content::H264Picture*)-4D88BAD)
Re: Issue 168240 in chromium: Shockwave Flash has crashed message from a
youtube.com
video.(content::VaapiH264Decoder::FillVAPicture(_VAPictureH264*,
content::H264Picture*)-4D88BAD)
Re: Issue 168240 in chromium: Shockwave Flash has crashed message from a
youtube.com
video.(content::VaapiH264Decoder::FillVAPicture(_VAPictureH264*,
content::H264Picture*)-4D88BAD)
Re: Issue 168239 in chromium: Shockwave Flash has crashed message from a
youtube.com
video.(content::VaapiH264Decoder::FillVAPicture(_VAPictureH264*,
content::H264Picture*)-4D88BAD)
Re: Issue 130850 in chromium: CSS animations use significant CPU resources
even when not visible
Re: Issue 168240 in chromium: Shockwave Flash has crashed message from a
youtube.com
video.(content::VaapiH264Decoder::FillVAPicture(_VAPictureH264*,
content::H264Picture*)-4D88BAD)
Re: Issue 167213 in chromium: PictureLayer should limit PicturePile to a
reasonable size
Re: Issue 92600 in chromium: Chrome cannot open very long pages
Re: Issue 168173 in chromium:
KeyframedAnimationCurveTest.OneTransformKeyframe is segfaulting
Re: Issue 167138 in chromium: Crash running
WebRTCAudioDeviceTest.TestValidInputRates on linux_asan
Re: Issue 95648 in chromium: Rendering bullets far to the left in centered
UL
Re: Issue 167144 in chromium: Scrollable touch event handler on
www.theverge.com isn't included in the touchEventHandlerRegion
Re: Issue 136110 in chromium: update reference build for DOMCore test
Re: Issue 164763 in chromium: 30% regression in BrowserMark2 benchmark
Re: Issue 33169 in chromium: Hebrew diacritic marks not rendered correctly
on Linux
Re: Issue 167138 in chromium: Crash running
WebRTCAudioDeviceTest.TestValidInputRates on linux_asan
Re: Issue 102999 in chromium: heise.de/ix extremely slow
Re: Issue 119379 in chromium: Crashes on Google-issued Macs with
__THE_SYSTEM_HAS_NO_PORT_SETS_AVAILABLE__
Re: Issue 168240 in chromium: Shockwave Flash has crashed message from a
youtube.com
video.(content::VaapiH264Decoder::FillVAPicture(_VAPictureH264*,
content::H264Picture*)-4D88BAD)
Re: Issue 104523 in chromium: progress bar doesn't appear when uploading on
Linux platform in gmail
Re: Issue 168059 in chromium: Chrome Buildbot Monitor shows "?" icon always.
Re: Issue 168241 in chromium: Canvas 'getContext' malfunction
Re: Issue 122145 in chromium: Canvas not rendering Flot charting library
bar graphs properly
Issue 168242 in chromium: Rename cc::ResourcePool to FreeList
Re: Issue 158850 in chromium: Renderer crash in
cc::ThreadProxy::setDeferCommits
Re: Issue 165382 in chromium: Random renderer hangs
Re: Issue 91580 in chromium: Modes when clicking on html5/flash videos
multiple times are pause, play, shrink, full screen
Re: Issue 96819 in chromium: canvas image shadows don't work properly
Re: Issue 168135 in chromium: middle mouse copy buffer doesn't propagate
across clients
Re: Issue 153686 in chromium: Script bubble: internationalization
Re: Issue 160500 in chromium: JumpList::StartLoadingFavicon tying up file
thread at startup
Re: Issue 167979 in chromium: [telemetry] User Agent causing problems on
cros
Re: Issue 168232 in chromium: Need a webrtc-internals page for debugging
WebRTC
Re: Issue 58831 in chromium: Allow individual SSL/TLS ciphersuites to be
enabled/disabled
Re: Issue 153972 in chromium: Script bubble: fonts
Re: Issue 168135 in chromium: middle mouse copy buffer doesn't propagate
across clients
Issue 168244 in chromium: ChromeLauncherControllerPerApp does not launch
unpinned apps
Re: Issue 168244 in chromium: ChromeLauncherControllerPerApp does not
launch unpinned apps
Re: Issue 167213 in chromium: PictureLayer should limit PicturePile to a
reasonable size
Re: Issue 167144 in chromium: Scrollable touch event handler on
www.theverge.com isn't included in the touchEventHandlerRegion
Re: Issue 153973 in chromium: Script Bubble: Text selectability
Re: Issue 167813 in chromium: Tile prioritization doesn't adequately
prioritize low-res tiles
Re: Issue 168112 in chromium: Side Swipe causes flicker of wrong tab
Re: Issue 168244 in chromium: ChromeLauncherControllerPerApp does not
launch unpinned apps
Re: Issue 166992 in chromium: No/insufficient draw attention behavior on
Chrome OS panels
Re: Issue 153726 in chromium: Color option is not shown in print dialog for
HP Photosmart C7200 series
Re: Issue 156680 in chromium: Choice of color not available in PrintPreview
dialog on HP Photosmart C309a
Re: Issue 168244 in chromium: ChromeLauncherControllerPerApp does not
launch unpinned apps
Re: Issue 165050 in chromium: Remote desktop - "Unexpected error" on Share
or Access
Re: Issue 125020 in chromium: Change VideoDecoder::Flush() implementations
to defer running the callback until after Flush() returns.
Re: Issue 108012 in chromium: IndexedDB should support storing File/Blob
objects
Re: Issue 162667 in chromium: Add a flag to exclude dependency on plugins
for Android
Re: Issue 168205 in chromium: depot_tools should detect it can't update and
complain
Re: Issue 168236 in chromium: Indicate which keys are pressed when pairing
Bluetooth keyboard
Re: Issue 151862 in chromium: Allow arbitrary key combinations to be sent
to the host.
Re: Issue 165968 in chromium: Rethink behavior of Omnibox when Ctrl-key is
pressed down
Re: Issue 167363 in chromium: Missing 'Older', 'Oldest', 'Newer', 'Newest'
link buttons under history page
Re: Issue 125687 in chromium: Pinch to zoom origin is sometimes top/left of
screen
Issue 168245 in chromium: nacl_bootstrap_raw complains about "command not
found"
Re: Issue 168210 in chromium: Set nominal physical display dimensions when
starting Chromoting virtual host
--
Automated mail from issue updates at http://crbug.com/
Subscription options: http://groups.google.com/a/chromium.org/group/chromium-bugs
c***@googlecode.com
2013-01-04 00:16:55 UTC
Permalink
Your project notifications generated too many emails to send
individually. Here are the subject lines of the emails you would have
received:

Re: Issue 154566 in chromium: Chrome won't open new tab.
Issue 168258 in chromium: Unable to play Ogg audio file in browser from
Google drive
Re: Issue 164636 in chromium: Make cc::Picture use TileGrid
Re: Issue 168240 in chromium: Shockwave Flash has crashed message from a
youtube.com
video.(content::VaapiH264Decoder::FillVAPicture(_VAPictureH264*,
content::H264Picture*)-4D88BAD)
Re: Issue 126911 in chromium: Fullscreen exit link incorrectly exits
browser full screen.
Re: Issue 155650 in chromium: IsFullscreenForBrowser() == FALSE when in
Browser and Tab fullscreen on Mac
Re: Issue 155642 in chromium: Exiting HTML5 Fullscreen incorrectly also
exits Browser fullscreen
Re: Issue 168258 in chromium: Unable to play Ogg audio file in browser from
Google drive
Re: Issue 167929 in chromium: Copy metadata from HTML pages when
using "Save to PDF"
Re: Issue 168217 in chromium: Photo import: be smarter about detecting
photos
Issue 168260 in chromium: Flaky AudioOutputControllerTest for Android builds
Re: Issue 168245 in chromium: nacl_bootstrap_raw complains about "command
not found"
Re: Issue 154713 in chromium: Download to /drive immediately closes the
download tray
Re: Issue 168027 in chromium: password dialog needed for printing with CUPS
and Authentication
Re: Issue 168160 in chromium: HTML5 Video - audio lagging and video freezing
Re: Issue 165050 in chromium: Remote desktop - "Unexpected error" on Share
or Access
Re: Issue 110421 in chromium: CSS Injection doesn't work with query string
parameter in the URL
Issue 168261 in chromium: Disable Instant Extended Incognito mode in M25
Re: Issue 131669 in chromium: Single Threaded tiled SkPicture playback
slower than untiled
Re: Issue 164636 in chromium: Make cc::Picture use TileGrid
Issue 168262 in chromium: Disable Instant Extended Incognito mode in M25
Re: Issue 155668 in chromium: Remove tick-based mouse wheel offset fields
Re: Issue 167383 in chromium: NaCl is broken on ARM
Re: Issue 168027 in chromium: password dialog needed for printing with CUPS
and Authentication
Re: Issue 167813 in chromium: Tile prioritization doesn't adequately
prioritize low-res tiles
Re: Issue 158170 in chromium: Chrome_Mac: Crash Report - Stack
Signature: HALPropertyListener_Call_Helper(long, void*...
Re: Issue 168261 in chromium: Disable Instant Extended Incognito mode in M25
Re: Issue 157216 in chromium: AudioRendererMixerManager shouldn't rely on a
static hardware configuration.
Re: Issue 168262 in chromium: Disable Instant Extended Incognito mode in M25
Issue 168264 in chromium: "n bytes" not "0 KB"
Issue 168263 in chromium: chrome.extension event listeners in
content/executed scripts should be removed on uninstall
Re: Issue 168261 in chromium: Disable Instant Extended Incognito mode in M25
Re: Issue 168262 in chromium: Disable Instant Extended Incognito mode in M25
Re: Issue 168261 in chromium: Disable Instant Extended Incognito mode in M25
Re: Issue 168182 in chromium: Chrome (flash video player) doesn't change
output audio device when we changing default playback device in system
settings
Re: Issue 157459 in chromium: ReplayServer (wpr_server.py) is flaky.
Re: Issue 165050 in chromium: Remote desktop - "Unexpected error" on Share
or Access
Re: Issue 166739 in chromium: requestAutocomplete dialog needs slightly
fancy menu
Re: Issue 167989 in chromium: Missing text and images on flightaware.com
Re: Issue 166548 in chromium: Multiple banners get stuck
Issue 168266 in chromium: Insert blank USB, photo import flashes
Re: Issue 168172 in chromium: Flash crashed consistently
Re: Issue 167101 in chromium: AutofillAgent needs the ability to click on
elements
Re: Issue 168169 in chromium: Returning Javascript results should be via
base::Callback, not NOTIFICATION_EXECUTE_JAVASCRIPT_RESULT
Re: Issue 167979 in chromium: [telemetry] User Agent causing problems on
cros
8 issues changed in chromium
Re: Issue 167830 in chromium: [Autofill] Native popup UI does not clear
previewed form when popup is closed
Re: Issue 136110 in chromium: update reference build for DOMCore test
Re: Issue 160595 in chromium: launcher takes too long to appear
Re: Issue 160595 in chromium: launcher takes too long to appear
Issue 168268 in chromium: Don't "download to Drive" when downloading from
drive.google.com + Drive is your default download destination
Re: Issue 168139 in chromium: tcmalloc hang during fontconfig / expat
initialization fails tests 3x per day
Re: Issue 5443 in chromium: www.millenet.pl gets caught in redirect loop
for chromium's user agent
Re: Issue 157474 in chromium: Remove header restrictions for XHR
Re: Issue 157357 in chromium: RenderViewImplTest.LastCommittedUpdateState
is flaky
Re: Issue 167310 in chromium: Script bubble not actually disabled by default
Re: Issue 166910 in chromium: Sideload wipeout bubble does not list 7
extensions correctly
Re: Issue 167726 in chromium: Chrome for Android sometimes closes itself if
I re-open it immediately after quiting it.
Re: Issue 167266 in chromium: Font rendering defect: letter g is not
rendered properly
Re: Issue 164528 in chromium: duplicate autofill values don't collapse
Re: Issue 167094 in chromium: Windows AppList initialization tries to do IO
on the UI thread via the ProfileManager
Re: Issue 164262 in chromium: Show launcher when nothing else is running
Re: Issue 162320 in chromium: Wrong devanagari font rendering
Re: Issue 164528 in chromium: duplicate autofill values don't collapse
Re: Issue 167383 in chromium: NaCl is broken on ARM
Issue 168270 in chromium: ChunkDemuxer should not fire read callback
synchronously.
Re: Issue 78075 in chromium: add chrome.extension.onUnload for content
scripts
Re: Issue 168194 in chromium: Video element does not play when no
speakers/headphones connected
Re: Issue 168261 in chromium: Disable Instant Extended Incognito mode in M25
Issue 168271 in chromium: Drag and drop MP4 from Drive "can't drop" for 3-4
seconds
Re: Issue 168157 in chromium: Channel 5 video not working
Re: Issue 165195 in chromium: Online Wallet client - Make required actions
an enum
Re: Issue 157357 in chromium: RenderViewImplTest.LastCommittedUpdateState
is flaky
Re: Issue 89665 in chromium: Move DefaultOriginBoundCertStore database load
to the db thread, and load origin bound certs per-domain on-demand.
Re: Issue 157357 in chromium: RenderViewImplTest.LastCommittedUpdateState
is flaky
Re: Issue 164738 in chromium: Apps not launching from the App Launcher on
Windows 7
Re: Issue 113983 in chromium: Memory usage increasing infinitely on every
tab refresh
Re: Issue 162288 in chromium: Driver crash on Nexus 10 while typing in URL
bar
Re: Issue 162288 in chromium: Driver crash on Nexus 10 while typing in URL
bar
Issue 168273 in chromium: Search for "MP4" a few times, no files show
Re: Issue 160815 in chromium: Media Cache directory
Re: Issue 166576 in chromium: moz test very spiky on xp-release-dual-core
and chromium-rel-win7-dual
Re: Issue 155897 in chromium: moz page cycler flaky on
chromium-rel-win7-single
Re: Issue 153084 in chromium: Crash in WebCore::HTMLMediaElement::textTracks
Re: Issue 168252 in chromium: Encrypted media browser tests flaky,
onKeyAdded not found
Re: Issue 167489 in chromium: EncryptedMediaTest.BasicPlayback_AudioOnly is
flaky
Re: Issue 166786 in chromium: Notification status indicator should not
disappear when there are no notifications
Issue 168275 in chromium: Chromium developer calendar shows server error
Re: Issue 166739 in chromium: requestAutocomplete dialog needs slightly
fancy menu
Issue 168276 in chromium: 3 files on USB show up as "4 files" in photo
importer
Re: Issue 151718 in chromium: Need a viewer app for immersive mode
Re: Issue 12133 in chromium: Implement downloads API for extensions
Re: Issue 162288 in chromium: Driver crash on Nexus 10 while typing in URL
bar
Re: Issue 148673 in chromium: IndexedDB indexing multiple database error
Re: Issue 162288 in chromium: Driver crash on Nexus 10 while typing in URL
bar
Re: Issue 96594 in chromium: URLRequestTestHTTP.ProxyTunnelRedirectTest
flaky on Linux Views Dbg
Re: Issue 166560 in chromium: Chromoting Alt+left-click-drag interpreted as
Alt+right-click-drag
Re: Issue 168223 in chromium: Favicon sync with many bookmarks causing slow
startup
Re: Issue 157961 in chromium: Display of CSS3 transformed area doesn't line
up with hit-testing area
Re: Issue 167505 in chromium: A CSS3 display bug which may relevant to the
transform
--
Automated mail from issue updates at http://crbug.com/
Subscription options: http://groups.google.com/a/chromium.org/group/chromium-bugs
c***@googlecode.com
2013-01-08 00:43:45 UTC
Permalink
Your project notifications generated too many emails to send
individually. Here are the subject lines of the emails you would have
received:

Re: Issue 52468 in chromium: Convert tabs to bitmap drawing, use that to
implement tab shadows on Mac
Re: Issue 159772 in chromium: Chrome OS: can't focus a root window
Re: Issue 166973 in chromium: Captive portal overlay in the Login screen,
does not close after authentication
Re: Issue 168691 in chromium: Crash in cc\thread_proxy.cc is hanging
interactive_ui_tests
Re: Issue 154536 in chromium: About chrome: progress percentage when
updating stays on 0%
Issue 168707 in chromium: Getting 400 Bad Request (malformed or illegal
request)
Re: Issue 168706 in chromium: chrome crashes when settings tab active and
vpn connects
Re: Issue 151417 in chromium: Clean-up unnecessary code relating to AutoHide
Re: Issue 168001 in chromium: Touch events aren't dispatched to iframes
Re: Issue 168706 in chromium: chrome crashes when settings tab active and
vpn connects
Re: Issue 165628 in chromium: Heavy visual distortion across many images
and some pages
Re: Issue 167467 in chromium: html5 video source receives 403
Re: Issue 158058 in chromium: Need remaining 2x assets for UI components
Re: Issue 168485 in chromium: Graphical glitches from other apps showing in
wunderground
Re: Issue 167613 in chromium: Text is spellchecked even if element has
spellcheck attribute as false
Re: Issue 165628 in chromium: Heavy visual distortion across many images
and some pages
Re: Issue 155209 in chromium: Impl-side painting (Move painting to the impl
thread)
Re: Issue 141005 in chromium: Automatically detect TV overscan
Re: Issue 157406 in chromium: make gesture recognizer unit tests run on
windows
Re: Issue 157406 in chromium: make gesture recognizer unit tests run on
windows
Re: Issue 168001 in chromium: Touch events aren't dispatched to iframes
Re: Issue 167613 in chromium: Text is spellchecked even if element has
spellcheck attribute as false
Re: Issue 167613 in chromium: Text is spellchecked even if element has
spellcheck attribute as false
Re: Issue 167613 in chromium: Text is spellchecked even if element has
spellcheck attribute as false
Re: Issue 140591 in chromium: Pick up correct language settings when adding
new user
Re: Issue 165849 in chromium: [chrome] -
content/browser/renderer_host/image_transport_factory.cc:574]
content::::GpuProcessTransportFactory::CreateSharedContextLazy
Re: Issue 167186 in chromium: Display flickers and crashes when connected
the Extended Desktop
Re: Issue 167598 in chromium: Bankofamerica.com dropdown menu is missing
entries (regression)
Re: Issue 52468 in chromium: Convert tabs to bitmap drawing, use that to
implement tab shadows on Mac
Re: Issue 165849 in chromium: [chrome] -
content/browser/renderer_host/image_transport_factory.cc:574]
content::::GpuProcessTransportFactory::CreateSharedContextLazy
Re: Issue 146449 in chromium: Pepper Flash: Plugin content draws
uninitialized content when loading
Issue 168709 in chromium: Add support for multi monitors to WebApp API
Re: Issue 168706 in chromium: chrome crashes when settings tab active and
vpn connects
Re: Issue 146449 in chromium: Pepper Flash: Plugin content draws
uninitialized content when loading
Re: Issue 168693 in chromium: [NaCl SDK] Naclports in SDK metabug
Re: Issue 168709 in chromium: Add support for multi monitors to WebApp API
Re: Issue 146449 in chromium: Pepper Flash: Plugin content draws
uninitialized content when loading
Re: Issue 168561 in chromium:
PromoResourceServiceTest.NotificationPromoTest fails on all platforms
Re: Issue 157608 in chromium: Provide a per-app list of open windows
Issue 168711 in chromium: Chromium stops processing mouse and keyboard
input for long periods of time
Re: Issue 162919 in chromium: Multiple input cursors upon session restore.
Issue 168712 in chromium: Pepper broker infobar is not triggered on Mac osx
Re: Issue 159425 in chromium: Make keyboard overlay v2 app
Re: Issue 168001 in chromium: Touch events aren't dispatched to iframes
Re: Issue 168712 in chromium: Pepper broker infobar is not triggered on Mac
osx
Re: Issue 168712 in chromium: Pepper broker infobar is not triggered on Mac
osx
Re: Issue 167624 in chromium: When connecting to EAP networks in guest
mode, Chrome gets stuck loading nonexistent certificates.
Re: Issue 143527 in chromium: RolloverProtectedNow in time_win.cc not cross
process safe
Re: Issue 163907 in chromium: File Manager does not remember location
Re: Issue 163534 in chromium: [Telemetry] Remove --enable-benchmarking from
telemetry.
Re: Issue 164262 in chromium: Show launcher when nothing else is running
Issue 168714 in chromium: Combining filter: drop-shadow with rotation
causes jagged edges when rendered
Re: Issue 168562 in chromium: Ability to rotate monitors
Re: Issue 166915 in chromium: HttpStreamParser should be greedier with reads
Re: Issue 166683 in chromium: Downloads stuck and unclickable in Downloads
stack on OS X
Re: Issue 168479 in chromium: Add MIME type content handler functionality
to desktop Chrome
Re: Issue 162919 in chromium: Multiple input cursors upon session restore.
Re: Issue 161046 in chromium: Verify with @pfeldman that tabs with
connected devtools client have minimal perf hit
Re: Issue 105530 in chromium: Chrome Canary on Mac started to fail on
compile after r101215.
Re: Issue 168704 in chromium: Create ability to accept a new TOS in the
autocomplete dialog
Re: Issue 168693 in chromium: [NaCl SDK] Naclports in SDK metabug
3 issues changed in chromium
Re: Issue 168128 in chromium: Handle config change during reset correctly
in VideoDecoders.
Re: Issue 133121 in chromium: Panels: Content area of a panel can go white,
showing no content until the panel is dragged or interacted with
Re: Issue 168436 in chromium: Add a pre-built version of forwarder2 to
allow telemetry testing on android without requiring a clank build
Re: Issue 168169 in chromium: Returning Javascript results should be via
base::Callback, not NOTIFICATION_EXECUTE_JAVASCRIPT_RESULT
Re: Issue 157692 in chromium: Implement new visual style for dialog boxes,
bubbles and menus.
Re: Issue 168590 in chromium: Black flash when dismissing status tray bubble
Re: Issue 167624 in chromium: When connecting to EAP networks in guest
mode, Chrome gets stuck loading nonexistent certificates.
Re: Issue 153137 in chromium: Script Bubble
Re: Issue 158261 in chromium: Google Drive Synchronizing Issues
Re: Issue 168709 in chromium: Add support for multi monitors to WebApp API
Re: Issue 168001 in chromium: Touch events aren't dispatched to iframes
Issue 168716 in chromium: Componentize VisitedLink for re-use in
android_webview
Re: Issue 160946 in chromium: [Telemetry] Close tab assumes that closign
the last tab is impossible
Re: Issue 153137 in chromium: Script Bubble
Re: Issue 165839 in chromium: Displays goes blank on connecting external
monitors
Re: Issue 165839 in chromium: Displays goes blank on connecting external
monitors
Re: Issue 166628 in chromium: FastBook scrolls twice as fast as it should
Re: Issue 161945 in chromium: Send up scroll offsets/etc with compositor
frames
Re: Issue 168561 in chromium:
PromoResourceServiceTest.NotificationPromoTest fails on all platforms
Re: Issue 155330 in chromium: Upstream ModalDialogTest
Re: Issue 167321 in chromium: gmail.com is not scrolling in the fast path
Issue 168718 in chromium: Move headers out of of toolchains
Re: Issue 168590 in chromium: Black flash when dismissing status tray bubble
Re: Issue 147516 in chromium: The favicon for yahoo.com shows up as the
default favicon when bookmarked in high DPI
Re: Issue 168018 in chromium: webrtc: video freezes when making call where
both sides use the same private network address
Re: Issue 168644 in chromium: Can't immediate scroll in the google search
result page
Re: Issue 168629 in chromium: Text-indent property for pseudo-element
(::before) being applied to parent
Re: Issue 162982 in chromium: GPUCrashTest flaky on Mac Retina Release bot
Re: Issue 168614 in chromium: GPUCrashTest.Kill and
ContextLossInfobarReload timeout on Mac Retina bot
Re: Issue 160946 in chromium: [Telemetry] Close tab assumes that closign
the last tab is impossible
Re: Issue 167919 in chromium: new [] and delete mismatch
Re: Issue 162982 in chromium: GPUCrashTest flaky on Mac Retina Release bot
Re: Issue 164755 in chromium: Log leveldb IO errors to an uma histogram
Re: Issue 166662 in chromium: Start screen is magnified after recent R25
update
Re: Issue 146449 in chromium: Pepper Flash: Plugin content draws
uninitialized content when loading
Re: Issue 135015 in chromium: Chrome Canary locking up the display on OS X
Re: Issue 161044 in chromium: Chrome crashes entire OS on retina MBP
Re: Issue 166804 in chromium: Adjust scheduler logic to back off when other
network actions are underway
--
Automated mail from issue updates at http://crbug.com/
Subscription options: http://groups.google.com/a/chromium.org/group/chromium-bugs
c***@googlecode.com
2013-01-08 21:22:24 UTC
Permalink
Your project notifications generated too many emails to send
individually. Here are the subject lines of the emails you would have
received:

Re: Issue 165071 in chromium: Files app window repainting continuously
Re: Issue 166813 in chromium: Most Visited doesn't get updated after
browsing more than 6 sites
Issue 168850 in chromium: Remote Debugging : Save As HAR does not create
the right filename
Re: Issue 166479 in chromium: Tapping 2nd calendar in google calendar list
gets adjusted to the first
Re: Issue 167873 in chromium: Java plugin update message
Re: Issue 168847 in chromium: chrome.bluetooth.startDiscovery can fail to
find devices
Re: Issue 29111 in chromium: Make accessibility layout tests run
Re: Issue 100092 in chromium: Bookmark entries can't easily be re-ordered
with touch
Re: Issue 168720 in chromium: xtb -> json conversion doesn't correctly
delineate placeholders.
Re: Issue 168847 in chromium: chrome.bluetooth.startDiscovery can fail to
find devices
Re: Issue 372 in chromium: F6 should do tabbing between frames - Venkat
Issue 168851 in chromium: Add a mechanism for querying GPU memory on
Windows (Vista+)
Re: Issue 168851 in chromium: Add a mechanism for querying GPU memory on
Windows (Vista+)
Re: Issue 132994 in chromium: GpuMemoryManager should get real vram and
report in about:gpu
Re: Issue 157613 in chromium: Microphone input is heavily distorted on
numerous mic tests with Pepper
Re: Issue 168836 in chromium: chrome print command doesnt wait for some
@media print styles..
Re: Issue 38108 in chromium: [Accessibility] Support WAI-ARIA roles alert
and alertdialog, as well as associated focus changes
Re: Issue 153363 in chromium: Remove old logic for window.open in new
process
Re: Issue 168218 in chromium: Allow Instant page to change omnibox input
interpretation as well as suggest gray text completion
Issue 168852 in chromium: Check failed: encrypted->GetDecryptConfig() when
using EME with MP4
Re: Issue 52330 in chromium: Pressing escape in Toolbar opens Chrome Task
manager window.
Re: Issue 162306 in chromium: Dropdown menus not rendered properly
Re: Issue 167615 in chromium: Hello World example broken in SDK
Re: Issue 57195 in chromium: Switch accessibility mode on when a screen
reader is launched
Re: Issue 165626 in chromium: Add support for a simple run of "main"
Re: Issue 162954 in chromium: Render crash (ASSERT) on Windows when
navigating to user profile from search NTP
Re: Issue 167615 in chromium: Hello World example broken in SDK
Issue 168853 in chromium: DCHECK in RenderViewImpl::UpdateURL hit
Re: Issue 163762 in chromium: Multiple notification "toast" stacking
behavior is off
Re: Issue 67713 in chromium: TTS extension API shouldn't use any polling
Re: Issue 164475 in chromium: NTP5 : Tab focus not Visible
Re: Issue 168765 in chromium: problem with new extend api tab page
Re: Issue 85112 in chromium: Issues with Chrome accessibility API in latest
Chrome OS
Re: Issue 168765 in chromium: problem with new extend api tab page
Re: Issue 85113 in chromium: Chrome OS Add Bookmark dialog not fully
accessible
Re: Issue 87798 in chromium: Incorrect announcements when moving by word
within a textbox on Windows
Re: Issue 87801 in chromium: Multi-line edit navigation by line broken
reading.
Re: Issue 166165 in chromium: BrowserPlugin: Allow for modularization of
functionality including adding functionality outside of the content layer
Re: Issue 134600 in chromium: Progress bars in (lower right) status area
should have Kennedy style
Re: Issue 165023 in chromium: Image rendering changes when browser window
is resized
Issue 168855 in chromium: Immersive mode: Disable window maximize and close
Re: Issue 168836 in chromium: chrome print command doesnt wait for some
@media print styles..
Issue 168856 in chromium: Notification close and expand buttons targets
should be 44 x 44 pixels for touch
Re: Issue 167381 in chromium: Inconsistent behavior of HistorySearchProvider
Re: Issue 168218 in chromium: Allow Instant page to change omnibox input
interpretation as well as suggest gray text completion
Re: Issue 168836 in chromium: chrome print command doesnt wait for some
@media print styles..
Issue 168857 in chromium: I sometimes see a 0 in the NTP where number of G+
notifications would be shown
Re: Issue 165071 in chromium: Files app window repainting continuously
Re: Issue 168822 in chromium: Notification close buttons should
hover/highlight and their targets should be 29 x 29 pixels for click
Re: Issue 168822 in chromium: Notification close buttons should
hover/highlight and their targets should be 29 x 29 pixels for click
Re: Issue 168836 in chromium: chrome print command doesnt wait for some
@media print styles..
Issue 168858 in chromium: Should support full keyboard access to Toolbar on
Mac
Re: Issue 125106 in chromium: A Linux Aura desktop browser
Re: Issue 125106 in chromium: A Linux Aura desktop browser
Re: Issue 92885 in chromium: F6 does not cycle focus on Linux
Re: Issue 161348 in chromium: Enable push messaging for old style packaged
apps
Issue 168859 in chromium: Audio drops after a couple minutes
Re: Issue 106246 in chromium: Rename toBrowserAccessibilityWin in
content/browser/accessibility/
Re: Issue 157613 in chromium: Microphone input is heavily distorted on
numerous mic tests with Pepper
Re: Issue 166818 in chromium: Valgrind reliability test leak in gdk inside
ui::ResourceBundle::GetNativeImageNamed
Re: Issue 166521 in chromium: Resubmit "hook smoothScrollBy with java on
android"
Re: Issue 109562 in chromium: TTS extension API slows down main browser
thread on Mac
Re: Issue 99116 in chromium: TTS extension API crashing on Mac under heavy
use
Re: Issue 106716 in chromium: Make sure all pure-Views (aura) widgets are
accessible
Re: Issue 167201 in chromium: Scrolling desktop Gmail on Android is broken
Re: Issue 167201 in chromium: Scrolling desktop Gmail on Android is broken
Re: Issue 146075 in chromium: Get more pages to use composited scrolling
for overflow:scroll
Re: Issue 117269 in chromium: ChromeVox: Zombie crash <NSSpeechSynthesizer:
0x6f182c00> received -_handleWordCallbackWithParams:
Re: Issue 99116 in chromium: TTS extension API crashing on Mac under heavy
use
Re: Issue 122172 in chromium: Store accessibility information in shared
memory
Re: Issue 123717 in chromium: Chrome: Crash Report - Stack
Signature: ComATLMain_DllGetClassObject-197893cc_4db12...
Re: Issue 164492 in chromium: Page navigation isn't synchronous with top
panel behavior
Re: Issue 168709 in chromium: Add support for multi monitors to WebApp API
Re: Issue 168859 in chromium: Audio drops after a couple minutes
Re: Issue 126827 in chromium: ChromeVox announces "blank, blank" in Omnibox.
Re: Issue 157420 in chromium: "Allow proxies for shared networks" is
enabled by default.
Re: Issue 168853 in chromium: DCHECK in RenderViewImpl::UpdateURL hit
Re: Issue 164492 in chromium: Page navigation isn't synchronous with top
panel behavior
Re: Issue 92992 in chromium: Beta Crashes when closing Window
Re: Issue 168857 in chromium: I sometimes see a 0 in the NTP where number
of G+ notifications would be shown
Re: Issue 164723 in chromium: InstantExtended: API for specifying
horizontal extents for Windows
Re: Issue 168709 in chromium: Add support for multi monitors to WebApp API
Re: Issue 168739 in chromium: Add "Shared with me" to left nav
Re: Issue 168741 in chromium: Add "Recent" to left nav
Re: Issue 168742 in chromium: Add "Offline" to the left nav
Re: Issue 168709 in chromium: Add support for multi monitors to WebApp API
Issue 168860 in chromium: "Irregardless" is not flagged as a misspelling in
Chrome's spell checker.
Re: Issue 157582 in chromium: Docs video continues playing audio
Re: Issue 148398 in chromium: Chrome crashes on shutdown if rendering an
infobar for Chrome Frame
Re: Issue 161057 in chromium: Kiosk: ChromeOS Demo App hangs when
navigating using the Arrow Keys
Re: Issue 148398 in chromium: Chrome crashes on shutdown if rendering an
infobar for Chrome Frame
Re: Issue 168751 in chromium: Backspace and delete non-functional in
auto-completed entries
Re: Issue 168760 in chromium: omnibox - can't use backspace on
autocompleted URL's
Re: Issue 168171 in chromium: Minimize with per-application window sorting
Re: Issue 165299 in chromium: Integrate Google Feedback into Extension/Apps
documentation
Re: Issue 168765 in chromium: problem with new extend api tab page
Re: Issue 165689 in chromium: InstantExtended: black flash in omnibox when
committing query on Win
Re: Issue 165299 in chromium: Integrate Google Feedback into Extension/Apps
documentation
Issue 168861 in chromium: net::disk_cache OpenNextEntry loops forever if
call you ReadData on the returned entry
Re: Issue 138600 in chromium: @font-face printing broken
--
Automated mail from issue updates at http://crbug.com/
Subscription options: http://groups.google.com/a/chromium.org/group/chromium-bugs
c***@googlecode.com
2013-01-09 00:44:42 UTC
Permalink
Your project notifications generated too many emails to send
individually. Here are the subject lines of the emails you would have
received:

Re: Issue 168706 in chromium: chrome crashes when settings tab active and
vpn connects
Re: Issue 128325 in chromium: -webkit-overflow-scrolling: touch is messing
up z-index stacking
Re: Issue 168819 in chromium: first enrollmentment is always fail
Issue 168905 in chromium: Telemetry scrolling benchmark complaining about
ordering PageBenchmarkResults
Re: Issue 168277 in chromium: html5 canvas test is slow on Chrome for
Android
Re: Issue 168277 in chromium: html5 canvas test is slow on Chrome for
Android
Re: Issue 167130 in chromium: Chrome Crashes on start up or any use
Re: Issue 168897 in chromium: Unify the browser_actions_overflow buttons on
every platform
Re: Issue 168897 in chromium: Unify the browser_actions_overflow buttons on
every platform
Re: Issue 6697 in chromium: Better message when waiting for ssl
interstitial page.
Re: Issue 167198 in chromium: -webkit-transform: scaleY(-1) centered off by
one
Re: Issue 167130 in chromium: Chrome Crashes on start up or any use
Re: Issue 125124 in chromium: Chrome First Run flow should not log out
current profile
Re: Issue 164273 in chromium: Enable tap dragging in Accessibility Settings?
Re: Issue 168897 in chromium: Unify the browser_actions_overflow buttons on
every platform
Re: Issue 54699 in chromium: CSS3 transition not applied for pseudo elements
Re: Issue 165880 in chromium: Images are displayed corrupted
Issue 168907 in chromium: file manager: can't list files in google drive
Issue 168908 in chromium: 500 (Internal Server Error)
Re: Issue 163079 in chromium: testmatrix surround clip does not produce
psnr values
Re: Issue 145561 in chromium: Use libyuv for RGB<->YUV conversions for
chromoting
Re: Issue 168852 in chromium: Check failed: encrypted->GetDecryptConfig()
when using EME with MP4
Re: Issue 167539 in chromium: Pressing control closes any open bookmark bar
folder
Re: Issue 168897 in chromium: Unify the browser_actions_overflow buttons on
every platform
Re: Issue 167539 in chromium: Pressing control closes any open bookmark bar
folder
Re: Issue 168360 in chromium: image on about:flags is pixely in hidpi
Re: Issue 20667 in chromium: Extensions API for spellchecking
Re: Issue 20667 in chromium: Extensions API for spellchecking
Re: Issue 168907 in chromium: file manager: can't list files in google drive
Re: Issue 55439 in chromium: Evaluate building with hardened binary flags
Re: Issue 167215 in chromium: Lock screen is offset to top and left (new
lock animations enabled + launcher autohide set to on)
Re: Issue 167797 in chromium: net-internals: Always display DNS config
information
Re: Issue 164876 in chromium: H264 hardware decode odd width on Windows
gray bar
Re: Issue 168360 in chromium: image on about:flags is pixely in hidpi
Re: Issue 125124 in chromium: Chrome First Run flow should not log out
current profile
Re: Issue 167908 in chromium: Implement Android WebView CapturePicture API
Re: Issue 167991 in chromium: Measure blacklist and consider trying to
force-load --instant-url on tab creation and omnibox focus
Re: Issue 168709 in chromium: Add support for multi monitors to WebApp API
Re: Issue 168897 in chromium: Unify the browser_actions_overflow buttons on
every platform
Re: Issue 168198 in chromium: Update chrome image reordering data for R25
branch
Re: Issue 168488 in chromium: Reset Sync via Google Dashboard, Update Sync
Passphrase
Re: Issue 168737 in chromium: Uploading a WebGL-rendered canvas to a
texture only works once
Re: Issue 168360 in chromium: image on about:flags is pixely in hidpi
Re: Issue 168128 in chromium: Handle config change during reset correctly
in VideoDecoders.
Re: Issue 168129 in chromium: Add config change support in Decrypting{Audio|
Video}Decoders
Issue 168909 in chromium: hide tap-dragging when no touchpad present
Re: Issue 164715 in chromium:
[FATAL:texture_image_transport_surface.cc(58)] Check failed: stub_destroyed_
Re: Issue 168552 in chromium: Search engines are not saved when
re-installing Chrome
Re: Issue 134857 in chromium: Sync: Search engines not syncing
Re: Issue 166737 in chromium: JavaScript Hang (Accessibility) on Release
Builds
Re: Issue 6697 in chromium: Better message when waiting for ssl
interstitial page.
Re: Issue 42658 in chromium: 422 YUV color space not working
Re: Issue 166588 in chromium: proxy authentication window disappears after
4-5sec
Issue 168910 in chromium: Tab switch should be blocked when context menu is
visible
Re: Issue 168787 in chromium: Regression - can't scroll a PDF with touch
Re: Issue 168552 in chromium: Search engines are not saved when
re-installing Chrome
Re: Issue 167797 in chromium: net-internals: Always display DNS config
information
Re: Issue 161052 in chromium: Message center items should be shown
as "cards"
Re: Issue 168867 in chromium: Add example of simplified 3D in NaCl
Re: Issue 164598 in chromium: Weird look of notification
Re: Issue 168294 in chromium: launcher is auto-hidden even
though 'quiet-mode' bubble is shown for notifications
Re: Issue 166580 in chromium: Crash in
ExtensionToolbarModelTest.ReorderAndReinsert on Mac
Re: Issue 168709 in chromium: Add support for multi monitors to WebApp API
Re: Issue 117617 in chromium: Bookmarks don't sync between two computers
running Chrome (updated version on both)
Re: Issue 167130 in chromium: Chrome Crashes on start up or any use
Re: Issue 168709 in chromium: Add support for multi monitors to WebApp API
Re: Issue 168552 in chromium: Search engines are not saved when
re-installing Chrome
Re: Issue 134857 in chromium: Sync: Search engines not syncing
Re: Issue 165493 in chromium: Virtual GL contexts result in flickering/out
of order rendering on Nexus 4
Re: Issue 167981 in chromium: Default shortcut not always created when
deleting down to one profile with existing shortcuts
Re: Issue 146251 in chromium: Remove most chrome/ dependencies on webkit/
Re: Issue 168691 in chromium: Crash in cc\thread_proxy.cc is hanging
interactive_ui_tests
Re: Issue 135525 in chromium: Measure GPU memory usage and ensure it
doesn't exceed specified memory limit
Re: Issue 167130 in chromium: Chrome Crashes on start up or any use
Issue 168912 in chromium: uncaught exception in tagWatcher for <embed
src="foobar.svg">
Re: Issue 165493 in chromium: Virtual GL contexts result in flickering/out
of order rendering on Nexus 4
Issue 168913 in chromium: Can Wallpaper Picker have an icon?
Re: Issue 168913 in chromium: Can Wallpaper Picker have an icon?
Re: Issue 168422 in chromium: restart try server
Re: Issue 157273 in chromium: implement autofill/payment dialog (views)
Issue 168914 in chromium: chrome.DIAL not work on Linux
Re: Issue 165290 in chromium: [chrome.dial] Check network interface types &
handle network changes
Re: Issue 167886 in chromium: Tabs focus is not proper while drag & drop
group tabs
Issue 168915 in chromium: Selected tab on OSX need to be lighter
Re: Issue 168894 in chromium: Move buildbot specific scripts out of pylib
Re: Issue 168422 in chromium: restart try server
Re: Issue 168913 in chromium: Can Wallpaper Picker have an icon?
Re: Issue 168914 in chromium: chrome.DIAL not working on Linux/Chrome OS
Re: Issue 168031 in chromium: Following a long suspend, screen has a dim
overlay and only status area is active
Re: Issue 3541 in chromium: Per tabs control over sounds in web pages
Re: Issue 161129 in chromium: popup for html select tag doesn't close when
a browser window is clicked.
Re: Issue 83714 in chromium: Media Documents should disable "view page
source"
Re: Issue 168294 in chromium: launcher is auto-hidden even
though 'quiet-mode' bubble is shown for notifications
Re: Issue 168905 in chromium: Telemetry scrolling benchmark complaining
about ordering PageBenchmarkResults
Re: Issue 168527 in chromium: Google Drive files are missing in FileBrowser
Re: Issue 168907 in chromium: file manager: can't list files in google drive
Re: Issue 168527 in chromium: Google Drive files are missing in FileBrowser
Re: Issue 167716 in chromium: file manager: can't copy file to google drive
Re: Issue 168527 in chromium: Google Drive files are missing in FileBrowser
Re: Issue 165411 in chromium: Cannot update access token using the stored
refresh token.
--
Automated mail from issue updates at http://crbug.com/
Subscription options: http://groups.google.com/a/chromium.org/group/chromium-bugs
c***@googlecode.com
2013-01-09 21:25:56 UTC
Permalink
Your project notifications generated too many emails to send
individually. Here are the subject lines of the emails you would have
received:

Re: Issue 162740 in chromium: Add an accessibility audit for WebUI pages in
browser tests
Re: Issue 162829 in chromium: Memory leaks on storage/indexeddb/ WebKit
worker tests
Re: Issue 108628 in chromium: Valgrind reports a memory leak from
http/tests/xmlhttprequest/workers/methods-async.html (Webkit layout)
Re: Issue 134694 in chromium: Implement multi-process Chromoting Daemon
architecture
Re: Issue 169021 in chromium: Add ability for jsleakcheck to run on
platform apps
Re: Issue 158044 in chromium: Flash objects do not work with
multicolumn(css3) wrapper
Re: Issue 169056 in chromium: Notification bubble is shown when no
notification is avaialble
Re: Issue 166407 in chromium: Dragging canvas leaves a trail
Re: Issue 157797 in chromium: Error page of file scheme can not show
NON-ASCII character in location.hash correctly.
Re: Issue 167383 in chromium: NaCl is broken on ARM
Re: Issue 166407 in chromium: Dragging canvas leaves a trail
Re: Issue 168918 in chromium: results link for dromaeo tests is incorrect
Re: Issue 161828 in chromium: Investigate JSGameBench performance
Issue 169063 in chromium: Chrome Frame Plug-in not working on Citrix XenApp
6.5 running published application IE8
Issue 169064 in chromium: Timeouts are not propogated when sharding tests
Re: Issue 169064 in chromium: Timeouts are not propogated when sharding
tests
Re: Issue 169064 in chromium: Timeouts are not propogated when sharding
tests
Re: Issue 169040 in chromium: deviceorientation fires when Chrome is not
active application
Re: Issue 165768 in chromium: older items in the notification toast
shouldn't be kicked out by a new one
Re: Issue 162485 in chromium: Chrome extension not installing from verified
webpage.
Re: Issue 20011 in chromium: Bookmark positions don't sync correctly if
bookmarks are re-positioned many times under the same parent
Issue 169065 in chromium: Multiple copies of App: Google and App: Google
Search running
Re: Issue 168415 in chromium: SequencedWorkerPool tasks and test
infrastructure don't play well together.
Re: Issue 166470 in chromium: Leak in
content::DOMStorageContextImpl::DeleteLocalStorage()
Issue 169066 in chromium: Truncated Wordings on the View files Windows
with multiple partition on the USB stick
Re: Issue 168415 in chromium: SequencedWorkerPool tasks and test
infrastructure don't play well together.
Re: Issue 164403 in chromium: DomStorageMessageFilter flakily getting
destructed on wrong thread
Re: Issue 161828 in chromium: Investigate JSGameBench performance
Re: Issue 155209 in chromium: Impl-side painting (Move painting to the impl
thread)
Re: Issue 168648 in chromium: Sync: Implement priority preferences
Re: Issue 168605 in chromium: Port notification center to Windows.
Re: Issue 164567 in chromium: Web Apps icons missing from the New Tab page
Re: Issue 161828 in chromium: Investigate JSGameBench performance
Re: Issue 169043 in chromium: Regression in
xp-release-dual-core/moz/times/t and chromium-rel-win7-dual/moz/times/t at
175176:175203
Re: Issue 168946 in chromium: diagnose cause of Mac compile slowness on the
tryserver
Re: Issue 158318 in chromium: Version allignment
Re: Issue 135629 in chromium: website loading except via search results
Re: Issue 166100 in chromium: imageSmoothingEnabled frequent, unpredictable
Snaps
Re: Issue 155209 in chromium: Impl-side painting (Move painting to the impl
thread)
Re: Issue 168383 in chromium: DCHECK failure in Ash restoring tab after
minimize
Re: Issue 168915 in chromium: Selected tab on OSX need to be lighter
Issue 169068 in chromium: Proxy-Auth dialog cancellation on login screen
causes it to hang
Re: Issue 169036 in chromium: Mac OS: Switching to dashboard during full
screen video causes keyboard focus to be lost
Re: Issue 167581 in chromium: Flash
Re: Issue 167581 in chromium: Flash
Re: Issue 158318 in chromium: Version allignment
Re: Issue 167293 in chromium: место сохранения закладки при использовании
нескольких папок для закладок
Re: Issue 169069 in chromium: virtual_driver_setup.exe install itself in
current folder and delete entire folder on uninstall
Issue 169069 in chromium: virtual_driver_setup.exe install itself in
current folder and delete entire folder on uninstall
Re: Issue 169067 in chromium: CDM plugin crash is not handled
Issue 169070 in chromium: Fire chrome.tabs.onUpdated with
status "interactive" when document is ready
Re: Issue 168915 in chromium: Selected tab on OSX need to be lighter
Issue 169071 in chromium: New Tab Page Crashes First Run
Re: Issue 158170 in chromium: Chrome_Mac: Crash Report - Stack
Signature: HALPropertyListener_Call_Helper(long, void*...
Re: Issue 169071 in chromium: New Tab Page Crashes First Run
Re: Issue 169067 in chromium: CDM plugin crash is not handled
Re: Issue 169025 in chromium: Webstore icon in the launcher should be
special-cased
Re: Issue 116785 in chromium: Handle TC bit set on DNS response with async
resolver
Re: Issue 168915 in chromium: Selected tab on OSX need to be lighter
Issue 169072 in chromium: SVG pattern rendered incorrectly on Mac
Re: Issue 113332 in chromium: Chrome for Android attempts to play video in
HTML5 video player instead of launching a video player
Re: Issue 168161 in chromium: Debug Chrome asserts on New Tab Page with
--force-accessibility-renderer
Re: Issue 169067 in chromium: CDM plugin crash is not handled
Issue 169073 in chromium: Profile shortcuts background are not transparent
as they should be.
Re: Issue 161337 in chromium: Async texture upload primitive
Re: Issue 161993 in chromium: Android bot step names contain punctuation,
breaking stats page
Re: Issue 107362 in chromium: Profile shortcut on XP has white background
Re: Issue 169073 in chromium: Profile shortcuts background are not
transparent as they should be.
Re: Issue 168915 in chromium: Selected tab on OSX need to be lighter
Re: Issue 107362 in chromium: Profile shortcut on XP has white background
Re: Issue 169071 in chromium: New Tab Page Crashes First Run
Re: Issue 166523 in chromium: [Mac] apprtc crashes when output sampling
rate set to 96000 Hz
Re: Issue 169019 in chromium: image_decoding_benchmark broken in CL 175782
Re: Issue 168383 in chromium: DCHECK failure in Ash restoring tab after
minimize
Re: Issue 133121 in chromium: Panels: Content area of a panel can go white,
showing no content until the panel is dragged or interacted with
Issue 169074 in chromium: "Why is this safe" link in PIN dialog is broken
Re: Issue 168894 in chromium: Move buildbot specific scripts out of pylib
Re: Issue 166523 in chromium: [Mac] apprtc crashes when output sampling
rate set to 96000 Hz
Issue 169075 in chromium: Total audio corruption with WebRTC and PulseAudio
Re: Issue 167086 in chromium: New DevTools Command: Input.clickElement
Re: Issue 167086 in chromium: New DevTools Command: Input.clickElement
Re: Issue 168382 in chromium: error message doesn't disappear after second
playing video
Re: Issue 166797 in chromium: Implement SwitchToFrame by element command
Re: Issue 165903 in chromium: REGRESSION: prediction service/Instant
settings are disregarded after latest Embedded Search change
Re: Issue 169031 in chromium: Http/MediaTest.VideoBearWavPcm browser_test
times out frequently on ASAN builds
Re: Issue 169031 in chromium: Http/MediaTest.VideoBearWavPcm browser_test
times out frequently on ASAN builds
Re: Issue 169031 in chromium: Http/MediaTest.VideoBearWavPcm browser_test
times out frequently on ASAN builds
Re: Issue 166528 in chromium: content_browsertests timeout on Linux ASAN
Tests (3) after running some media tests
Re: Issue 167099 in chromium: New DevTools Command: Input.type
Issue 169076 in chromium: json/close doesn't close the devtoolsfront end in
chrome
Re: Issue 167100 in chromium: New DevTools Command: Input.chooseFiles
Re: Issue 133121 in chromium: Panels: Content area of a panel can go white,
showing no content until the panel is dragged or interacted with
Re: Issue 167113 in chromium: New DevTools Command: Page.modalDialogOpened
Re: Issue 35811 in chromium: Dragging a .jpg to Finder saves it as .jpeg
Re: Issue 167108 in chromium: New DevTools Command: Page.getModalDialog
Re: Issue 169022 in chromium: chrome uses wrong proxy settings (ethernet +
openvpn)
Re: Issue 167107 in chromium: New DevTools Command: Page.close
Re: Issue 169031 in chromium: Http/MediaTest.VideoBearWavPcm browser_test
times out frequently on ASAN builds
Re: Issue 166528 in chromium: content_browsertests timeout on Linux ASAN
Tests (3) after running some media tests
Re: Issue 169050 in chromium: scrolling_benchmark on linux-release broken
in CL 175602
--
Automated mail from issue updates at http://crbug.com/
Subscription options: http://groups.google.com/a/chromium.org/group/chromium-bugs
c***@googlecode.com
2013-01-10 00:48:15 UTC
Permalink
Your project notifications generated too many emails to send
individually. Here are the subject lines of the emails you would have
received:

Re: Issue 163929 in chromium: Port usage of ImageLoadingTracker to
ImageLoader or extensions::IconImage
Re: Issue 168709 in chromium: Add support for multi monitors to WebApp API
Issue 169132 in chromium: Audio continues to play on source when tab
capture is activated
Re: Issue 89945 in chromium: Enable search-by-image in the right-click
context menu
Re: Issue 169130 in chromium: User Certificate selection is restricted for
policy-pushed networks
Re: Issue 166737 in chromium: JavaScript Hang (Accessibility) on Release
Builds
Re: Issue 168203 in chromium: Mouse cursor disappears when internet surfing
Re: Issue 169115 in chromium: mouse events on <select> element items are
broken
Re: Issue 165326 in chromium: Stream Remove functionality doesn't work if
it's only done on one side
Re: Issue 166737 in chromium: JavaScript Hang (Accessibility) on Release
Builds
Re: Issue 168714 in chromium: Combining filter: drop-shadow with rotation
causes jagged edges when rendered
Re: Issue 168298 in chromium: Disable InstantExtended field trials for
users with themes.
Re: Issue 166737 in chromium: JavaScript Hang (Accessibility) on Release
Builds
Re: Issue 161129 in chromium: popup for html select tag doesn't close when
a browser window is clicked.
Re: Issue 111506 in chromium: Migrate chrome/test/gpu/ to content/test/gpu
Re: Issue 169039 in chromium: Adjust fonts on OS (part of 137349): use
standard font sizes in AvatarMenuBubble
Re: Issue 137349 in chromium: Adjust fonts on OS
Re: Issue 168356 in chromium: Impl-side painting broken on Android
Issue 169135 in chromium: Transparent PNGs show ringing artifacts on HiDPI
/ Retina displays
Re: Issue 165309 in chromium: Enabling sync passphrase causes crash
Re: Issue 86817 in chromium: Show page zoom state as a page action,
transient bubble
Re: Issue 167471 in chromium: Chrome downloads a webpage instead of just
open it
Re: Issue 86817 in chromium: Show page zoom state as a page action,
transient bubble
Re: Issue 169115 in chromium: mouse events on <select> element items are
broken
Re: Issue 168618 in chromium: [NaCl SDK] Build fails on M25 branch after
gyp/ninja updates.
Issue 169136 in chromium: Test Mac Presentation and Lion Fullscreen modes
in FullscreenControllerStateTest.
Re: Issue 168915 in chromium: Selected tab on OSX need to be lighter
Re: Issue 168503 in chromium: NULL_POINTER_READ in WebCore::toV8Context
with IDB and WebWorkers
Re: Issue 169136 in chromium: Test Mac Presentation and Lion Fullscreen
modes in FullscreenControllerStateTest.
Re: Issue 168040 in chromium: Chrome OS device menu painting errors
Re: Issue 169135 in chromium: Transparent PNGs show ringing artifacts on
HiDPI / Retina displays
Re: Issue 168031 in chromium: Following a long suspend, screen has a dim
overlay and only status area is active
Re: Issue 167119 in chromium: Packaged apps/extensions should register to
send/receive notifications during installation
Re: Issue 168350 in chromium: Compositor thread hit testing doesn't seem to
be working on ChromeOS
Re: Issue 86817 in chromium: Show page zoom state as a page action,
transient bubble
Re: Issue 168503 in chromium: NULL_POINTER_READ in WebCore::toV8Context
with IDB and WebWorkers
Issue 169137 in chromium: Extended monitor hangs on swapping the primary
display
Re: Issue 169040 in chromium: deviceorientation fires when Chrome is not
active application
Re: Issue 168812 in chromium: Run NaCl processes under the new Seccomp-BPF
sandbox on Linux
Re: Issue 168031 in chromium: Following a long suspend, screen has a dim
overlay and only status area is active
Issue 169138 in chromium: Rename Fullscreen Controller ToggleFullscreen and
TogglePresentationMode to be descriptive
Re: Issue 169072 in chromium: SVG pattern rendered incorrectly on Mac
Issue 169139 in chromium: tab crashes with www.ro.me
Re: Issue 169136 in chromium: Test Mac Presentation and Lion Fullscreen
modes in FullscreenControllerStateTest.
Re: Issue 169138 in chromium: Rename Fullscreen Controller ToggleFullscreen
and TogglePresentationMode to be descriptive
Re: Issue 169115 in chromium: mouse events on <select> element items are
broken
Re: Issue 166405 in chromium: SVG resizing work incorrectly
Re: Issue 162552 in chromium: i can't insert ] characters in <input>, it
just unfocus the input with azerty keyboard (Alt Gr + ")" or CTRL+ALT + ")")
Re: Issue 169137 in chromium: Extended monitor hangs on swapping the
primary display
Re: Issue 169124 in chromium: Display settings: "Start Mirroring" button
shouldn't be enabled under single monitor mode
Re: Issue 167187 in chromium: Fix C4267 compilation warnings in Win64 build
Re: Issue 151681 in chromium: Media Galleries on Mac should support MTP
Re: Issue 166496 in chromium: Fix simple 64-bit Windows compilation failures
Re: Issue 169139 in chromium: tab crashes with www.ro.me
Re: Issue 169130 in chromium: User Certificate selection is restricted for
policy-pushed networks
Issue 169140 in chromium: DevToolsFileHelper::Save() file path traversal
Re: Issue 168503 in chromium: NULL_POINTER_READ in WebCore::toV8Context
with IDB and WebWorkers
Re: Issue 162350 in chromium: Implement FakeDriveService
4 issues changed in chromium
Issue 169141 in chromium: Transfer buffers leak within the same context
group
Issue 169142 in chromium: "Add Bookmark" popup dialog controls don't
support keyboard navigation
Re: Issue 125400 in chromium: Sometimes thumbnails in NTP are not generated
Re: Issue 155056 in chromium: Fullscreen API allowed from extension script
when Extension button pressed
Re: Issue 164444 in chromium: Mouse pointer tiny on external HDPI monitor
Re: Issue 130230 in chromium: Extract
chrome/browser/chromeos/input_method/* from chrome
Issue 169143 in chromium: Android scrollbars don't animate properly with
impl-side painting on
Re: Issue 169143 in chromium: Android scrollbars don't animate properly
with impl-side painting on
Issue 169144 in chromium: Cleanup fileBrowserPrivate.executeTask and
fileBrowserPrivate.getFileTasks function implementations
Re: Issue 168812 in chromium: Run NaCl processes under the new Seccomp-BPF
sandbox on Linux
Re: Issue 130230 in chromium: Extract
chrome/browser/chromeos/input_method/* from chrome
Re: Issue 168503 in chromium: NULL_POINTER_READ in WebCore::toV8Context
with IDB and WebWorkers
Issue 169145 in chromium: Scrolling with mouse-wheel gets stuck
Re: Issue 151681 in chromium: Media Galleries on Mac should support MTP
Re: Issue 130230 in chromium: Extract
chrome/browser/chromeos/input_method/* from chrome
Re: Issue 164375 in chromium: Move s/c/b/chromeos/input_method to s/chromeos
Re: Issue 169143 in chromium: Android scrollbars don't animate properly
with impl-side painting on
Re: Issue 168602 in chromium: Expose a new flag for LSO staging servers
Re: Issue 144832 in chromium: It is time to unlink the "Backspace" ->
Browser Back shortcut.
Re: Issue 168031 in chromium: Following a long suspend, screen has a dim
overlay and only status area is active
Issue 169146 in chromium: Online Wallet client - WalletClientObserver
functions
Re: Issue 169115 in chromium: mouse events on <select> element items are
broken
Re: Issue 161129 in chromium: popup for html select tag doesn't close when
a browser window is clicked.
Re: Issue 156956 in chromium: Google Talk Plug-In Causing Routine Crashes -
11 so far today
Re: Issue 169091 in chromium: DHCP lease renewal causes 100% reproducible
video lockup on several sites
Re: Issue 169020 in chromium: App launcher not showing up
Re: Issue 168915 in chromium: Selected tab on OSX need to be lighter
Re: Issue 153932 in chromium: Unable to trigger set search engine keyword
for specific search engine in omnibox
Re: Issue 169115 in chromium: mouse events on <select> element items are
broken
Re: Issue 168956 in chromium: Extensions/apps documentation does not
explicitly show callback parameters
Re: Issue 164169 in chromium: Video elements produce phantom requests
Issue 169147 in chromium: A download with a forced path doesn't need an
intermediate path
Re: Issue 169034 in chromium: Sound fails to play in Clamshell mode
Re: Issue 136442 in chromium: RenderAudioSourceProvider should live in
webkit/media/
Re: Issue 168915 in chromium: Selected tab on OSX need to be lighter
Re: Issue 153932 in chromium: Unable to trigger set search engine keyword
for specific search engine in omnibox
Re: Issue 169077 in chromium: Message Center text with no notifications is
illegible.
Re: Issue 156563 in chromium: Run more File API layout tests in chromium
browser_tests or content_browsertests
Issue 169148 in chromium: SelectFileDialog NOTREACHED hit when opening the
filepicker from an extension popup
Re: Issue 168819 in chromium: first enrollmentment sometimes fail
Re: Issue 153932 in chromium: Unable to trigger set search engine keyword
for specific search engine in omnibox
--
Automated mail from issue updates at http://crbug.com/
Subscription options: http://groups.google.com/a/chromium.org/group/chromium-bugs
c***@googlecode.com
2013-01-14 16:33:15 UTC
Permalink
Your project notifications generated too many emails to send
individually. Here are the subject lines of the emails you would have
received:

Re: Issue 7648 in chromium: Support resuming interrupted downloads
Re: Issue 159221 in chromium: Integrate cache invalidation Ticl v2 Android
v2
Re: Issue 159265 in chromium: Extensions as browser component
Re: Issue 169434 in chromium: heapcheck: leak in BookmarkUIUtilsTest
Re: Issue 167005 in chromium: InstantExtended: Crash on arrow-down + ESC in
omnibox
Re: Issue 151681 in chromium: Media Galleries on Mac should support MTP
Re: Issue 161052 in chromium: Message center items should be shown
as "cards"
Re: Issue 168413 in chromium: Gpu memory free list in impl-side painting
grows too big
Re: Issue 169143 in chromium: Android scrollbars don't animate properly
with impl-side painting on
Re: Issue 168282 in chromium: GpuChannelHost crashes seen on CrOS bots
Re: Issue 109874 in chromium: Templatize scoped_ptr's deleter, obsolete
scoped_array and reduce scoped_ptr_malloc to a convenience wrapper for
free()
Re: Issue 166737 in chromium: JavaScript Hang (Accessibility) on Release
Builds
Re: Issue 151681 in chromium: Media Galleries on Mac should support MTP
Re: Issue 169531 in chromium: Automatic toolchain setup for Windows
Re: Issue 169668 in chromium: Memory leak in NativeTextfieldViewsTest
Re: Issue 169266 in chromium: Update audio config in DecryptingAudioDecoder
after finishing config change.
Re: Issue 100845 in chromium: All Autofill address profiles should have an
associated locale, in some cases implicit
Re: Issue 169588 in chromium:
GDataWapiOperationsTest.DownloadFileOperation_NonExistentFile crashes on
win7
Re: Issue 157161 in chromium: Rework ConstrainedWindow API
Re: Issue 161002 in chromium: Extension Activity Log: Logged activity
should be saved even when UI is not displayed
Re: Issue 169675 in chromium: Memory Leak in NativeMediaFileUtilTest
Re: Issue 159770 in chromium: Option to have launcher on top
Re: Issue 169497 in chromium: [NaCl SDK Addin] we need to publish the
latest version of the addin
Re: Issue 164859 in chromium: Instant Extended Mac: Showing bookmark bar
causes flash
Re: Issue 164755 in chromium: Log leveldb IO errors to an uma histogram
Re: Issue 51644 in chromium: The password autofill, form AutoFill and
autocomplete code should be moved from WebKit to Chromium
Re: Issue 169069 in chromium: virtual_driver_setup.exe install itself in
current folder and delete entire folder on uninstall
Re: Issue 165849 in chromium: [chrome] -
content/browser/renderer_host/image_transport_factory.cc:574]
content::::GpuProcessTransportFactory::CreateSharedContextLazy
Re: Issue 169144 in chromium: Cleanup fileBrowserPrivate.executeTask and
fileBrowserPrivate.getFileTasks function implementations
Re: Issue 145412 in chromium: Implement arbitrary positioning for sync nodes
Re: Issue 25841 in chromium: Data race on vfptr in
ipc/ipc_sync_channel_unittest.cc
Re: Issue 168119 in chromium: Do tree activation using LayerTreeImpl
instead of TileManager
Re: Issue 70075 in chromium:
IPCSyncChannelTest.SendWithTimeoutMixedOKAndTimeout flakily crashes
Re: Issue 169678 in chromium: Memory Leak in V8 from EvenUnittest
Re: Issue 169509 in chromium: NaCl glibc tests should be removed from ARM
builds.
Re: Issue 126505 in chromium: Sync: Use position in parent style ordering
on client side
Re: Issue 157996 in chromium: Terminated and disabled apps are not shown in
the app list
Re: Issue 164067 in chromium: Display settings window should disappear on
removing external display connector
Re: Issue 167777 in chromium: Make --simulate-touch-screen-with-mouse more
user friendly
Re: Issue 168912 in chromium: uncaught exception in tagWatcher for <embed
src="foobar.svg">
Re: Issue 169404 in chromium: Multiple use of
CursorManager::DisableMouseEvents leads to causing the cursor to disapper
Re: Issue 168395 in chromium: Telemetry raster stats are funky
Re: Issue 162350 in chromium: Implement FakeDriveService
Re: Issue 169524 in chromium: Give query extraction its own flag
Re: Issue 162993 in chromium: Instant overlay needs drop-shadow when in
suggestions mode
Re: Issue 156244 in chromium: IndexedDB: Flatten out IPC interface
Re: Issue 167548 in chromium: Pointless function wrappers in
browser_tabstrip and Browser
Re: Issue 169688 in chromium: 1.5% regression in
V8.MemoryHeapSampleTotalUsed_0.95 and V8.MemoryHeapSampleTotalUsed_0.99
Re: Issue 150046 in chromium: automate png file update process
Re: Issue 166496 in chromium: Fix simple 64-bit Windows compilation failures
Re: Issue 169312 in chromium: Move components from src/content/components
to new home at src/components
Re: Issue 169622 in chromium:
ExtensionCrashRecoveryTest.ReloadTabsWithBackgroundPage is hitting a DCHECK
on USE_AURA
Re: Issue 167187 in chromium: Fix C4267 compilation warnings in Win64 build
Re: Issue 167999 in chromium: chrome_frame_tests need to run in the CQ
Re: Issue 168494 in chromium: adding a listener from a fired alarm causes
the listener to trigger right away
Re: Issue 168989 in chromium: Inconsistent default zoom handling in
incognito mode
Re: Issue 168950 in chromium: Extended desktop: quickly swapping primary
display causes problems
Re: Issue 168724 in chromium: Implement
LayerTreeHostImpl::ScheduleCheckForCompletedSetPixels() that doesn't call
setNeedsRedraw
Re: Issue 166780 in chromium: Impl-side painting tile manager needs to
adjust tile priorities on tree swap
Re: Issue 168240 in chromium: Shockwave Flash has crashed message from a
youtube.com
video.(content::VaapiH264Decoder::FillVAPicture(_VAPictureH264*,
content::H264Picture*)-4D88BAD)
Re: Issue 141005 in chromium: Automatically detect TV overscan
Re: Issue 167172 in chromium: InstantExtended: 'Press Tab to seach' is also
visible, after selecting another result with arrow key.
Re: Issue 167814 in chromium: Sixty Second Shooter (NaCl game) 3d rendering
is invisible
Re: Issue 169229 in chromium: Gaia sign-in gets stuck in "Processing..."
because frame at accounts.google.de is blocked by Content Security Policy
Re: Issue 165309 in chromium: Enabling sync passphrase causes crash
Re: Issue 169675 in chromium: Memory Leak in NativeMediaFileUtilTest
Re: Issue 167548 in chromium: Pointless function wrappers in
browser_tabstrip and Browser
Re: Issue 169181 in chromium: Can't input multi-byte characters into Google
Docs.
Re: Issue 155525 in chromium: Move Prefs out of src/chrome
Re: Issue 12133 in chromium: Implement downloads API for extensions
Re: Issue 113594 in chromium: Cannot print BGcolor or background pictures
Re: Issue 169457 in chromium: UserInfoFetcher does not use a configurable
URL
Re: Issue 169664 in chromium: Focuse change will not cancel on-going
composition when MSIME 2012 Japanese is showing its suggest/candidate
window in Metro mode
Re: Issue 167361 in chromium: chrome.app.window is missing documentation
Re: Issue 155883 in chromium: Remove chrome/browser/cancelable_request.*
Re: Issue 129187 in chromium: Remove assumption of only one BrowserList
Re: Issue 165832 in chromium: Make file entries persistent across restarts
for chrome apps
Re: Issue 169763 in chromium: Update JDK version metadata to require JDK7u11
Re: Issue 169312 in chromium: Move components from src/content/components
to new home at src/components
Re: Issue 162802 in chromium: ONC errors are not indicated on about:policy
or net-internals page.
Re: Issue 168583 in chromium: Views/omnibox copies to clipboard in text
format only
Re: Issue 167331 in chromium: Meta bug for refactoring test runners
Re: Issue 168772 in chromium: Support manual (white|black)list, previewing
and allowing after interstitial
Re: Issue 166635 in chromium: Implement pyautotest for experimental
PeerConnection Datachannels
Re: Issue 166588 in chromium: proxy authentication window disappears after
4-5 sec
Re: Issue 143431 in chromium: leaks in ManagedMode::ManagedMode()
Re: Issue 167652 in chromium: Incorrect password bubble icon is not shown
Re: Issue 166473 in chromium: "Install Program As Other User" system dialog
pops up when logged back to any user without admin privilages.
Re: Issue 169042 in chromium: memory leaks in ManagedModeURLFilter
Re: Issue 167711 in chromium: Photo editor: buttons in toolbar should not
have white stroke
Re: Issue 169788 in chromium: Unpin Cryptocat's subdomains
Re: Issue 134396 in chromium: File downloaded with a PHP file extension
instead of PDF
Re: Issue 169781 in chromium: missing plumbing for inspector extensions in
content shell
Re: Issue 137859 in chromium: [Mac] Find bar text is not vertically
centered, and padding is inconsistent
Re: Issue 166875 in chromium: Fix Media UI to not run in DCHECK conditions.
Re: Issue 167277 in chromium: Support Windows "large icons" for profile
desktop shortcuts
Re: Issue 167814 in chromium: Sixty Second Shooter (NaCl game) 3d rendering
is invisible
Issue 169803 in chromium: Browser Plugin: Implement Gutters in Texture
Layer for Proper Resize Behaviour
Re: Issue 159519 in chromium: Need Continuous Chrome ARM build & Test
Re: Issue 169469 in chromium: Html5 video rendering problems on android.
--
Automated mail from issue updates at http://crbug.com/
Subscription options: http://groups.google.com/a/chromium.org/group/chromium-bugs
c***@googlecode.com
2013-01-14 19:33:16 UTC
Permalink
Your project notifications generated too many emails to send
individually. Here are the subject lines of the emails you would have
received:

Re: Issue 169706 in chromium: Figure out how to distribute forwarder
binaries
Re: Issue 168436 in chromium: Add a pre-built version of forwarder2 to
allow telemetry testing on android without requiring a clank build
Re: Issue 83098 in chromium: Current method to Print Selection is
convoluted and lacks Print Preview
Re: Issue 167485 in chromium: Misspelled words with underscores "_" do not
have spellchecker suggestions and options
Re: Issue 169797 in chromium: Text Autosizing: Form fields are de-emphasized
Issue 169840 in chromium: Add chrome log for wallpaper picker
Issue 169841 in chromium: Mac Page-Cycler-DHTML perf regression
Re: Issue 169611 in chromium: Wallpaper can not access in Stout R25 TOT
Re: Issue 166426 in chromium: Clean up the string for wallpaper picker
offline mode and add a x button.
Re: Issue 158910 in chromium: GWT Animations broke on 24/25
Re: Issue 164383 in chromium: Browser Plugin: Store more in DOM Attributes
Re: Issue 164391 in chromium: Browser Plugin: All attributes should be
parsed when BrowserPlugin is created
Re: Issue 164523 in chromium: PDF flagged as dangerous download on ChromeOS
Re: Issue 168223 in chromium: Favicon sync with many bookmarks causing slow
startup
Issue 169842 in chromium: Add incognito visualization to items in the new
app menu
Re: Issue 169842 in chromium: Add incognito visualization to items in the
new app menu
Re: Issue 164523 in chromium: PDF flagged as dangerous download on ChromeOS
Re: Issue 169827 in chromium: mbeta.slashdot.org is not scrollable on
Chrome beta
Re: Issue 169841 in chromium: Mac Page-Cycler-DHTML perf regression
Issue 169843 in chromium: WebKit tests for spellchecker behavior
Re: Issue 169629 in chromium: RU should ignore words in custom dictionary
Re: Issue 169843 in chromium: WebKit tests for spellchecker behavior
Re: Issue 169843 in chromium: WebKit tests for spellchecker behavior
Re: Issue 169629 in chromium: RU should ignore words in custom dictionary
Re: Issue 162179 in chromium: Mobile gmail.com scrolling is incorrect
Re: Issue 124406 in chromium: Enable DirectWrite in Chrome
Re: Issue 169743 in chromium: Right-click on a two-word misspelling with
grey underline has no suggestions
Re: Issue 169843 in chromium: WebKit tests for spellchecker behavior
Re: Issue 169843 in chromium: WebKit tests for spellchecker behavior
Re: Issue 169659 in chromium: Cannot spellcheck a double-clicked word in
Windows
Issue 169844 in chromium: Cleanup: remove
third_party/re2/patches/rename-posix-option.patch
Issue 169845 in chromium: Linux Perf (lowmem) failing dom_perf, page_cycler
Re: Issue 168600 in chromium: Dotted spellcheck underline disappears in
Chrome on Mac when placing cursor on misspelled word
Re: Issue 169843 in chromium: WebKit tests for spellchecker behavior
Re: Issue 164810 in chromium: Unable to play h264
Re: Issue 168029 in chromium: Text input field spellcheck is disabled after
losing and regaining focus until user starts typing again
Re: Issue 169843 in chromium: WebKit tests for spellchecker behavior
Re: Issue 169843 in chromium: WebKit tests for spellchecker behavior
Re: Issue 167485 in chromium: Misspelled words with underscores "_" do not
have spellchecker suggestions and options
Re: Issue 167778 in chromium: Create a script for semi-automated update
testing
Issue 169846 in chromium: Audio stops after changing output devices.
Re: Issue 166362 in chromium: "Download was not a CRX"
Re: Issue 166426 in chromium: Clean up the string for wallpaper picker
offline mode and add a x button.
Re: Issue 153056 in chromium: Handle hardware audio output device changes
for Windows.
Re: Issue 166362 in chromium: "Download was not a CRX"
Issue 169847 in chromium: Kill fails on Mac ATI GPU bot
Re: Issue 146442 in chromium: Flash video plays fine but there is no sound
12 issues changed in chromium
Re: Issue 169843 in chromium: WebKit tests for spellchecker behavior
Issue 169848 in chromium: Blank page is displayed when navigating to
webpages with threaded compositing enabled
Issue 169849 in chromium: Cleanup: remove
third_party/re2/patches/remove-valgrind-code.patch
Issue 169850 in chromium: Inconsistent window is showing during the new URL
serach
Issue 169851 in chromium: Cleanup: remove
third_party/re2/patches/fix-implicit-conversion.patch
Re: Issue 167703 in chromium: Table height calculated incorrectly
Re: Issue 169848 in chromium: Blank page is displayed when navigating to
webpages with threaded compositing enabled
Re: Issue 166891 in chromium: Tab discarder should discard NTP, blank
pages, settings pages first
7 issues changed in chromium
Re: Issue 169848 in chromium: Blank page is displayed when navigating to
webpages with threaded compositing enabled
Re: Issue 140977 in chromium: Change source code copyright policy again
Re: Issue 154551 in chromium: cq status page doesn't link to tryjobs anymore
Issue 169852 in chromium: Beta - Unable to edit Bookmarks
Issue 169853 in chromium: Cleanup: remove patches/re2-android.patch
Re: Issue 169843 in chromium: WebKit tests for spellchecker behavior
Issue 169855 in chromium: Cleanup: remove
third_party/re2/patches/remove-testinstall.cc-and-fix-filepermissions.patch
Re: Issue 169853 in chromium: Cleanup: remove
third_party/re2/patches/re2-android.patch
Re: Issue 169160 in chromium: plugin loading code can be given relative
paths
Re: Issue 127083 in chromium: After opening the Print preview, the
incognito window doesn't work properly
Re: Issue 161044 in chromium: Chrome crashes entire OS on retina MBP
Re: Issue 164859 in chromium: Instant Extended Mac: Showing bookmark bar
causes flash
Re: Issue 168998 in chromium: Chrome crashes on right-clicking a panel or
detached panel
Re: Issue 164632 in chromium: Edit bookmark is broken
Re: Issue 169852 in chromium: Beta - Unable to edit Bookmarks
Re: Issue 169845 in chromium: Linux Perf (lowmem) failing dom_perf,
page_cycler
Re: Issue 169850 in chromium: Inconsistent window is showing during the new
URL serach
Re: Issue 169659 in chromium: Cannot spellcheck a double-clicked word in
Windows
Re: Issue 164503 in chromium: Infinite loop recreating loader
Issue 169856 in chromium: Visited links no longer appear as purple
Re: Issue 154551 in chromium: cq status page doesn't link to tryjobs anymore
2 issues changed in chromium
Re: Issue 169629 in chromium: RU should ignore words in custom dictionary
Re: Issue 168652 in chromium: Unify language/input settings string across
CrOS/Chromium
Re: Issue 169847 in chromium: Kill fails on Mac ATI GPU bot
Re: Issue 169325 in chromium: Chrome claims extension was disabled because
it required more permissions when disabled & re-enabled manually.
Re: Issue 167560 in chromium: Consider adding local suggest types like Apps
Re: Issue 167560 in chromium: Consider adding local suggest types like Apps
Re: Issue 167177 in chromium: Failed to navigate the first time when
clicking a hyperlink with Instant feature
Re: Issue 162179 in chromium: Mobile gmail.com scrolling is incorrect
4 issues changed in chromium
Re: Issue 169548 in chromium: Flings should not bubble up to enclosing
scrollables
Re: Issue 164859 in chromium: Instant Extended Mac: Showing bookmark bar
causes flash
Re: Issue 158170 in chromium: Chrome_Mac: Crash Report - Stack
Signature: HALPropertyListener_Call_Helper(long, void*...
Re: Issue 167172 in chromium: InstantExtended: 'Press Tab to seach' is also
visible, after selecting another result with arrow key.
Re: Issue 169848 in chromium: Blank page is displayed when navigating to
webpages with threaded compositing enabled
Re: Issue 169848 in chromium: Blank page is displayed when navigating to
webpages with threaded compositing enabled
Re: Issue 168161 in chromium: Debug Chrome asserts on New Tab Page with
--force-accessibility-renderer
Re: Issue 165665 in chromium: Overhaul of try job email
Issue 169857 in chromium: UI for requestAutoComplete asks for FullName
instead of finer grained details.
10 issues changed in chromium
Re: Issue 163045 in chromium: System tray menu missing lower right area is
rendered when full screen magnifier is enabled
Re: Issue 167703 in chromium: Table height calculated incorrectly
--
Automated mail from issue updates at http://crbug.com/
Subscription options: http://groups.google.com/a/chromium.org/group/chromium-bugs
c***@googlecode.com
2013-01-15 19:25:58 UTC
Permalink
Your project notifications generated too many emails to send
individually. Here are the subject lines of the emails you would have
received:

Re: Issue 140890 in chromium: Windows 8 Active Corners not working
Re: Issue 170043 in chromium: File download is not restored after chrome
crash in LINUX
Re: Issue 169827 in chromium: mbeta.slashdot.org is not scrollable on
Chrome beta
Re: Issue 170082 in chromium: Rebaseline
canvas-imageSmoothingEnabled-patterns.html for Skia changes
Re: Issue 168056 in chromium: Advanced "Join Wifi Network" dialog does not
popup when we tried to reconnect to a network
Re: Issue 134600 in chromium: Progress bars in (lower right) status area
should have Kennedy style
Issue 170097 in chromium: Google Talk ask for permission via butterbar with
click to play
Issue 170098 in chromium: Flash context menu can't always be triggered out
with finger press and hold on Slate
Re: Issue 169827 in chromium: mbeta.slashdot.org is not scrollable on
Chrome beta
Re: Issue 140890 in chromium: Windows 8 Active Corners not working
Re: Issue 165849 in chromium: [chrome] -
content/browser/renderer_host/image_transport_factory.cc:574]
content::::GpuProcessTransportFactory::CreateSharedContextLazy
Re: Issue 170011 in chromium: Only show notifications for user-initiated
connection attempts for cellular networks
Re: Issue 169993 in chromium: IME Extension should be able to know the key
code of key events.
Re: Issue 170097 in chromium: Google Talk ask for permission via butterbar
with click to play
Re: Issue 170011 in chromium: Only show notifications for user-initiated
connection attempts for cellular networks
Re: Issue 169990 in chromium: CSS Transforms/Transitions: Clipping of
partially visible elements
Re: Issue 140890 in chromium: Windows 8 Active Corners not working
Re: Issue 112367 in chromium: getUserMedia() doesn't work for microphone
input
Re: Issue 170011 in chromium: Only show notifications for user-initiated
connection attempts for cellular networks
Re: Issue 64571 in chromium: video seek is sometimes very slow
Re: Issue 167883 in chromium: Translated "Google Search" app title is in
Traditional Chinese when UI is Simplified Chinese
Re: Issue 89945 in chromium: Enable search-by-image in the right-click
context menu
Re: Issue 169993 in chromium: IME Extension should be able to know the key
code of key events.
Re: Issue 170050 in chromium: Go Home Dinosaurs game crashes
Re: Issue 166451 in chromium: base_unittests flaked on iOS Simulator (dbg)
Re: Issue 156519 in chromium: Get stuck after trying to move a modal window
to another monitor
Re: Issue 170043 in chromium: File download is not restored after chrome
crash in LINUX
Re: Issue 169902 in chromium: Beta - Unable to select options from wrench
menu on Google Search results page
Re: Issue 165849 in chromium: [chrome] -
content/browser/renderer_host/image_transport_factory.cc:574]
content::::GpuProcessTransportFactory::CreateSharedContextLazy
Re: Issue 170084 in chromium: RenderViewImple::didHandleGestureEvent not
getting called
Re: Issue 130980 in chromium: Refactor FilePathWatcher interface
Re: Issue 170007 in chromium: CSS not behaving the same as stable release.
3 center boxes should be lined up horizontally. In the beta release they're
not. Stable Chrome is ok.
Re: Issue 167883 in chromium: Translated "Google Search" app title is in
Traditional Chinese when UI is Simplified Chinese
Issue 170102 in chromium: Check autoenrollment before AU in optimized OOBE
flow
Re: Issue 170007 in chromium: CSS not behaving the same as stable release.
3 center boxes should be lined up horizontally. In the beta release they're
not. Stable Chrome is ok.
Re: Issue 123577 in chromium: Provide more information on OOBE update error
Re: Issue 170102 in chromium: Check autoenrollment before AU in optimized
OOBE flow
Re: Issue 169938 in chromium: GPU blacklist should manage force-compositing
mode
Re: Issue 144676 in chromium: [HiDPI] Occasional scaling problems when
switching between HiDPI native display and an external Normal DPI display
Re: Issue 169967 in chromium: "Remove desktop shortcut" checkbox should
mirror "create desktop shortcut" checkbox
Issue 170104 in chromium: Build comprehensive autotests to test improved
network and autoenrollment checks in OOBE
Re: Issue 169373 in chromium: ASSERTION ERROR when running chrome with
--ui-enable-threaded-compositing on linux desktop
Re: Issue 158232 in chromium: Crash in flvsniff.dll (Free Download Manager)
Re: Issue 160122 in chromium: Mouse wheel scrolls very slowly when set to
page-up/down in Windows
Re: Issue 166451 in chromium: base_unittests flaked on iOS Simulator (dbg)
Re: Issue 169373 in chromium: ASSERTION ERROR when running chrome with
--ui-enable-threaded-compositing on linux desktop
Re: Issue 140747 in chromium: Clicked tab moves to the left place when the
tab bar is filled to the limit.
Re: Issue 164966 in chromium: reuse browser-side autofill popup UI in
imperative autofill dialog
Re: Issue 170053 in chromium: "IncognitoModeAvailability" expert pref is
ignored when no windows are open
Re: Issue 134849 in chromium: Make chrome://policy more user-friendly
Issue 170105 in chromium: With of inline SVG element is not update after
width attribute is updated
Re: Issue 169967 in chromium: "Remove desktop shortcut" checkbox should
mirror "create desktop shortcut" checkbox
Re: Issue 169373 in chromium: ASSERTION ERROR when running chrome with
--ui-enable-threaded-compositing on linux desktop
Re: Issue 141178 in chromium: High CPU usage of Browser process in Chrome
Task manager
Re: Issue 169848 in chromium: Blank page is displayed when navigating to
webpages with threaded compositing enabled
Re: Issue 141178 in chromium: High CPU usage of Browser process in Chrome
Task manager
Re: Issue 89945 in chromium: Enable search-by-image in the right-click
context menu
Re: Issue 152893 in chromium: Garbled header and footers on Print output
Re: Issue 169835 in chromium: Header & footer font changes to
unrecognizable characters when printing from Gmail
Re: Issue 170076 in chromium: Scale for masks is wrong
Re: Issue 169868 in chromium: Tab enlarges while closing it, when a lot of
tabs are open.
Re: Issue 160122 in chromium: Mouse wheel scrolls very slowly when set to
page-up/down in Windows
Re: Issue 169654 in chromium: [Daisy] Flash: software blit from YUV420
planar to ARGB is using wrong parameters
Re: Issue 170096 in chromium: Chrome Browser - Copyright year still showing
2012
Re: Issue 170096 in chromium: Chrome Browser - Copyright year still showing
2012
Re: Issue 168018 in chromium: webrtc: video freezes when making call where
both sides use the same private network address
Re: Issue 162663 in chromium: Remove mobile_activator logic to disconnect
network before activation
Issue 170107 in chromium: Extensions are not automatically installed during
the initial sync
Issue 170108 in chromium: Add histogram to ImageLoader to measure disk
latency
Re: Issue 169200 in chromium: pinch zoom is incorrect with the impl-side
painting
Re: Issue 68108 in chromium: provide means to overwrite existing file
instead of appending numbers on downloads
Issue 170109 in chromium: Visual indication that a link will download a file
Re: Issue 140890 in chromium: Windows 8 Active Corners not working
Re: Issue 170085 in chromium: WebKit LayoutTest
platform/chromium/virtual/gpu/fast/canvas/shadow-offset-3.html crashing on
Debug Linux
Re: Issue 170053 in chromium: "IncognitoModeAvailability" expert pref is
ignored when no windows are open
Re: Issue 39531 in chromium: Improper Devanagari Unicode font rendering
Issue 170110 in chromium: Add personal certificate manager to Chromium for
Android
Re: Issue 167659 in chromium: Freezes/Hangs while recording in Timeline
under Dev Tools.
Re: Issue 169773 in chromium: Missing tab when only one tab is open
Re: Issue 169881 in chromium: Regression on giftcards.com
Re: Issue 170108 in chromium: Add histogram to ImageLoader to measure disk
latency
Re: Issue 168950 in chromium: Extended desktop: quickly swapping primary
display causes problems
Re: Issue 169934 in chromium: Extended desktop: Quickly swapping primary
display causes display corruption
Re: Issue 170018 in chromium: weird white box in flash randomly
Re: Issue 166722 in chromium: Extend ChromeDriver to start Chrome on
Android.
Re: Issue 169975 in chromium:
ScrollingCoordinatorChromiumTest.touchOverflowScrolling failing
Re: Issue 169827 in chromium: mbeta.slashdot.org is not scrollable on
Chrome beta
Re: Issue 168390 in chromium: Logging in hangs if there is no network
connectivity
Re: Issue 169934 in chromium: Extended desktop: Quickly swapping primary
display causes display corruption
Re: Issue 169718 in chromium: Disabling and enabling an extension, makes
its button reappear after hiding
Re: Issue 144974 in chromium: Chrome's Flash Player Omits Sprites When
Printing
Issue 170112 in chromium: Divs with a fractional position render
incorrectly in composited mode
Re: Issue 169456 in chromium: Content script extension with all_frames:
true and a refreshing source page leads to massive memory usage
Re: Issue 140890 in chromium: Windows 8 Active Corners not working
Re: Issue 169848 in chromium: Blank page is displayed when navigating to
webpages with threaded compositing enabled
Re: Issue 169881 in chromium: Regression on giftcards.com
Re: Issue 169718 in chromium: Disabling and enabling an extension, makes
its button reappear after hiding
Re: Issue 168802 in chromium: Session terminates when extension's script
closes last open tab
Re: Issue 169848 in chromium: Blank page is displayed when navigating to
webpages with threaded compositing enabled
Re: Issue 169641 in chromium: Virtual Me2Me fails to load /etc/environment
--
Automated mail from issue updates at http://crbug.com/
Subscription options: http://groups.google.com/a/chromium.org/group/chromium-bugs
c***@googlecode.com
2013-01-15 22:26:00 UTC
Permalink
Your project notifications generated too many emails to send
individually. Here are the subject lines of the emails you would have
received:

Re: Issue 169810 in chromium: ClickToPlay tests fail on ARM linux
Re: Issue 133794 in chromium: Page stays at the scrolled position when
switching tabs
Re: Issue 170056 in chromium: 'No more suggestions from Google' message is
not displayed in the Context menu for a wrong Spelled word.
Re: Issue 141379 in chromium: VBR MP4 video won't play, no error message,
should drop down to next available video source when unsupported
Re: Issue 169933 in chromium: New OSX autofill UI causes weird window
behavior and zombie windows.
Re: Issue 134849 in chromium: Make chrome://policy more user-friendly
Re: Issue 168307 in chromium: LocalMediaStream is undefined
Re: Issue 166866 in chromium: zoom/move mouse cursor doesn't go away
Re: Issue 168737 in chromium: Uploading a WebGL-rendered canvas to a
texture only works once
Re: Issue 170147 in chromium: Web Audio decodeAudioData API does not decode
MP3s with null byte at beginning, works fine in <audio> element
Re: Issue 167168 in chromium: relative border-width calculated incorrectly
on page zoom
Re: Issue 134418 in chromium: Implement client certificate support
Re: Issue 167083 in chromium: Chrome CSS3 transition explode bug when form
has three or more input elements
Re: Issue 165772 in chromium: Immersive reveal: Block dragging tabs out
Re: Issue 169967 in chromium: "Remove desktop shortcut" checkbox should
mirror "create desktop shortcut" checkbox
Issue 170165 in chromium: Websocket handshake delay when server is
unavailable
Re: Issue 165346 in chromium: New sign in: "Let me choose what to sync"
checkbox not working
Re: Issue 170035 in chromium: Theverge on mobile user agent has 14ms
updateDrawProperties
Re: Issue 166866 in chromium: zoom/move mouse cursor doesn't go away
Re: Issue 169969 in chromium: Fix LTE display.
Re: Issue 170145 in chromium: System hangs when wrench menu and report an
issue clicked
Re: Issue 170019 in chromium: Dev Tools - Unable to delete all cookies
under Resources panel.
Re: Issue 170145 in chromium: System hangs when wrench menu and report an
issue clicked
Issue 170166 in chromium: Password infobar appears in about:blank page when
signing in 2nd time with "Let me choose what to sync" checkbox.
Re: Issue 170008 in chromium: Print Preview - The text chrome is displayed
as Mirror Image.
Re: Issue 169967 in chromium: "Remove desktop shortcut" checkbox should
mirror "create desktop shortcut" checkbox
Issue 170167 in chromium: Immersive mode: Tie to hardware F4 window button
Re: Issue 169901 in chromium: Angry birds doesn't load for the first time
Re: Issue 169901 in chromium: Angry birds doesn't load for the first time
Re: Issue 169967 in chromium: "Remove desktop shortcut" checkbox should
mirror "create desktop shortcut" checkbox
Re: Issue 167083 in chromium: Chrome CSS3 transition explode bug when form
has three or more input elements
Re: Issue 170145 in chromium: System hangs when wrench menu and report an
issue clicked
Re: Issue 166011 in chromium: Need chromium.webkit archived builds.
Re: Issue 169967 in chromium: "Remove desktop shortcut" checkbox should
mirror "create desktop shortcut" checkbox
Issue 170168 in chromium: Chrome thinks I'm downloading every time I close
it ...
Issue 170169 in chromium: net_unittest flaky sometimes fails to finish
Re: Issue 169969 in chromium: Fix LTE display.
Re: Issue 166100 in chromium: imageSmoothingEnabled frequent, unpredictable
Snaps
Re: Issue 166011 in chromium: Need chromium.webkit archived builds.
Re: Issue 167168 in chromium: relative border-width calculated incorrectly
on page zoom
Re: Issue 170149 in chromium: System dialog doesn't print images
Re: Issue 155099 in chromium: Seeking make additional track showed up
Re: Issue 164395 in chromium: Ninja should suppress ant output
Issue 170170 in chromium: NOTREACHED() at
gpu/command_buffer/service/texture_manager.cc:37
Re: Issue 111316 in chromium: Run layout tests using content_shell
Re: Issue 169933 in chromium: New OSX autofill UI causes weird window
behavior and zombie windows.
Re: Issue 169967 in chromium: "Remove desktop shortcut" checkbox should
mirror "create desktop shortcut" checkbox
Re: Issue 68108 in chromium: provide means to overwrite existing file
instead of appending numbers on downloads
Re: Issue 169933 in chromium: New OSX autofill UI causes weird window
behavior and zombie windows.
Issue 170171 in chromium: Make WebURLLoaderMockFactory play nicely with
WebCore's memory cache
Re: Issue 167168 in chromium: relative border-width calculated incorrectly
on page zoom
Re: Issue 169759 in chromium: 10.8%
gpu-linux-release-nvidia/gpu_throughput/many_images/software change after
rev 176438
Re: Issue 170076 in chromium: Scale for masks is wrong
Issue 170173 in chromium: Need official chrome/android builder
Re: Issue 169967 in chromium: "Remove desktop shortcut" checkbox should
mirror "create desktop shortcut" checkbox
Re: Issue 169902 in chromium: Beta - Unable to select options from wrench
menu on Google Search results page
Re: Issue 162350 in chromium: Implement FakeDriveService
Re: Issue 165330 in chromium: Some git-only repos fail on gclient sync
Issue 170174 in chromium: http://mobile.twitter.com/katyperry spends > 50%
of time painting box shadows
Issue 170175 in chromium: Only inject accessibility script for speech
services
Re: Issue 170174 in chromium: http://mobile.twitter.com/katyperry spends >
50% of time painting box shadows
Re: Issue 167228 in chromium: DragonRise generic USB Gamepad mapped
incorrectly
Re: Issue 141340 in chromium: Wrapping of links inside lists is broken
Re: Issue 170171 in chromium: Make WebURLLoaderMockFactory play nicely with
WebCore's memory cache
Re: Issue 94286 in chromium: line break in lists with sub-lists after
css:before-content
Re: Issue 170126 in chromium: Security: Privacy leak in incognito mode
Re: Issue 94386 in chromium: Google Docs -> Print preview pdf format issues.
Re: Issue 170174 in chromium: http://mobile.twitter.com/katyperry spends >
50% of time painting box shadows
Re: Issue 170169 in chromium: net_unittest flaky sometimes fails to finish
Re: Issue 165330 in chromium: Some git-only repos fail on gclient sync
Re: Issue 167083 in chromium: Chrome CSS3 transition explode bug when form
has three or more input elements
Re: Issue 165330 in chromium: Some git-only repos fail on gclient sync
Re: Issue 54699 in chromium: CSS3 transition not applied for :before
and :after pseudo elements
Issue 170177 in chromium: Test -- ignore.
Re: Issue 170177 in chromium: Test -- ignore.
Re: Issue 169980 in chromium: document scrollTop doesn't advance beyond
~100 on mobile google search
Re: Issue 105778 in chromium: Compile Breakpad support into Chromium by
default for testing purposes
Re: Issue 170076 in chromium: Scale for masks is wrong
Issue 170178 in chromium: Need to request quota from JS prior to NaCl
Re: Issue 160307 in chromium: wrong translation for "Loading..." message in
Getting Started Guide
Re: Issue 170076 in chromium: Scale for masks is wrong
Re: Issue 164437 in chromium: CSS 3D transforms: culled textures cause jank
Re: Issue 94390 in chromium: Google search lost in history
Re: Issue 166891 in chromium: Tab discarder should discard NTP, blank
pages, settings pages first
Issue 170180 in chromium: Crash in
MediaGalleriesPrivateEventRouter::OnRemovableStorageAttached
Issue 170181 in chromium: Inconsistency of when the interstitial page is
shown when signing into gmail.
Re: Issue 170142 in chromium: Missing paint invalidation
Re: Issue 167168 in chromium: relative border-width calculated incorrectly
on page zoom
Re: Issue 165297 in chromium: Mute/Unmute volume(red bar) of video is
broken/overlaps over time
Re: Issue 170182 in chromium: Chrome will devour all the D-Bus match rules,
no matter the limit
Re: Issue 169404 in chromium: Multiple use of
CursorManager::DisableMouseEvents leads to causing the cursor to disapper
Re: Issue 170174 in chromium: http://mobile.twitter.com/katyperry spends >
50% of time painting box shadows
Re: Issue 169967 in chromium: "Remove desktop shortcut" checkbox should
mirror "create desktop shortcut" checkbox
Re: Issue 43459 in chromium: please bind a key to "last tab" for easy
toggling between frequently used tabs
Re: Issue 170142 in chromium: Missing paint invalidation
Re: Issue 170174 in chromium: http://mobile.twitter.com/katyperry spends >
50% of time painting box shadows
Re: Issue 170182 in chromium: Chrome will devour all the D-Bus match rules,
no matter the limit
Re: Issue 169967 in chromium: "Remove desktop shortcut" checkbox should
mirror "create desktop shortcut" checkbox
Re: Issue 166465 in chromium: Add support for SourceBuffer.remove()
Re: Issue 80113 in chromium: Google Chrome window stays on top
--
Automated mail from issue updates at http://crbug.com/
Subscription options: http://groups.google.com/a/chromium.org/group/chromium-bugs
c***@googlecode.com
2013-01-16 01:45:04 UTC
Permalink
Your project notifications generated too many emails to send
individually. Here are the subject lines of the emails you would have
received:

Re: Issue 169402 in chromium: Remove surplus image resources for media
elements
Re: Issue 161054 in chromium: Launch/install a chrome app from a browser
link
Re: Issue 36533 in chromium: Make Backspace-behavior a preference
Re: Issue 168263 in chromium: chrome.extension event listeners in
content/executed scripts should be removed on uninstall
Re: Issue 144832 in chromium: It is time to unlink the "Backspace" ->
Browser Back shortcut.
Re: Issue 164536 in chromium: Sync Server is busy, please try again later
Re: Issue 157035 in chromium: Chrome on Fedora 16 x86_64 hangs trying to
load page
Issue 170245 in chromium: Races in VirtualAudioInputStreamTest
Re: Issue 167560 in chromium: Consider adding local suggest providers:
Shortcuts, Bookmarks, HistoryContent, and ContactProvider (on CrOS)
Re: Issue 167845 in chromium: Video lags at fullscreen
Re: Issue 167751 in chromium: Embedded youtube videos do not work
Re: Issue 167532 in chromium: The Web Audio can not get the audio data
Re: Issue 169468 in chromium: chromium debugger teleports my breakpoints
Re: Issue 141747 in chromium: Choppy Sound
Issue 170246 in chromium: Tables in Wikipedia articles don't display
propery in Chrome for Android.
Re: Issue 156951 in chromium: Device forgets the Language/Keyboard settings
under certain circumstances.
Re: Issue 156951 in chromium: Device forgets the Language/Keyboard settings
under certain circumstances.
Re: Issue 170021 in chromium: drawImage performance degradation based on
source canvas size
Re: Issue 170077 in chromium: Flash video playback doesn't recover after a
gpu process crash
Issue 170247 in chromium: URLRequestTest.DoNotSendCookies is flaky
Re: Issue 167809 in chromium: File Manager: Navigate to Drive > My Photos
after import
Re: Issue 168035 in chromium: File Manager: Navigating gallery for photos
Drive, many thumbnails show up blank
Re: Issue 168038 in chromium: File manager: Inappropriate blue "loading"
cursor shown when an image is loading
Re: Issue 169285 in chromium: --enable-impl-side-painting should imply or
enforce --enable-deferred-image-decoding
Issue 170248 in chromium: Provide SetSocketOptions API for Pepper TCP
sockets, similar to API for UDP sockets
Re: Issue 169152 in chromium: Remove the old NaCl SRPC proxy from Chrome
Re: Issue 170247 in chromium: URLRequestTest.DoNotSendCookies is flaky
Re: Issue 157035 in chromium: Chrome on Fedora 16 x86_64 hangs trying to
load page
10 issues changed in chromium
Re: Issue 164053 in chromium: one vimeo.com html5 video does not play
Re: Issue 169091 in chromium: DHCP lease renewal causes 100% reproducible
video lockup on several sites
Re: Issue 158728 in chromium: Java 7 update 9 is not working with Google
Chrome
Re: Issue 164956 in chromium: Folder picker is confusing when file selected
Re: Issue 156345 in chromium: Flash plug-in continually crashes in Google
Chrome
Re: Issue 170245 in chromium: Races in VirtualAudioInputStreamTest
Re: Issue 112936 in chromium: Input type=”range” does not respond to drags
Re: Issue 138429 in chromium: File Manager: janky delay creating a new
folder and deleting files on Drive
Re: Issue 157177 in chromium: Implement address space limitation on Linux
Re: Issue 170167 in chromium: Immersive mode: Tie to hardware F4 window
button
Re: Issue 170180 in chromium: Crash in
MediaGalleriesPrivateEventRouter::OnRemovableStorageAttached
Re: Issue 170116 in chromium: z-order issues with Webkit scale transform
Re: Issue 138678 in chromium: Chrome locks up all GUI. Can't click on
anything.
Re: Issue 167948 in chromium: Cloud print stops: all printers "offline"
Re: Issue 169181 in chromium: Can't input multi-byte characters into Google
Docs.
Re: Issue 165071 in chromium: Files app window repainting continuously
Re: Issue 136664 in chromium: Need "dirty profile" startup performance test
Re: Issue 170018 in chromium: weird white box in flash randomly
Re: Issue 167809 in chromium: File Manager: Navigate to Drive > My Photos
after import
Re: Issue 169805 in chromium: Resizing webview plugin should not stretch
textures in compositing mode
Re: Issue 170084 in chromium: RenderViewImple::didHandleGestureEvent not
getting called
Re: Issue 165071 in chromium: Files app window repainting continuously
Re: Issue 163439 in chromium: [nexus7] yahoo.com page links are not working
Re: Issue 170243 in chromium: Hosted apps open in Chrome even when I do not
explicitly install Chrome
Re: Issue 170243 in chromium: Hosted apps open in Chrome even when I do not
explicitly install Chrome
Re: Issue 166473 in chromium: "Install Program As Other User" system dialog
pops up when logged back to any user without admin privilages.
Re: Issue 169402 in chromium: Remove surplus image resources for media
elements
Issue 170250 in chromium: [DIAL] Discovery fails if network interfaces are
down
Issue 170249 in chromium: BrowserPluginHostTest.FocusPreservation is flaky
Re: Issue 169969 in chromium: Fix LTE display.
Re: Issue 157313 in chromium: Simplify DriveSyncClient - queuing and
preference monitoring should be handled in DriveScheduler
Re: Issue 163929 in chromium: Port usage of ImageLoadingTracker to
ImageLoader or extensions::IconImage
Re: Issue 168910 in chromium: Tab switch should be blocked when context
menu is visible
Re: Issue 164053 in chromium: one vimeo.com html5 video does not play
Re: Issue 167985 in chromium: ASSERTION FAILED:
enclosingIntRect(rendererMappedResult) ==
enclosingIntRect(FloatQuad(result).boundingBox())
Re: Issue 167989 in chromium: Missing text and images on flightaware.com
Re: Issue 170249 in chromium: BrowserPluginHostTest.FocusPreservation is
flaky
Re: Issue 169327 in chromium: Prevent larger than 2GB allocations, to
mitigate some memory management bugs on 64-bit
Re: Issue 169152 in chromium: Remove the old NaCl SRPC proxy from Chrome
Re: Issue 170249 in chromium: BrowserPluginHostTest.FocusPreservation is
flaky
Re: Issue 164004 in chromium: Tabs occasionally become unresponsive due to
flash
Re: Issue 169327 in chromium: Prevent larger than 2GB allocations, to
mitigate some memory management bugs on 64-bit
Re: Issue 169152 in chromium: Remove the old NaCl SRPC proxy from Chrome
Re: Issue 169848 in chromium: Blank page is displayed when navigating to
webpages with threaded compositing enabled
Re: Issue 169991 in chromium: Type number input spinner not rendering
correctly
Re: Issue 165269 in chromium: random crashes in content side WebGL
conformance tests
Re: Issue 169448 in chromium: net::WebSocketHandshakeResponseHandler should
support header continuations
Re: Issue 170195 in chromium: Make NativeScrollBarViews work for windows
Re: Issue 169971 in chromium: SourceBufferStream::FreeBuffers is still slow.
Re: Issue 165269 in chromium: random crashes in content side WebGL
conformance tests
Re: Issue 152373 in chromium: Backspace key does not navigate backwards in
history
Re: Issue 168117 in chromium: Do not show disambiguation pop up in mobile
sites
Re: Issue 170190 in chromium: content_browser missing dependencies in
static_build mode
Re: Issue 169980 in chromium: document scrollTop doesn't advance beyond
~100 on mobile google search
Re: Issue 165269 in chromium: random crashes in content side WebGL
conformance tests
Re: Issue 170224 in chromium: unable to sort by time from google search on
nexus 7
Re: Issue 169200 in chromium: pinch zoom is incorrect with the impl-side
painting
Re: Issue 170158 in chromium: nytimes.com doesn't load on N10 with
impl-side painting
Re: Issue 170157 in chromium: page stuck after re-enter the app with
impl-side painting flag
Re: Issue 121878 in chromium: Chinese punctuation uncompleted shown in
Chrome18 stable release
Re: Issue 162486 in chromium: iframe scrolling broken
Re: Issue 36533 in chromium: Make Backspace-behavior a preference
Re: Issue 165244 in chromium: Text handler jumps or disappears when moving
Re: Issue 118149 in chromium: Page loads then immediately disappears --
ERROR:gles2_cmd_decoder.cc(4725) in Console
Re: Issue 36533 in chromium: Make Backspace-behavior a preference
Issue 170253 in chromium: Text rendering poorly on colored backgrounds
Re: Issue 166913 in chromium: Crash after showing GTK keyring dialog
Re: Issue 165859 in chromium: [crash] Linux Keyring Cancel
Re: Issue 170157 in chromium: page stuck after re-enter the app with
impl-side painting flag
Re: Issue 170158 in chromium: nytimes.com doesn't load on N10 with
impl-side painting
Issue 170254 in chromium: sync resource file structure between drive and
chromium
--
Automated mail from issue updates at http://crbug.com/
Subscription options: http://groups.google.com/a/chromium.org/group/chromium-bugs
c***@googlecode.com
2013-01-16 18:32:52 UTC
Permalink
Your project notifications generated too many emails to send
individually. Here are the subject lines of the emails you would have
received:

Re: Issue 170266 in chromium: Signing in to Chrome while private browsing
does the same as Regular browsing
Issue 170387 in chromium: Update notification title when device format
completes
Re: Issue 139489 in chromium: Chrome (dev) makes the screen turns blue in
Mountain Lion
Re: Issue 170112 in chromium: Divs with a fractional position render
incorrectly in composited mode
Re: Issue 170163 in chromium: Copy-paste does not work outside brower
Issue 170388 in chromium: Client-Hints needed in chromium
Issue 170389 in chromium: Crash when you insert a SD/USB
Re: Issue 170389 in chromium: Crash when you insert a SD/USB
Re: Issue 167201 in chromium: Scrolling desktop Gmail on Android is broken
Re: Issue 170163 in chromium: Copy-paste does not work outside brower
Re: Issue 169292 in chromium: Pending tree layers unnecessarily delay
creating tilings
Re: Issue 168909 in chromium: hide tap-dragging when no touchpad present
Re: Issue 168909 in chromium: hide tap-dragging when no touchpad present
Re: Issue 170329 in chromium: Changed Font size is not reflecting in search
results pane in immediately opened NTP
Re: Issue 170266 in chromium: Signing in to Chrome while private browsing
does the same as Regular browsing
Re: Issue 169862 in chromium: Allowing Multiple Files to Download
Re: Issue 160122 in chromium: Mouse wheel scrolls very slowly when set to
page-up/down in Windows
Re: Issue 161389 in chromium: Add use_system_mesa gyp switch
Re: Issue 30715 in chromium: Use debugallocation for debug builds.
Re: Issue 117839 in chromium: Query Android Apis to implement
Screen::GetPrimaryMonitorSize
Re: Issue 170282 in chromium: Omnibox not going to Google
Re: Issue 170266 in chromium: Signing in to Chrome while private browsing
does the same as Regular browsing
Re: Issue 169910 in chromium: Flickering /Graphical glitches while opening
newtab
Re: Issue 165326 in chromium: Stream Remove functionality doesn't work if
it's only done on one side
Re: Issue 170116 in chromium: z-order issues with Webkit scale transform
Re: Issue 170382 in chromium: Chrome Aura crash if an app is disabled while
running but refuses to quit
Re: Issue 170198 in chromium: Win Aura: add event reposting for tab
navigation shortcuts when context menu open
Re: Issue 169704 in chromium: bookmarks in bar shortened to ellipsis at
only four letters and a capital, but not at all when all lowercase
Re: Issue 169920 in chromium: Improve matching of v1 applications
Re: Issue 170264 in chromium: Screen covered in white
Re: Issue 170318 in chromium: Unable to perform any action in Webview Tag
Re: Issue 168186 in chromium: Unexpecting error when attaching audio-only
WebRTC stream to <video> tag
Re: Issue 169068 in chromium: Proxy-Auth dialog cancellation on login
screen causes it to hang
Re: Issue 170384 in chromium: Issues with the experimental live-audio
implementation (MediaStreamSource)
Re: Issue 162486 in chromium: iframe scrolling broken
Re: Issue 169123 in chromium: Restoring default theme doesn't persist
Re: Issue 112367 in chromium: getUserMedia() doesn't work for microphone
input
Re: Issue 169343 in chromium: Failed to select an item from Drop down menu
with mouse
Re: Issue 170221 in chromium: Some of Wallpaper can not download in R25 TOT
Re: Issue 148816 in chromium: Enable page-scale-pinch-zoom
Re: Issue 152502 in chromium: Cleanly support non-integer deviceScaleFactor
Re: Issue 169414 in chromium: InstantExtended: Immersive mode is broken
Issue 170390 in chromium: Instant URL tests need to be consolidated
Re: Issue 49882 in chromium: When home page type is set to new tab page,
the home page url is not completely ignored
Re: Issue 169123 in chromium: Restoring default theme doesn't persist
Re: Issue 169065 in chromium: Multiple copies of App: Google and App:
Google Search running
Re: Issue 169520 in chromium: Hang when opening feedback
base::MessagePumpGlib::RunWithDispatcher
Re: Issue 170228 in chromium: Wallpaper selection by scorll down does not
work smoothly on R25 TOT
Re: Issue 170145 in chromium: System hangs when wrench menu and report an
issue clicked
Re: Issue 170384 in chromium: Issues with the experimental live-audio
implementation (MediaStreamSource)
Re: Issue 169618 in chromium: Shockwave flash isn't responding message when
I load Farmville2 game on Facebook.com
Re: Issue 169532 in chromium: White screen when scaling down a large
3d-accelerated element with many children
Re: Issue 169848 in chromium: Blank page is displayed when navigating to
webpages with threaded compositing enabled
Re: Issue 169534 in chromium: Daisy - Shockwave flash crashed from
movie.yahoo.com
Re: Issue 169534 in chromium: Daisy - Shockwave flash crashed from
movie.yahoo.com
Issue 170391 in chromium: no error message on sign-in screen for disabled
users
Re: Issue 169623 in chromium: doritos.com facebook page does not display
fully
Re: Issue 163192 in chromium: Guard query replacement in omnibox with a
regex to catch URL-like things
Re: Issue 169065 in chromium: Multiple copies of App: Google and App:
Google Search running
Re: Issue 170228 in chromium: Wallpaper selection by scorll down does not
work smoothly on R25 TOT
Re: Issue 170221 in chromium: Some of Wallpaper can not download in R25 TOT
Re: Issue 169947 in chromium: When I crash GPU process for youtube html5
video I notice two GPU processes in task manager
Re: Issue 163192 in chromium: Guard query replacement in omnibox with a
regex to catch URL-like things
Re: Issue 156688 in chromium: speech input crashes GCF
Re: Issue 26948 in chromium: Vista BrowserTests OptionPage fails
Re: Issue 115567 in chromium: not detecting GNOME desktop
Re: Issue 170390 in chromium: Instant URL tests need to be consolidated
Re: Issue 170266 in chromium: Signing in to Chrome while private browsing
does the same as Regular browsing
Re: Issue 169330 in chromium: UI hang in MessagePumpGlib::ScheduleWork
Re: Issue 169055 in chromium: Dragging insertion handle doesn't work as
expected
Re: Issue 169899 in chromium: Chrome Crash::1E3DCF2 :: __poll
6a3c280d_437a23aa_83a8a8e3_8af13224_354f1b7d
Re: Issue 128828 in chromium: bookmark manager crashs Google Chrome
Re: Issue 142458 in chromium: Fast Tab Closure
Re: Issue 165244 in chromium: Text handler jumps or disappears when moving
Re: Issue 165244 in chromium: Text handler jumps or disappears when moving
Re: Issue 169704 in chromium: bookmarks in bar shortened to ellipsis at
only four letters and a capital, but not at all when all lowercase
Re: Issue 169993 in chromium: IME Extension should be able to know the key
code of key events.
Re: Issue 169585 in chromium: UI: Searching "Bluetooth" from the Settings
page does not display the Bluetooth connected devices
Re: Issue 169848 in chromium: Blank page is displayed when navigating to
webpages with threaded compositing enabled
Re: Issue 128828 in chromium: bookmark manager crashs Google Chrome
Issue 170392 in chromium: Add UpdateTextInputState() calls to appropriate
places instead of RenderWidget::willBeginCompositorFrame()
Re: Issue 123266 in chromium: API: Other Devices (Tabs)
Issue 170393 in chromium: Enable requestAutoComplete by default on dev
channel
Re: Issue 170187 in chromium: No exponents in calculator app
Re: Issue 170329 in chromium: Changed Font size is not reflecting in search
results pane in immediately opened NTP
Re: Issue 170221 in chromium: Some of Wallpaper can not download in R25 TOT
Re: Issue 115567 in chromium: not detecting GNOME desktop
Re: Issue 170310 in chromium: Sunspider and Dromaeo regressed on Linux
Perf, Mac10.6 Perf integration bots
Re: Issue 170112 in chromium: Divs with a fractional position render
incorrectly in composited mode
Issue 170395 in chromium: Problem with javascript function named remove()
Re: Issue 166011 in chromium: Need chromium.webkit archived builds.
Issue 170396 in chromium: Cut/Copy Line without selection
Re: Issue 169351 in chromium: Print Preview window disappears when clicking
on zoom in/out multiple times
Re: Issue 169330 in chromium: UI hang in MessagePumpGlib::ScheduleWork
Re: Issue 141757 in chromium: Chrome OS UMA boot time statistics are a pack
of lies
Re: Issue 168521 in chromium: Clean up local SyncFileSystem storage and
metadata on uninstall
Re: Issue 147490 in chromium: Chrome copies unselected text to the
clipboard when -webkit-user-select: none; is activated
Re: Issue 157161 in chromium: Rework ConstrainedWindow API
Issue 170397 in chromium: "pixel perfect" autocomplete UI
Re: Issue 170232 in chromium: UI: Server CA Certs and User Certs will not
display in Guest Mode for EAP-TLS networks
--
Automated mail from issue updates at http://crbug.com/
Subscription options: http://groups.google.com/a/chromium.org/group/chromium-bugs
c***@googlecode.com
2013-01-18 19:13:00 UTC
Permalink
Your project notifications generated too many emails to send
individually. Here are the subject lines of the emails you would have
received:

Re: Issue 170790 in chromium: ChromeOS keeps crash when two monitor
starting mirroring on Stumpy device
Re: Issue 128373 in chromium: Scrolling is so slow it's broken
Re: Issue 170254 in chromium: sync resource file structure between drive
and chromium
Re: Issue 170509 in chromium: Difficult to select text using touch
Re: Issue 170901 in chromium: [telemetry] Numerous run_tests failures on
browser=android-content-shell
Re: Issue 115237 in chromium: Touch support for text editing
Re: Issue 144832 in chromium: It is time to unlink the "Backspace" ->
Browser Back shortcut.
Re: Issue 163277 in chromium: Infinite spinner appears after Sign out
Issue 170945 in chromium: Add whitelist support for autocheckout.
Re: Issue 168341 in chromium: Chrome Office Viewer fails to open files
with "%" in the file name.
Re: Issue 160278 in chromium: Cloudglobe demo doesn't work
Re: Issue 170755 in chromium: gray should not be used for both search
completions and url paths
Issue 170947 in chromium: Chrome sometimes gets stuck searching for URLs
instead of navigating to them
Re: Issue 170936 in chromium: Incognito extensions don't set focus on newly
opened tabs in the default profile
Re: Issue 170540 in chromium: chrome crashes when bluetooth paring dialog
is closed
Re: Issue 130698 in chromium: Update bluetooth behavior in the ubertray
Re: Issue 170768 in chromium: DCHECK fails in
PictureLayerTiling::Iterator::texture_rect() during pinch zoom
Re: Issue 170755 in chromium: gray should not be used for both search
completions and url paths
Re: Issue 167578 in chromium: [Windows 8] Page assets are not loading
sometimes - pages are broken at random moments
Re: Issue 170672 in chromium: Build libvpx in win64
Re: Issue 170750 in chromium: Enable win64 yasm for ffmpegsumo and media
targets
Re: Issue 170792 in chromium: Can't have conditional arms be only DCHECKs
without using {}
Issue 170949 in chromium: Falla de la webpage se congela y no funciona
Issue 170948 in chromium: Remove unneeded chrome switches
Re: Issue 158170 in chromium: Chrome_Mac: Crash Report - Stack
Signature: HALPropertyListener_Call_Helper(long, void*...
Re: Issue 160278 in chromium: Cloudglobe demo doesn't work
Issue 170950 in chromium: Nested search results not boosted by Text Scaling
Re: Issue 163972 in chromium: PDF page rendering incomplete/partial.
Missing text, graphics, images.
Re: Issue 160584 in chromium: PDF file rendered partially since
23.0.1271.64 update
Re: Issue 160584 in chromium: PDF file rendered partially since
23.0.1271.64 update
Re: Issue 170873 in chromium: Google Chrome is slow to load and display
content while World of Warcraft is running and logged
Re: Issue 170863 in chromium: Blue colored focus line thickness is not
proper in Find search box
Re: Issue 169204 in chromium: URL hijacking broken in Android Chrome Beta
Re: Issue 160278 in chromium: Cloudglobe demo doesn't work
Re: Issue 170254 in chromium: sync resource file structure between drive
and chromium
Re: Issue 144832 in chromium: It is time to unlink the "Backspace" ->
Browser Back shortcut.
Re: Issue 160025 in chromium: Clicked links are not being marked as 'Read'
during Navigation
Re: Issue 170947 in chromium: Chrome sometimes gets stuck searching for
URLs instead of navigating to them
Re: Issue 170947 in chromium: Chrome sometimes gets stuck searching for
URLs instead of navigating to them
Re: Issue 160927 in chromium: Time subsystem load for long startups
Re: Issue 169779 in chromium: Style applied to menu not working (display
none and block)
Re: Issue 170948 in chromium: Remove unneeded chrome switches
Re: Issue 169400 in chromium: It is not possible to tap to open a gmail
chat with someone with a URL status
Re: Issue 170635 in chromium: Regression: DCHECK during startup,
StatisticsProvider used before initialization
Re: Issue 170901 in chromium: [telemetry] Numerous run_tests failures on
browser=android-content-shell
Re: Issue 170901 in chromium: [telemetry] Numerous run_tests failures on
browser=android-content-shell
Re: Issue 164600 in chromium: Incognito suggestion string in Clear Browsing
Data dialog
Re: Issue 170635 in chromium: Regression: DCHECK during startup,
StatisticsProvider used before initialization
Re: Issue 167028 in chromium: Double tap doesn't fit column any more
Re: Issue 169416 in chromium: sandbox_linux_unittests are flaky on the main
waterfall on Android
Re: Issue 158982 in chromium: Media Gallery API shows unrequested
permissions on the dialog
Re: Issue 167263 in chromium: getUserMedia infobar cannot be reinvoked once
user has selected "Deny"
Re: Issue 168736 in chromium: Chrome OS Google Drive stops syncing.
Re: Issue 170079 in chromium: Chrome_Android: Crash Report - Stack
Signature: WebKit::SpeechRecognitionClientProxy::start...
Re: Issue 170948 in chromium: Remove unneeded chrome switches
Re: Issue 154149 in chromium: Move extension blacklist to Safe Browsing
infrastructure
Re: Issue 167578 in chromium: [Windows 8] Page assets are not loading
sometimes - pages are broken at random moments
Re: Issue 164154 in chromium: Allow Android renderer processes to access
CPU features.
Re: Issue 147593 in chromium: Renderer hanging due to interaction with
plugins
Re: Issue 160025 in chromium: Clicked links are not being marked as 'Read'
during Navigation
Re: Issue 170725 in chromium: Sync could not be finish
Re: Issue 169866 in chromium: Cleanup: remove
third_party/re2/patches/msvc-x64.patch
Re: Issue 170942 in chromium: Radius on buttons is wrong on HDPI
Re: Issue 170290 in chromium: http://fff.cmiscm.com/ doesn't work
Re: Issue 170290 in chromium: http://fff.cmiscm.com/ doesn't work with
mouse when touch is supported
Re: Issue 170792 in chromium: Can't have conditional arms be only DCHECKs
without using {}
Re: Issue 161057 in chromium: Kiosk: ChromeOS Demo App hangs when
navigating using the Arrow Keys
Re: Issue 169654 in chromium: [Daisy] Flash: software blit from YUV420
planar to ARGB is using wrong parameters
Issue 170953 in chromium: Can't scroll in trix
Re: Issue 170953 in chromium: Can't scroll in trix
Re: Issue 169124 in chromium: Display settings: "Start Mirroring" button
shouldn't be enabled under single monitor mode
Re: Issue 170881 in chromium: Resolve how to handle native NTP menus with
many items on Mac
Re: Issue 167198 in chromium: -webkit-transform: scaleY(-1) centered off by
one
Re: Issue 170635 in chromium: Regression: DCHECK during startup,
StatisticsProvider used before initialization
Re: Issue 169056 in chromium: Notification bubble message is rendered badly
when no notification is avaialble on Linux
Re: Issue 170079 in chromium: Chrome_Android: Crash Report - Stack
Signature: WebKit::SpeechRecognitionClientProxy::start...
Re: Issue 170635 in chromium: Regression: DCHECK during startup,
StatisticsProvider used before initialization
Re: Issue 170079 in chromium: Chrome_Android: Crash Report - Stack
Signature: WebKit::SpeechRecognitionClientProxy::start...
Re: Issue 168858 in chromium: Should support full keyboard access to
Toolbar on Mac
Re: Issue 170705 in chromium: Expect drag to change tap ordering when there
is nothing to scroll
Re: Issue 170792 in chromium: Can't have conditional arms be only DCHECKs
without using {}
Re: Issue 160025 in chromium: Clicked links are not being marked as 'Read'
during Navigation
Re: Issue 170881 in chromium: Resolve how to handle native NTP menus with
many items on Mac
Re: Issue 116435 in chromium: PulseAudio sometimes issues audio callbacks
too quickly, leading to sped up audio in flash and html5.
Re: Issue 170947 in chromium: Chrome sometimes gets stuck searching for
URLs instead of navigating to them
Issue 170955 in chromium: Receive 20 notifications for Google Slides after
login
Re: Issue 170755 in chromium: gray should not be used for both search
completions and url paths
Re: Issue 170858 in chromium: Second right-click on a Bookmark page/folder
is not highlighted properly.
Re: Issue 170947 in chromium: Chrome sometimes gets stuck searching for
URLs instead of navigating to them
Re: Issue 152207 in chromium: System suspend should be deferred while
uploading large files
Re: Issue 170627 in chromium: Youtube videos are covered with random
colored dots
Re: Issue 158170 in chromium: Chrome_Mac: Crash Report - Stack
Signature: HALPropertyListener_Call_Helper(long, void*...
Re: Issue 162111 in chromium: Impl-side painting-friendly animation
controller
Re: Issue 170947 in chromium: Chrome sometimes gets stuck searching for
URLs instead of navigating to them
Re: Issue 157218 in chromium: css transform and transition break hidden
overflow on border-radius
Re: Issue 170755 in chromium: gray should not be used for both search
completions and url paths
Re: Issue 169626 in chromium: Provide a way for Apps to plug-in to OS
autoplay dialog
Re: Issue 116435 in chromium: PulseAudio sometimes issues audio callbacks
too quickly, leading to sped up audio in flash and html5.
Re: Issue 133742 in chromium: ssltcp connections not support by
IpcPacketSocketFactory
Re: Issue 170321 in chromium: Flickering is observed on going fullscreen
for any app in LINUX
--
Automated mail from issue updates at http://crbug.com/
Subscription options: http://groups.google.com/a/chromium.org/group/chromium-bugs
c***@googlecode.com
2013-01-18 22:54:02 UTC
Permalink
Your project notifications generated too many emails to send
individually. Here are the subject lines of the emails you would have
received:

Re: Issue 169239 in chromium: Mosaic button is missing in the Photo Editor
Re: Issue 164665 in chromium: Hung webpage dialog should have option to
abort in progress sync XHRs
Re: Issue 170986 in chromium: Angry Birds tab crashes when game completes
loading on Intel 945 Chipset.
Re: Issue 114369 in chromium: Mysterious hangs in chrome_frame_net_tests
Re: Issue 128620 in chromium: Connect DNS signals to re-fetching PAC script
Re: Issue 170999 in chromium: Mouse becomes inactive when starting to play
paid-content on YouTube.
Issue 171020 in chromium: New window creation on any space not originally
used to open Chrome causes focus to shift to Chrome's original creation
space.
Re: Issue 114277 in chromium: HostCache of size 100 fills up very quickly
with DnsTransaction
Re: Issue 155262 in chromium: Cannot seek through audio and video HLS
streams using <video> or <audio> tags on Chrome 18 on Android 4.1
Re: Issue 169921 in chromium: Fixed-pos elements with new-style page scale
Re: Issue 169923 in chromium: Right-side taps have no effect with new-style
page scale
Re: Issue 154861 in chromium: Sync Video Test Fails
Re: Issue 170811 in chromium: Snowstack renders incorrectly
Re: Issue 154876 in chromium: srclang="ar" track showed up when
srclang="en" track is expected
Re: Issue 155684 in chromium: At the beginning playback blinks for the
moment ogv Html5
Re: Issue 163045 in chromium: System tray menu missing lower right area is
rendered when full screen magnifier is enabled
Re: Issue 167268 in chromium: assertion hit in udev_linux when running to
content_shells in debug mode
Re: Issue 170845 in chromium: accessing large indexeddb (total memory size)
leads to a crash.
Re: Issue 170713 in chromium: Regression in 3D transform rendering.
Re: Issue 170937 in chromium: Popup arrow placement for volume and
brightness seems random.
Re: Issue 170858 in chromium: Second right-click on a Bookmark page/folder
is not highlighted properly.
Re: Issue 167399 in chromium: "Report an issue" does not have "Shift+Alt+i"
annotation
Issue 171022 in chromium: Flash hangs after running multiple videos for 1
hour
Re: Issue 170964 in chromium: Incorrect text clipping near tile boundaries
Re: Issue 151279 in chromium: Captive portal during sign-in -> "hung"
sign-in process
Re: Issue 170986 in chromium: Angry Birds tab crashes when game completes
loading on Intel 945 Chipset.
Re: Issue 150940 in chromium: The first track gets rendered twice when two
non-defaults tracks added to a video element
Re: Issue 167624 in chromium: When connecting to EAP networks in guest
mode, Chrome gets stuck loading nonexistent certificates.
Re: Issue 169248 in chromium: Usernames/passwords don't autofill on log-in
screens
Re: Issue 111101 in chromium: Replace all PDF / vector drawing with bitmaps
and 2x bitmaps
Re: Issue 169416 in chromium: sandbox_linux_unittests are flaky on the main
waterfall on Android
Re: Issue 169421 in chromium: "Aw Snap" on every page
Re: Issue 166233 in chromium: Cannot submit comments on facebook posts or
pictures
Re: Issue 169454 in chromium: chromium 24.0.1312.52 fails test
YUVConvertTest.YV12
Re: Issue 158462 in chromium: YUV->RGB conversions incorrectly offset,
incorrectly scaling UV planes
Issue 171023 in chromium: NTP5: Selecting "Paste" or "Paste as plain text"
from context menu will make Google image & Search engine text box disappear
Re: Issue 171022 in chromium: Flash hangs after running multiple videos for
1 hour
Re: Issue 160584 in chromium: PDF file rendered partially since
23.0.1271.64 update
Issue 171024 in chromium: Mini Ninjas displays a black page after loading
completion.
Re: Issue 169510 in chromium: Corrupt large file downloads
Re: Issue 149185 in chromium: IME candidate window sometimes has a small
gap between the window itself and focus area
Re: Issue 170407 in chromium: H.264 Video do not play in Chrome HTML5 player
Re: Issue 171023 in chromium: NTP5: Selecting "Paste" or "Paste as plain
text" from context menu will make Google image & Search engine text box
disappear
Re: Issue 164784 in chromium: Pasting into fakebox via context-menu or
dragging text doesn't work
Re: Issue 171003 in chromium: impl-side painting caused memory "leak" in
the renderer process
Re: Issue 169516 in chromium: translate to English is grayed out
Re: Issue 156675 in chromium: HistoryURL under scoring preferred choice
Re: Issue 169645 in chromium: Chrome Crashes/Stalls/Times-out
Re: Issue 153383 in chromium: Pepper Flash sometimes gets blocked waiting
for file operations on the browser file thread.
Re: Issue 171022 in chromium: Flash hangs after running multiple videos for
1 hour
Re: Issue 169652 in chromium: chrome not working without explorer.exe
running (or with alternate shells)
Re: Issue 170799 in chromium: declarativeWebRequest API docs should
distinguish Conditions and Actions from other types
Issue 171025 in chromium: Implement DomainState.Equals
Re: Issue 170605 in chromium: GWT RequestFactory doesn't return when
launching request after receieving an HTML5 postMessage from an IFRAME on a
different domain
Issue 171026 in chromium: Log messages are missing on OS X
Re: Issue 170760 in chromium: Window.close() should indicate failure
Issue 171027 in chromium: Web pages not rendered on Windows 8 without NewUI
Re: Issue 171022 in chromium: Flash hangs after running multiple videos for
1 hour
Re: Issue 170757 in chromium: "Open link in new tab" should not allow
window.close()
Re: Issue 169700 in chromium: Windows 8 - Software Update on 2013-01-12
HTML5 Video (mp4/h264) Crashes with MEDIA_ERR_DECODE
Re: Issue 170658 in chromium: When install an extension externally,
the 'new extension added' message in settings cannot recognize ampersand,
either encoded or not
Re: Issue 169719 in chromium: Chrome crashed
Re: Issue 169248 in chromium: Usernames/passwords don't autofill on log-in
screens
Re: Issue 149893 in chromium: Audio distorted and stops when played in
Youtube
Re: Issue 169700 in chromium: Windows 8 - Software Update on 2013-01-12
HTML5 Video (mp4/h264) Crashes with MEDIA_ERR_DECODE
Re: Issue 169744 in chromium: GMail timezone funkiness when switching mac
os x timezone
Re: Issue 170550 in chromium: Full screen Chrome Apps should be able to
dictate the window orientation
Re: Issue 169749 in chromium: Changing the search engine to a custom one
disables search suggestions in omnibar.
Re: Issue 171022 in chromium: Flash hangs after running multiple videos for
1 hour
Re: Issue 169756 in chromium: Chrome crashing at startup on OSX Lion
Re: Issue 170507 in chromium: Stand-alone App Launcher creates Chrome
shortcut if "User Data" directory missing (e.g., on first run)
Re: Issue 163045 in chromium: System tray menu missing lower right area is
rendered when full screen magnifier is enabled
Issue 171029 in chromium: [daisy] Facebook Farmville2 rendering problem:
objects not rendered
Re: Issue 163700 in chromium: Official Google Voice extension crashes with
Chrome 25
Issue 171030 in chromium: Task Manager: Unable to scroll scroolbar using
logitech mouse
Re: Issue 169653 in chromium: error 128 occurs each time i try to download
google chrome
Re: Issue 111541 in chromium: Remove all use of <(library)
Re: Issue 171029 in chromium: [daisy] Facebook Farmville2 rendering
problem: objects not rendered
Re: Issue 170646 in chromium: Tray icon: mute status icon doesn't look right
Re: Issue 171029 in chromium: [daisy] Facebook Farmville2 rendering
problem: objects not rendered
Re: Issue 171029 in chromium: [daisy] Facebook Farmville2 rendering
problem: objects not rendered
Re: Issue 170164 in chromium: Feature Request: an indicator on the scroll
bar that shows when an article ends and comments begin
Re: Issue 157528 in chromium: Sudden Crashes on Keyboard Input and File
Download
Re: Issue 170337 in chromium: Packaging an extension at the command line
doesn't work
Re: Issue 171022 in chromium: Flash hangs after running multiple videos for
1 hour
Issue 171034 in chromium: clickElement will throw error if it triggers an
alert
Re: Issue 169749 in chromium: Changing the search engine to a custom one
disables search suggestions in omnibar.
Re: Issue 168171 in chromium: Minimize with per-application window sorting
Re: Issue 155152 in chromium: predictions and instant search doesnt works
Re: Issue 167083 in chromium: Chrome CSS3 transition explode bug when form
has three or more input elements
Re: Issue 128620 in chromium: Connect DNS signals to re-fetching PAC script
Re: Issue 170435 in chromium: Ftp can't understand error
Issue 171035 in chromium: Automatically create a profiler snapshot when
--trace-startup is specified
Re: Issue 170550 in chromium: Full screen Chrome Apps should be able to
dictate the window orientation
Re: Issue 170646 in chromium: Tray icon: mute status icon doesn't look right
Re: Issue 170524 in chromium: Chromebook Wifi keeps disconnecting
Re: Issue 170524 in chromium: Chromebook Wifi keeps disconnecting
Re: Issue 170489 in chromium: webview control for extensions
Issue 171036 in chromium: Output XML file from profiler information on
server
Re: Issue 171036 in chromium: Output XML file from profiler information on
server
--
Automated mail from issue updates at http://crbug.com/
Subscription options: http://groups.google.com/a/chromium.org/group/chromium-bugs
c***@googlecode.com
2013-01-22 19:18:41 UTC
Permalink
Your project notifications generated too many emails to send
individually. Here are the subject lines of the emails you would have
received:

Re: Issue 169999 in chromium: OAuth2 flow migration
Re: Issue 112222 in chromium: WebInputEvent needs native event on win
Re: Issue 171351 in chromium: [meta] Replace native IBus engines with
extension IMEs on Chrome OS
Re: Issue 170332 in chromium: CrOS Heapcheck bot reports a leak in
PasswordStore::GetLogins
Re: Issue 166662 in chromium: Start screen is magnified after recent R25
update
Re: Issue 171404 in chromium: Hang when enabling/disabling extensions
Re: Issue 168297 in chromium: Visual hitch during initial login animation;
user pod appears above white background
Re: Issue 169170 in chromium: Allow WebUI pages to be implemented outside
of src/chrome
19 issues changed in chromium
Re: Issue 168562 in chromium: Ability to rotate monitors
Re: Issue 171001 in chromium: Occasionally when switching tabs, the wrong
tab contents will be briefly displayed.
Re: Issue 21395 in chromium: Warm a renderer up early during the startup
process
Re: Issue 171142 in chromium: Support Microsoft Visual Studio Express 2012
Re: Issue 125670 in chromium: Change DIP to use floating point
Re: Issue 125756 in chromium: improve resource management performance for
high dpi
Re: Issue 171457 in chromium: V8 static initialization from the browser
process
Re: Issue 139224 in chromium: May need to notify the change to the window
screen position when the display layout changes.
Issue 171459 in chromium: Add UMAs tarcking
ContentMainDelegate/ContentMainParts
Re: Issue 171458 in chromium: No mousewheel events sent for IRCCloud, can
enable with addEventListener
Issue 171460 in chromium: potential infinite loop with remove() method.
Re: Issue 171108 in chromium: Omnibox DCHECK when backspace out of keyword
mode with search text remaining
Re: Issue 141351 in chromium: Unload 2x/1x resources when it becomes
unnecessary
Re: Issue 171205 in chromium: Debug chromeos_linux crashed if the UI
language is set to hebrew.
Re: Issue 170023 in chromium: Chrome won't connect on TLS with client
certificate required to IIS 7.5 and IIS 8
Re: Issue 171104 in chromium: Omnibox DCHECK IsTopMatchNotInlinable In
Keyword Mode
Re: Issue 125641 in chromium: IndexedDB transactions not always persisted
Re: Issue 145623 in chromium: Sporadic dchedck failure in ImageSkia that I
added in r153756 in win_rel bot
Re: Issue 165671 in chromium: KeyTests are failing in linux bots after
webkit roll 137425 in r172605
Re: Issue 171404 in chromium: Hang when enabling/disabling extensions
Re: Issue 171460 in chromium: potential infinite loop with remove() method.
Re: Issue 149618 in chromium: image file cleanup
Re: Issue 171108 in chromium: Omnibox DCHECK when backspace out of keyword
mode with search text remaining
Re: Issue 157660 in chromium: System modal dialogs in the lock screen
should be closed when unlocked
Re: Issue 169416 in chromium: sandbox_linux_unittests are flaky on the main
waterfall on Android
Re: Issue 159102 in chromium: left/right maximized window should stay
as "left/right" maximized even when the display configuration has changed.
Re: Issue 89687 in chromium: Allow optional bypass of the NTP UI after app
install from the web store
Re: Issue 153121 in chromium: IDB: make IDBUpgradeNeededEvent.oldVersion
return a string if the old version was a string
Re: Issue 161066 in chromium: database connections don't close after
versionchange transaction aborts
Re: Issue 92049 in chromium: IndexedDB: Implement the async API.
Re: Issue 153122 in chromium: Fire IDBUpgradeNeededEvent at open databases
when deleteDatabase is called
Re: Issue 158943 in chromium: Omnibox: Disable Field Trial for HUP->HQP
Scoring Move in M-25
Re: Issue 168066 in chromium: Omnibox: Disable Field Trial for HQP New
Scoring in M-25
Re: Issue 168079 in chromium: Omnibox: Disable Mid-Word Match Field Trial
for HistoryQuick Provider in M-25
Re: Issue 159102 in chromium: left/right maximized window should stay
as "left/right" maximized even when the display configuration has changed.
Issue 171463 in chromium: The reopen last closed tab command from the
tabstrip context menu doesn't honor the <Ctrl> modifier.
Re: Issue 171442 in chromium: Crash in
OAuth2AccessTokenFetcher::StartGetAccessToken
Re: Issue 166664 in chromium: Recent tabs menu should open Ctrl+click'ed
items in new tab and not change context
Re: Issue 160769 in chromium: make scale factor a class
Re: Issue 169913 in chromium: Double-tap zoom with new-style page scale
Re: Issue 171104 in chromium: Omnibox DCHECK IsTopMatchNotInlinable In
Keyword Mode
Re: Issue 170727 in chromium: Question mark followed by space in omnibox
triggers DCHECK
Re: Issue 170012 in chromium: Text-box focus zoom with new-style page scale
Re: Issue 169916 in chromium: Tap disambiguation with new-style page scale
Re: Issue 169171 in chromium: Sometimes screen content doesn't update with
impl-side painting
Re: Issue 145185 in chromium: Ctrl-v for search provider on omnibox
causes "Check failed"
Issue 171464 in chromium: Session restore shows all the same tab.
Issue 171465 in chromium: Reenable
TwoClientBookmarksSyncTest.DISABLED_SC_SetFaviconHiDPI
Issue 171466 in chromium: Report tests not ran as unknown at the TestRunner
layer
Re: Issue 148764 in chromium: Audio/video clicks when skipping back/forward
Issue 171467 in chromium: No way in timeline to tell if the page is
impl-side scrolling
Re: Issue 163242 in chromium: Displays shouldn't be disconnected for
power-off
Re: Issue 167748 in chromium: Translation bar doesn't show up
for "people.com.cn"
Re: Issue 171113 in chromium: Using FindInPage freezes tab
Re: Issue 157218 in chromium: css transform and transition break hidden
overflow on border-radius
Re: Issue 171466 in chromium: Report tests not ran as unknown at the
TestRunner layer
Re: Issue 171046 in chromium: List of timed out test doesn't print on
Android's run_tests.py (test_result.py in LogFull)
Re: Issue 171172 in chromium: WebGL conformance
canvas/drawingbuffer-test.html fails
Re: Issue 170450 in chromium: There is no "Restore your tabs..." infobar
when restoring Chrome in Ash post-crash.
Re: Issue 156398 in chromium: Add telemetry run_tests to the build waterfall
Re: Issue 171018 in chromium: Casting Error in Chrome Frame Automation for
Win Aura builds
Issue 171469 in chromium: multi-display status message in the system tray
for stumpy
Re: Issue 164342 in chromium: Ash ExtendedDesktop: full screen video
unexpectedly exits when the other root window is clicked
Re: Issue 171072 in chromium: Make the D-Bus thread identifiable in crash
pages
Re: Issue 154979 in chromium: Hiding mouse cursor by keyevents shouldn't
clear the hover status
Re: Issue 171076 in chromium: Aura injects a "mouseleave" event at
(-10000,-10000) following the first "keydown" event after a mouse movement
Re: Issue 170994 in chromium: Google Maps with MapGL enabled occasionally
displays graphical corruption.
Re: Issue 170994 in chromium: Google Maps with MapGL enabled occasionally
displays graphical corruption.
Re: Issue 170395 in chromium: Problem with javascript function named
remove()
Re: Issue 171452 in chromium: Infinite loop signing in again while 'setting
up' after changing Google password with 2 factor authentication
Re: Issue 171104 in chromium: Omnibox DCHECK IsTopMatchNotInlinable In
Keyword Mode
Re: Issue 166100 in chromium: imageSmoothingEnabled frequent, unpredictable
Snaps
Re: Issue 170007 in chromium: CSS not behaving the same as stable release.
3 center boxes should be lined up horizontally. In the beta release they're
not. Stable Chrome is ok.
Re: Issue 167238 in chromium: Releasing middle button does not stop auto
scroll
Re: Issue 171466 in chromium: Report tests not ran as unknown at the
TestRunner layer
Re: Issue 170870 in chromium: Page info doesn't work on Captive Portal
Dialog (crashes)
Re: Issue 170645 in chromium: select background-color rgba no longer acting
the same
Re: Issue 166233 in chromium: Cannot submit comments on facebook posts or
pictures
Re: Issue 170319 in chromium: Images in Files.app's grid view should fill a
box when aspect ratio is close to 3:2.
Re: Issue 170315 in chromium: CSS img max-height property creates an
unexpected horizontal scrollbar
Re: Issue 167399 in chromium: "Report an issue" does not have "Shift+Alt+i"
annotation
Issue 171472 in chromium: dropEvent not being called when page loaded via
object tag
Re: Issue 167399 in chromium: "Report an issue" does not have "Shift+Alt+i"
annotation
Re: Issue 170904 in chromium: Posting tasks recursively causes the UI
thread to hang
Re: Issue 170180 in chromium: Crash in
MediaGalleriesPrivateEventRouter::OnRemovableStorageAttached
Re: Issue 171117 in chromium: Wacko rendering of folder names in bookmarks
bar
Re: Issue 171416 in chromium: WebKit: [regression] crash at Console.cpp:216
(use of RefPtr after release to PassRefPtr) (edit)
Re: Issue 171374 in chromium: Clicked links in Normal Session are marked as
read in Incognito as well
Re: Issue 169999 in chromium: OAuth2 flow migration
Re: Issue 167869 in chromium:
gpu/command_buffer/client/gles2_implementation.cc(758):
GPU_CHECK(context_lost (0)) failed.
Re: Issue 171029 in chromium: [daisy] Facebook Farmville2 rendering
problem: objects not rendered
--
Automated mail from issue updates at http://crbug.com/
Subscription options: http://groups.google.com/a/chromium.org/group/chromium-bugs
Continue reading on narkive:
Loading...